[dpdk-test-report] |FAILURE| pw63857[v3, 4/4] test/crypto: refactor unit tests into one combined array

sys_stv at intel.com sys_stv at intel.com
Fri Dec 13 17:50:52 CET 2019


Test-Label: Intel-compilation
Test-Status: FAILURE
http://dpdk.org/patch/63857

_Compilation issues_

Submitter: Adam Dybkowski <adamx.dybkowski at intel.com>
Date: 2019-12-13 15:22:44
Reply_mail: 20191213152245.13477-5-adamx.dybkowski at intel.com
DPDK git baseline: Repo:dpdk-next-crypto, CommitID: aef1d0733179afb56916e95058a4f1398b81af04

Makefile build Summary: 22 Builds Done, 21 Successful, 1 Failures

Meson build Summary: 8 Builds Done, 2 Successful, 6 Failures

               +==============================================+===========+==========+
               |                   Makefile                   |   Meson   | Document |
+----------------+------+-------+------+------------+-----------+-----------+----------+
| os             | gcc  | clang | icc  | gcc+shared | gcc+debug | gcc/clang | pdf/html |
+----------------+------+-------+------+------------+-----------+-----------+----------+
| UB1804-64      | pass | pass  | pass |            |           | FAIL      | pass     |
| UB1604-32      | pass |       |      |            |           | FAIL      |          |
| CENTOS77-64    | pass | pass  | pass | pass       | pass      | FAIL      |          |
| UB1604-64      | pass | pass  |      |            |           |           |          |
| FC30-64        | FAIL |       |      |            |           |           |          |
| WIN10-64       |      |       |      |            |           | pass      |          |
| UB1910-64      | pass |       |      |            |           |           |          |
| FC31-64        | pass | pass  |      |            |           | FAIL      |          |
| RHEL80-64      | pass |       |      |            |           |           |          |
| FreeBSD1201-64 | pass | FAIL  |      | pass       | pass      | FAIL      |          |
| RHEL77-64      | pass |       |      |            |           |           |          |
| SUSE15-64      | pass | pass  |      |            |           | FAIL      |          |
+----------------+------+-------+------+------------+-----------+-----------+----------+

Test environment and configuration as below:

** Makefile build **


OS: UB1804-64
	Kernel Version: 4.15.0-20-generic
	CPU info: Intel(R) Xeon(R) CPU E5-2699 v3 @ 2.30GHz
	GCC Version: gcc (Ubuntu 7.3.0-16ubuntu3) 7.3.0
	Clang Version: 6.0.0-1ubuntu2 (tags/RELEASE_600/final)
	x86_64-native-linuxapp-clang
	x86_64-native-linuxapp-icc
	x86_64-native-linuxapp-gcc


OS: UB1604-32
	Kernel Version: 4.4.0-131-generic
	CPU info: Intel(R) Xeon(R) CPU E5-2699 v3 @ 2.30GHz
	GCC Version: gcc (Ubuntu 5.4.0-6ubuntu1~16.04.11) 5.4.0 20160609
	Clang Version: 3.8.0-2ubuntu4 (tags/RELEASE_380/final)
	i686-native-linuxapp-gcc


OS: CENTOS77-64
	Kernel Version: 3.10.0-1062.9.1.el7.x86_64
	CPU info: Intel(R) Xeon(R) CPU E5-2699 v4 @ 2.20GHz
	GCC Version: gcc (GCC) 4.8.5 20150623 (Red Hat 4.8.5-39)
	Clang Version: 3.4.2 (tags/RELEASE_34/dot2-final)
	x86_64-native-linuxapp-gcc+shared
	x86_64-native-linuxapp-gcc
	x86_64-native-linuxapp-gcc+debug
	x86_64-native-linuxapp-clang
	x86_64-native-linuxapp-icc


OS: UB1910-64
	Kernel Version: 5.3.0-18-generic
	CPU info: Intel(R) Xeon(R) CPU E5-2699 v3 @ 2.30GHz
	GCC Version: gcc (Ubuntu 9.2.1-9ubuntu2) 9.2.1 20191008
	Clang Version: 9.0.0-2 (tags/RELEASE_900/final)
	x86_64-native-linuxapp-gcc


OS: UB1604-64
	Kernel Version: 4.4.0-47-generic
	CPU info: Intel(R) Xeon(R) CPU E5-2699 v3 @ 2.30GHz
	GCC Version: gcc (Ubuntu 5.4.0-6ubuntu1~16.04.12) 5.4.0 20160609
	Clang Version: 3.8.0-2ubuntu4 (tags/RELEASE_380/final)
	x86_64-native-linuxapp-clang
	x86_64-native-linuxapp-gcc


OS: FC31-64
	Kernel Version: 5.3.14-300.fc31.x86_64
	CPU info: Intel(R) Xeon(R) CPU E5-2699 v4 @ 2.20GHz
	GCC Version: gcc (GCC) 9.2.1 20190827 (Red Hat 9.2.1-1)
	Clang Version: 9.0.0 (Fedora 9.0.0-1.fc31)
	x86_64-native-linuxapp-gcc
	x86_64-native-linuxapp-clang


OS: RHEL80-64
	Kernel Version: 4.18.0-80.el8.x86_64
	CPU info: Intel(R) Xeon(R) CPU E5-2699 v4 @ 2.20GHz
	GCC Version: gcc (GCC) 8.2.1 20180905 (Red Hat 8.2.1-3)
	Clang Version: 6.0.1 (tags/RELEASE_601/final)
	x86_64-native-linuxapp-gcc


OS: FreeBSD1201-64
	Kernel Version: 12.1-RELEASE
	CPU info: Intel(R) Xeon(R) CPU E5-2699 v4 @ 2.20GHz (2194.98-MHz K8-class CPU)
	GCC Version: gcc (FreeBSD Ports Collection) 9.2.0
	Clang Version: 8.0.1 (tags/RELEASE_801/final 366581) (based on LLVM 8.0.1)
	x86_64-native-bsdapp-clang
	x86_64-native-bsdapp-gcc+debug
	x86_64-native-bsdapp-gcc+shared
	x86_64-native-bsdapp-gcc


OS: RHEL77-64
	Kernel Version: 3.10.0-1062.9.1.el7.x86_64
	CPU info: Intel(R) Xeon(R) CPU E5-2699 v4 @ 2.20GHz
	GCC Version: gcc (GCC) 4.8.5 20150623 (Red Hat 4.8.5-39)
	Clang Version: 3.4.2 (tags/RELEASE_34/dot2-final)
	x86_64-native-linuxapp-gcc


OS: SUSE15-64
	Kernel Version: 4.12.14-lp150.11-default
	CPU info: Intel(R) Xeon(R) CPU E5-2699 v4 @ 2.20GHz
	GCC Version: gcc (SUSE Linux) 7.3.1 20180323 [gcc-7-branch revision 258812]
	Clang Version: 5.0.1 (tags/RELEASE_501/final 312548)
	x86_64-native-linuxapp-gcc
	x86_64-native-linuxapp-clang


** Meson build **


OS: UB1804-64
	Kernel Version: 4.15.0-20-generic
	CPU info: Intel(R) Xeon(R) CPU E5-2699 v4 @ 2.20GHz
	GCC Version: gcc (Ubuntu 7.3.0-27ubuntu1~18.04) 7.3.0
	Clang Version: 6.0.0-1ubuntu2 (tags/RELEASE_600/final)
	x86_64-native-linuxapp-doc
	./build-gcc-static
	./build-gcc-shared
	./build-clang-static
	./build-clang-shared
	./build-x86-default


OS: UB1604-32
	Kernel Version: 4.4.0-131-generic
	CPU info: Intel(R) Xeon(R) CPU E5-2699 v4 @ 2.20GHz
	GCC Version: gcc (Ubuntu 5.4.0-6ubuntu1~16.04.11) 5.4.0 20160609
	Clang Version: 3.8.0-2ubuntu4 (tags/RELEASE_380/final)
	./build-gcc-static
	./build-gcc-shared
	./build-clang-static
	./build-clang-shared
	./build-x86-default


OS: CENTOS77-64
	Kernel Version: 3.10.0-1062.9.1.el7.x86_64
	CPU info: Intel(R) Xeon(R) CPU E5-2699 v4 @ 2.20GHz
	GCC Version: gcc (GCC) 4.8.5 20150623 (Red Hat 4.8.5-39)
	Clang Version: 6.0.0 (tags/RELEASE_600/final)
	./build-gcc-static
	./build-gcc-shared
	./build-clang-static
	./build-clang-shared
	./build-x86-default


OS: WIN10-64
	Kernel Version: N/A
	CPU info: N/A
	GCC Version: N/A
	Clang Version: Clang 8.0.0
	x86_64-windows-clang


OS: FC31-64
	Kernel Version: 5.3.14-300.fc31.x86_64
	CPU info: Intel(R) Xeon(R) CPU E5-2699 v4 @ 2.20GHz
	GCC Version: gcc (GCC) 9.2.1 20190827 (Red Hat 9.2.1-1)
	Clang Version: 9.0.0 (Fedora 9.0.0-1.fc31)
	./build-gcc-static
	./build-gcc-shared
	./build-clang-static
	./build-clang-shared
	./build-x86-default


OS: FreeBSD1201-64
	Kernel Version: 12.1-RELEASE
	CPU info: Intel(R) Xeon(R) CPU E5-2699 v4 @ 2.20GHz (2194.97-MHz K8-class CPU)
	GCC Version: gcc (FreeBSD Ports Collection) 9.2.0
	Clang Version: 8.0.1 (tags/RELEASE_801/final 366581) (based on LLVM 8.0.1)
	./build-gcc-static
	./build-gcc-shared
	./build-clang-static
	./build-clang-shared
	./build-x86-default


OS: SUSE15-64
	Kernel Version: 4.12.14-lp150.11-default
	CPU info: Intel(R) Xeon(R) CPU E5-2699 v4 @ 2.20GHz
	GCC Version: gcc (SUSE Linux) 7.3.1 20180323 [gcc-7-branch revision 258812]
	Clang Version: 5.0.1 (tags/RELEASE_501/final 312548)
	./build-gcc-static
	./build-gcc-shared
	./build-clang-static
	./build-clang-shared
	./build-x86-default


*Make Build Failed #1:
OS: FreeBSD1201-64
Target: x86_64-native-bsdapp-clang
  CC otx_cryptodev.o
  CC bbdev_turbo_software.o
  CC isal_compress_pmd.o
  CC zlib_pmd.o
  CC axgbe_ethdev.o
/root/FreeBSD1201-64_K12.1_Clang8.0.1/x86_64-native-bsdapp-clang/0acc3d33294c4027ba3d014449c03520/dpdk/drivers/compress/isal/isal_compress_pmd.c:4:10: fatal error: 'isa-l.h' file not found
#include <isa-l.h>
         ^~~~~~~~~
  CC ark_ethdev.o
  PMDINFO axgbe_ethdev.o.pmd.c
  CC axgbe_ethdev.o.pmd.o
1 error generated.
gmake[6]: *** [/root/FreeBSD1201-64_K12.1_Clang8.0.1/x86_64-native-bsdapp-clang/0acc3d33294c4027ba3d014449c03520/dpdk/mk/internal/rte.compile-pre.mk:116: isal_compress_pmd.o] Error 1
gmake[5]: *** [/root/FreeBSD1201-64_K12.1_Clang8.0.1/x86_64-native-bsdapp-clang/0acc3d33294c4027ba3d014449c03520/dpdk/mk/rte.subdir.mk:37: isal] Error 2
gmake[5]: *** Waiting for unfinished jobs....
  LD axgbe_ethdev.o
  CC zlib_pmd_ops.o
  PMDINFO otx_zip_pmd.o.pmd.c
  CC otx_zip_pmd.o.pmd.o
--
  CC rte_openssl_pmd.o
  PMDINFO atl_ethdev.o.pmd.c
== Build drivers/net/bnx2x
  INSTALL-LIB librte_pmd_octeontx_zip.a
  CC atl_ethdev.o.pmd.o
gmake[4]: *** [/root/FreeBSD1201-64_K12.1_Clang8.0.1/x86_64-native-bsdapp-clang/0acc3d33294c4027ba3d014449c03520/dpdk/mk/rte.subdir.mk:37: compress] Error 2
gmake[4]: *** Waiting for unfinished jobs....
  LD atl_ethdev.o
  CC otx2_cryptodev_hw_access.o
  CC qat_sym_session.o
  CC ark_ethdev_tx.o
--
  CC medford_nic.o
  CC hunt_nic.o
  CC medford2_nic.o
  AR librte_pmd_sfc_efx.a
  INSTALL-LIB librte_pmd_sfc_efx.a
gmake[3]: *** [/root/FreeBSD1201-64_K12.1_Clang8.0.1/x86_64-native-bsdapp-clang/0acc3d33294c4027ba3d014449c03520/dpdk/mk/rte.sdkbuild.mk:46: drivers] Error 2
gmake[2]: *** [/root/FreeBSD1201-64_K12.1_Clang8.0.1/x86_64-native-bsdapp-clang/0acc3d33294c4027ba3d014449c03520/dpdk/mk/rte.sdkroot.mk:99: all] Error 2
gmake[1]: *** [/root/FreeBSD1201-64_K12.1_Clang8.0.1/x86_64-native-bsdapp-clang/0acc3d33294c4027ba3d014449c03520/dpdk/mk/rte.sdkinstall.mk:61: pre_install] Error 2
gmake: *** [/root/FreeBSD1201-64_K12.1_Clang8.0.1/x86_64-native-bsdapp-clang/0acc3d33294c4027ba3d014449c03520/dpdk/mk/rte.sdkroot.mk:77: install] Error 2

*Meson Build Failed #1:
OS: SUSE15-64
Target:./build-gcc-static
FAILED: app/test/3062f5d@@dpdk-test at exe/test_cryptodev.c.o 
gcc -Iapp/test/3062f5d@@dpdk-test at exe -Iapp/test -I../app/test -Ilib/librte_acl -I../lib/librte_acl -I. -I../ -Iconfig -I../config -Ilib/librte_eal/common/include -I../lib/librte_eal/common/include -I../lib/librte_eal/linux/eal/include -Ilib/librte_eal/common -I../lib/librte_eal/common -Ilib/librte_eal/common/include/arch/x86 -I../lib/librte_eal/common/include/arch/x86 -Ilib/librte_eal -I../lib/librte_eal -Ilib/librte_kvargs -I../lib/librte_kvargs -Ilib/librte_bitratestats -I../lib/librte_bitratestats -Ilib/librte_ethdev -I../lib/librte_ethdev -Ilib/librte_net -I../lib/librte_net -Ilib/librte_mbuf -I../lib/librte_mbuf -Ilib/librte_mempool -I../lib/librte_mempool -Ilib/librte_ring -I../lib/librte_ring -Ilib/librte_meter -I../lib/librte_meter -Ilib/librte_metrics -I../lib/librte_metrics -Ilib/librte_bpf -I../lib/librte_bpf -Ilib/librte_cfgfile -I../lib/librte_cfgfile -Ilib/librte_cmdline -I../lib/librte_cmdline -Ilib/librte_cryptodev -I../lib/librte_cryptodev -Ilib/librte_distributor -I../lib/librte_distributor -Ilib/librte_efd -I../lib/librte_efd -Ilib/librte_hash -I../lib/librte_hash -Ilib/librte_eventdev -I../lib/librte_eventdev -Ilib/librte_timer -I../lib/librte_timer -Ilib/librte_fib -I../lib/librte_fib -Ilib/librte_rib -I../lib/librte_rib -Ilib/librte_flow_classify -I../lib/librte_flow_classify -Ilib/librte_table -I../lib/librte_table -Ilib/librte_port -I../lib/librte_port -Ilib/librte_sched -I../lib/librte_sched -Ilib/librte_ip_frag -I../lib/librte_ip_frag -Ilib/librte_kni -I../lib/librte_kni -Ilib/librte_pci -I../lib/librte_pci -Ilib/librte_lpm -I../lib/librte_lpm -Ilib/librte_ipsec -I../lib/librte_ipsec -Ilib/librte_security -I../lib/librte_security -Ilib/librte_latencystats -I../lib/librte_latencystats -Ilib/librte_member -I../lib/librte_member -Ilib/librte_pipeline -I../lib/librte_pipeline -Ilib/librte_rawdev -I../lib/librte_rawdev -Ilib/librte_rcu -I../lib/librte_rcu -Ilib/librte_reorder -I../lib/librte_reorder -Ilib/librte_stack -I../lib/librte_stack -Idrivers/mempool/ring -I../drivers/mempool/ring -Idrivers/mempool/stack -I../drivers/mempool/stack -Idrivers/event/skeleton -I../drivers/event/skeleton -Idrivers/bus/pci -I../drivers/bus/pci -I../drivers/bus/pci/linux -Idrivers/bus/vdev -I../drivers/bus/vdev -Idrivers/net/bonding -I../drivers/net/bonding -Idrivers/net/ring -I../drivers/net/ring -Ilib/librte_power -I../lib/librte_power -Ilib/librte_pdump -I../lib/librte_pdump -Ilib/librte_compressdev -I../lib/librte_compressdev -fdiagnostics-color=always -pipe -D_FILE_OFFSET_BITS=64 -Wall -Winvalid-pch -Werror -O3 -include rte_config.h -Wextra -Wcast-qual -Wdeprecated -Wformat-nonliteral -Wformat-security -Wmissing-declarations -Wmissing-prototypes -Wnested-externs -Wold-style-definition -Wpointer-arith -Wsign-compare -Wstrict-prototypes -Wundef -Wwrite-strings -Wno-missing-field-initializers -march=native -Wno-format-truncation -D_GNU_SOURCE -DALLOW_EXPERIMENTAL_API -MD -MQ 'app/test/3062f5d@@dpdk-test at exe/test_cryptodev.c.o' -MF 'app/test/3062f5d@@dpdk-test at exe/test_cryptodev.c.o.d' -o 'app/test/3062f5d@@dpdk-test at exe/test_cryptodev.c.o' -c ../app/test/test_cryptodev.c
../app/test/test_cryptodev.c:6700:1: error: ‘test_3DES_chain_openssl_all’ defined but not used [-Werror=unused-function]
 test_3DES_chain_openssl_all(void)
 ^~~~~~~~~~~~~~~~~~~~~~~~~~~
../app/test/test_cryptodev.c:6681:1: error: ‘test_3DES_cipheronly_qat_all’ defined but not used [-Werror=unused-function]
 test_3DES_cipheronly_qat_all(void)
 ^~~~~~~~~~~~~~~~~~~~~~~~~~~~
../app/test/test_cryptodev.c:6662:1: error: ‘test_3DES_cipheronly_ccp_all’ defined but not used [-Werror=unused-function]
 test_3DES_cipheronly_ccp_all(void)
 ^~~~~~~~~~~~~~~~~~~~~~~~~~~~
../app/test/test_cryptodev.c:6643:1: error: ‘test_3DES_chain_ccp_all’ defined but not used [-Werror=unused-function]
 test_3DES_chain_ccp_all(void)
 ^~~~~~~~~~~~~~~~~~~~~~~
../app/test/test_cryptodev.c:6624:1: error: ‘test_3DES_cipheronly_dpaa2_sec_all’ defined but not used [-Werror=unused-function]
 test_3DES_cipheronly_dpaa2_sec_all(void)
 ^~~~~~~~~~~~~~~~~~~~~~~~~~~~~~~~~~
../app/test/test_cryptodev.c:6605:1: error: ‘test_3DES_chain_dpaa2_sec_all’ defined but not used [-Werror=unused-function]
 test_3DES_chain_dpaa2_sec_all(void)
 ^~~~~~~~~~~~~~~~~~~~~~~~~~~~~
../app/test/test_cryptodev.c:6586:1: error: ‘test_3DES_cipheronly_dpaa_sec_all’ defined but not used [-Werror=unused-function]
 test_3DES_cipheronly_dpaa_sec_all(void)
 ^~~~~~~~~~~~~~~~~~~~~~~~~~~~~~~~~
../app/test/test_cryptodev.c:6567:1: error: ‘test_3DES_chain_dpaa_sec_all’ defined but not used [-Werror=unused-function]
 test_3DES_chain_dpaa_sec_all(void)
 ^~~~~~~~~~~~~~~~~~~~~~~~~~~~
../app/test/test_cryptodev.c:6548:1: error: ‘test_3DES_cipheronly_caam_jr_all’ defined but not used [-Werror=unused-function]
 test_3DES_cipheronly_caam_jr_all(void)
 ^~~~~~~~~~~~~~~~~~~~~~~~~~~~~~~~
../app/test/test_cryptodev.c:6529:1: error: ‘test_3DES_chain_caam_jr_all’ defined but not used [-Werror=unused-function]
 test_3DES_chain_caam_jr_all(void)
 ^~~~~~~~~~~~~~~~~~~~~~~~~~~
../app/test/test_cryptodev.c:6510:1: error: ‘test_DES_docsis_mb_all’ defined but not used [-Werror=unused-function]
 test_DES_docsis_mb_all(void)
 ^~~~~~~~~~~~~~~~~~~~~~
../app/test/test_cryptodev.c:6491:1: error: ‘test_3DES_cipheronly_mb_all’ defined but not used [-Werror=unused-function]
 test_3DES_cipheronly_mb_all(void)
 ^~~~~~~~~~~~~~~~~~~~~~~~~~~
../app/test/test_cryptodev.c:6473:1: error: ‘test_DES_cipheronly_mb_all’ defined but not used [-Werror=unused-function]
 test_DES_cipheronly_mb_all(void)
 ^~~~~~~~~~~~~~~~~~~~~~~~~~
../app/test/test_cryptodev.c:6454:1: error: ‘test_DES_docsis_openssl_all’ defined but not used [-Werror=unused-function]
 test_DES_docsis_openssl_all(void)
 ^~~~~~~~~~~~~~~~~~~~~~~~~~~
../app/test/test_cryptodev.c:6435:1: error: ‘test_DES_cipheronly_openssl_all’ defined but not used [-Werror=unused-function]
 test_DES_cipheronly_openssl_all(void)
 ^~~~~~~~~~~~~~~~~~~~~~~~~~~~~~~
../app/test/test_cryptodev.c:6416:1: error: ‘test_DES_cipheronly_qat_all’ defined but not used [-Werror=unused-function]
 test_DES_cipheronly_qat_all(void)
 ^~~~~~~~~~~~~~~~~~~~~~~~~~~
../app/test/test_cryptodev.c:6397:1: error: ‘test_3DES_chain_qat_all’ defined but not used [-Werror=unused-function]
 test_3DES_chain_qat_all(void)
 ^~~~~~~~~~~~~~~~~~~~~~~
cc1: all warnings being treated as errors
[1950/2185] Compiling C object 'app/test/3062f5d@@dpdk-test at exe/test_lpm_perf.c.o'.
[1951/2185] Compiling C object 'app/test/3062f5d@@dpdk-test at exe/test_lpm.c.o'.
[1952/2185] Compiling C object 'app/test/3062f5d@@dpdk-test at exe/test_member.c.o'.
[1953/2185] Compiling C object 'app/test/3062f5d@@dpdk-test at exe/test_member_perf.c.o'.
[1954/2185] Compiling C object 'app/test/3062f5d@@dpdk-test at exe/test_link_bonding.c.o'.
[1955/2185] Compiling C object 'app/test/3062f5d@@dpdk-test at exe/test_mbuf.c.o'.
[1956/2185] Compiling C object 'app/test/3062f5d@@dpdk-test at exe/test_link_bonding_mode4.c.o'.
ninja: build stopped: subcommand failed




*Meson Build Failed #2:
OS: CENTOS77-64
Target:./build-gcc-static
FAILED: app/test/3062f5d@@dpdk-test at exe/test_cryptodev.c.o 
gcc -Iapp/test/3062f5d@@dpdk-test at exe -Iapp/test -I../app/test -Ilib/librte_acl -I../lib/librte_acl -I. -I../ -Iconfig -I../config -Ilib/librte_eal/common/include -I../lib/librte_eal/common/include -I../lib/librte_eal/linux/eal/include -Ilib/librte_eal/common -I../lib/librte_eal/common -Ilib/librte_eal/common/include/arch/x86 -I../lib/librte_eal/common/include/arch/x86 -Ilib/librte_eal -I../lib/librte_eal -Ilib/librte_kvargs -I../lib/librte_kvargs -Ilib/librte_bitratestats -I../lib/librte_bitratestats -Ilib/librte_ethdev -I../lib/librte_ethdev -Ilib/librte_net -I../lib/librte_net -Ilib/librte_mbuf -I../lib/librte_mbuf -Ilib/librte_mempool -I../lib/librte_mempool -Ilib/librte_ring -I../lib/librte_ring -Ilib/librte_meter -I../lib/librte_meter -Ilib/librte_metrics -I../lib/librte_metrics -Ilib/librte_bpf -I../lib/librte_bpf -Ilib/librte_cfgfile -I../lib/librte_cfgfile -Ilib/librte_cmdline -I../lib/librte_cmdline -Ilib/librte_cryptodev -I../lib/librte_cryptodev -Ilib/librte_distributor -I../lib/librte_distributor -Ilib/librte_efd -I../lib/librte_efd -Ilib/librte_hash -I../lib/librte_hash -Ilib/librte_eventdev -I../lib/librte_eventdev -Ilib/librte_timer -I../lib/librte_timer -Ilib/librte_fib -I../lib/librte_fib -Ilib/librte_rib -I../lib/librte_rib -Ilib/librte_flow_classify -I../lib/librte_flow_classify -Ilib/librte_table -I../lib/librte_table -Ilib/librte_port -I../lib/librte_port -Ilib/librte_sched -I../lib/librte_sched -Ilib/librte_ip_frag -I../lib/librte_ip_frag -Ilib/librte_kni -I../lib/librte_kni -Ilib/librte_pci -I../lib/librte_pci -Ilib/librte_lpm -I../lib/librte_lpm -Ilib/librte_ipsec -I../lib/librte_ipsec -Ilib/librte_security -I../lib/librte_security -Ilib/librte_latencystats -I../lib/librte_latencystats -Ilib/librte_member -I../lib/librte_member -Ilib/librte_pipeline -I../lib/librte_pipeline -Ilib/librte_rawdev -I../lib/librte_rawdev -Ilib/librte_rcu -I../lib/librte_rcu -Ilib/librte_reorder -I../lib/librte_reorder -Ilib/librte_stack -I../lib/librte_stack -Idrivers/mempool/ring -I../drivers/mempool/ring -Idrivers/mempool/stack -I../drivers/mempool/stack -Idrivers/event/skeleton -I../drivers/event/skeleton -Idrivers/bus/pci -I../drivers/bus/pci -I../drivers/bus/pci/linux -Idrivers/bus/vdev -I../drivers/bus/vdev -Idrivers/net/bonding -I../drivers/net/bonding -Idrivers/net/ring -I../drivers/net/ring -Ilib/librte_power -I../lib/librte_power -Ilib/librte_pdump -I../lib/librte_pdump -Ilib/librte_compressdev -I../lib/librte_compressdev -pipe -D_FILE_OFFSET_BITS=64 -Wall -Winvalid-pch -Werror -O3 -include rte_config.h -Wextra -Wcast-qual -Wdeprecated -Wformat-nonliteral -Wformat-security -Wmissing-declarations -Wmissing-prototypes -Wnested-externs -Wold-style-definition -Wpointer-arith -Wsign-compare -Wstrict-prototypes -Wundef -Wwrite-strings -Wno-missing-field-initializers -march=native -D_GNU_SOURCE -DALLOW_EXPERIMENTAL_API -MD -MQ 'app/test/3062f5d@@dpdk-test at exe/test_cryptodev.c.o' -MF 'app/test/3062f5d@@dpdk-test at exe/test_cryptodev.c.o.d' -o 'app/test/3062f5d@@dpdk-test at exe/test_cryptodev.c.o' -c ../app/test/test_cryptodev.c
../app/test/test_cryptodev.c:6397:1: error: ‘test_3DES_chain_qat_all’ defined but not used [-Werror=unused-function]
 test_3DES_chain_qat_all(void)
 ^
../app/test/test_cryptodev.c:6416:1: error: ‘test_DES_cipheronly_qat_all’ defined but not used [-Werror=unused-function]
 test_DES_cipheronly_qat_all(void)
 ^
../app/test/test_cryptodev.c:6435:1: error: ‘test_DES_cipheronly_openssl_all’ defined but not used [-Werror=unused-function]
 test_DES_cipheronly_openssl_all(void)
 ^
../app/test/test_cryptodev.c:6454:1: error: ‘test_DES_docsis_openssl_all’ defined but not used [-Werror=unused-function]
 test_DES_docsis_openssl_all(void)
 ^
../app/test/test_cryptodev.c:6473:1: error: ‘test_DES_cipheronly_mb_all’ defined but not used [-Werror=unused-function]
 test_DES_cipheronly_mb_all(void)
 ^
../app/test/test_cryptodev.c:6491:1: error: ‘test_3DES_cipheronly_mb_all’ defined but not used [-Werror=unused-function]
 test_3DES_cipheronly_mb_all(void)
 ^
../app/test/test_cryptodev.c:6510:1: error: ‘test_DES_docsis_mb_all’ defined but not used [-Werror=unused-function]
 test_DES_docsis_mb_all(void)
 ^
../app/test/test_cryptodev.c:6529:1: error: ‘test_3DES_chain_caam_jr_all’ defined but not used [-Werror=unused-function]
 test_3DES_chain_caam_jr_all(void)
 ^
../app/test/test_cryptodev.c:6548:1: error: ‘test_3DES_cipheronly_caam_jr_all’ defined but not used [-Werror=unused-function]
 test_3DES_cipheronly_caam_jr_all(void)
 ^
../app/test/test_cryptodev.c:6567:1: error: ‘test_3DES_chain_dpaa_sec_all’ defined but not used [-Werror=unused-function]
 test_3DES_chain_dpaa_sec_all(void)
 ^
../app/test/test_cryptodev.c:6586:1: error: ‘test_3DES_cipheronly_dpaa_sec_all’ defined but not used [-Werror=unused-function]
 test_3DES_cipheronly_dpaa_sec_all(void)
 ^
../app/test/test_cryptodev.c:6605:1: error: ‘test_3DES_chain_dpaa2_sec_all’ defined but not used [-Werror=unused-function]
 test_3DES_chain_dpaa2_sec_all(void)
 ^
../app/test/test_cryptodev.c:6624:1: error: ‘test_3DES_cipheronly_dpaa2_sec_all’ defined but not used [-Werror=unused-function]
 test_3DES_cipheronly_dpaa2_sec_all(void)
 ^
../app/test/test_cryptodev.c:6643:1: error: ‘test_3DES_chain_ccp_all’ defined but not used [-Werror=unused-function]
 test_3DES_chain_ccp_all(void)
 ^
../app/test/test_cryptodev.c:6662:1: error: ‘test_3DES_cipheronly_ccp_all’ defined but not used [-Werror=unused-function]
 test_3DES_cipheronly_ccp_all(void)
 ^
../app/test/test_cryptodev.c:6681:1: error: ‘test_3DES_cipheronly_qat_all’ defined but not used [-Werror=unused-function]
 test_3DES_cipheronly_qat_all(void)
 ^
../app/test/test_cryptodev.c:6700:1: error: ‘test_3DES_chain_openssl_all’ defined but not used [-Werror=unused-function]
 test_3DES_chain_openssl_all(void)
 ^
cc1: all warnings being treated as errors
[1924/2195] Compiling C object 'app/test/3062f5d@@dpdk-test at exe/test_cycles.c.o'.
[1925/2195] Compiling C object 'app/test/3062f5d@@dpdk-test at exe/test_debug.c.o'.
[1926/2195] Compiling C object 'app/test/3062f5d@@dpdk-test at exe/test_cryptodev_security_pdcp.c.o'.
[1927/2195] Compiling C object 'app/test/3062f5d@@dpdk-test at exe/test_cryptodev_asym.c.o'.
[1928/2195] Compiling C object 'app/test/3062f5d@@dpdk-test at exe/test_cryptodev_blockcipher.c.o'.
ninja: build stopped: subcommand failed




*Meson Build Failed #3:
OS: UB1604-32
Target:./build-gcc-static
FAILED: app/test/3062f5d@@dpdk-test at exe/test_cryptodev.c.o 
gcc -Iapp/test/3062f5d@@dpdk-test at exe -Iapp/test -I../app/test -Ilib/librte_acl -I../lib/librte_acl -I. -I../ -Iconfig -I../config -Ilib/librte_eal/common/include -I../lib/librte_eal/common/include -I../lib/librte_eal/linux/eal/include -Ilib/librte_eal/common -I../lib/librte_eal/common -Ilib/librte_eal/common/include/arch/x86 -I../lib/librte_eal/common/include/arch/x86 -Ilib/librte_eal -I../lib/librte_eal -Ilib/librte_kvargs -I../lib/librte_kvargs -Ilib/librte_bitratestats -I../lib/librte_bitratestats -Ilib/librte_ethdev -I../lib/librte_ethdev -Ilib/librte_net -I../lib/librte_net -Ilib/librte_mbuf -I../lib/librte_mbuf -Ilib/librte_mempool -I../lib/librte_mempool -Ilib/librte_ring -I../lib/librte_ring -Ilib/librte_meter -I../lib/librte_meter -Ilib/librte_metrics -I../lib/librte_metrics -Ilib/librte_bpf -I../lib/librte_bpf -Ilib/librte_cfgfile -I../lib/librte_cfgfile -Ilib/librte_cmdline -I../lib/librte_cmdline -Ilib/librte_cryptodev -I../lib/librte_cryptodev -Ilib/librte_distributor -I../lib/librte_distributor -Ilib/librte_efd -I../lib/librte_efd -Ilib/librte_hash -I../lib/librte_hash -Ilib/librte_eventdev -I../lib/librte_eventdev -Ilib/librte_timer -I../lib/librte_timer -Ilib/librte_fib -I../lib/librte_fib -Ilib/librte_rib -I../lib/librte_rib -Ilib/librte_flow_classify -I../lib/librte_flow_classify -Ilib/librte_table -I../lib/librte_table -Ilib/librte_port -I../lib/librte_port -Ilib/librte_sched -I../lib/librte_sched -Ilib/librte_ip_frag -I../lib/librte_ip_frag -Ilib/librte_lpm -I../lib/librte_lpm -Ilib/librte_ipsec -I../lib/librte_ipsec -Ilib/librte_security -I../lib/librte_security -Ilib/librte_latencystats -I../lib/librte_latencystats -Ilib/librte_member -I../lib/librte_member -Ilib/librte_pipeline -I../lib/librte_pipeline -Ilib/librte_rawdev -I../lib/librte_rawdev -Ilib/librte_rcu -I../lib/librte_rcu -Ilib/librte_reorder -I../lib/librte_reorder -Ilib/librte_stack -I../lib/librte_stack -Idrivers/mempool/ring -I../drivers/mempool/ring -Idrivers/mempool/stack -I../drivers/mempool/stack -Idrivers/event/skeleton -I../drivers/event/skeleton -Idrivers/bus/pci -I../drivers/bus/pci -I../drivers/bus/pci/linux -Ilib/librte_pci -I../lib/librte_pci -Idrivers/bus/vdev -I../drivers/bus/vdev -Idrivers/net/bonding -I../drivers/net/bonding -Idrivers/net/ring -I../drivers/net/ring -Ilib/librte_power -I../lib/librte_power -Ilib/librte_pdump -I../lib/librte_pdump -fdiagnostics-color=always -pipe -D_FILE_OFFSET_BITS=64 -Wall -Winvalid-pch -Werror -O3 -include rte_config.h -Wextra -Wcast-qual -Wdeprecated -Wformat-nonliteral -Wformat-security -Wmissing-declarations -Wmissing-prototypes -Wnested-externs -Wold-style-definition -Wpointer-arith -Wsign-compare -Wstrict-prototypes -Wundef -Wwrite-strings -Wno-missing-field-initializers -Wno-pointer-to-int-cast -march=native -D_GNU_SOURCE -DALLOW_EXPERIMENTAL_API -MD -MQ 'app/test/3062f5d@@dpdk-test at exe/test_cryptodev.c.o' -MF 'app/test/3062f5d@@dpdk-test at exe/test_cryptodev.c.o.d' -o 'app/test/3062f5d@@dpdk-test at exe/test_cryptodev.c.o' -c ../app/test/test_cryptodev.c
../app/test/test_cryptodev.c:6397:1: error: ‘test_3DES_chain_qat_all’ defined but not used [-Werror=unused-function]
 test_3DES_chain_qat_all(void)
 ^
../app/test/test_cryptodev.c:6416:1: error: ‘test_DES_cipheronly_qat_all’ defined but not used [-Werror=unused-function]
 test_DES_cipheronly_qat_all(void)
 ^
../app/test/test_cryptodev.c:6435:1: error: ‘test_DES_cipheronly_openssl_all’ defined but not used [-Werror=unused-function]
 test_DES_cipheronly_openssl_all(void)
 ^
../app/test/test_cryptodev.c:6454:1: error: ‘test_DES_docsis_openssl_all’ defined but not used [-Werror=unused-function]
 test_DES_docsis_openssl_all(void)
 ^
../app/test/test_cryptodev.c:6473:1: error: ‘test_DES_cipheronly_mb_all’ defined but not used [-Werror=unused-function]
 test_DES_cipheronly_mb_all(void)
 ^
../app/test/test_cryptodev.c:6491:1: error: ‘test_3DES_cipheronly_mb_all’ defined but not used [-Werror=unused-function]
 test_3DES_cipheronly_mb_all(void)
 ^
../app/test/test_cryptodev.c:6510:1: error: ‘test_DES_docsis_mb_all’ defined but not used [-Werror=unused-function]
 test_DES_docsis_mb_all(void)
 ^
../app/test/test_cryptodev.c:6529:1: error: ‘test_3DES_chain_caam_jr_all’ defined but not used [-Werror=unused-function]
 test_3DES_chain_caam_jr_all(void)
 ^
../app/test/test_cryptodev.c:6548:1: error: ‘test_3DES_cipheronly_caam_jr_all’ defined but not used [-Werror=unused-function]
 test_3DES_cipheronly_caam_jr_all(void)
 ^
../app/test/test_cryptodev.c:6567:1: error: ‘test_3DES_chain_dpaa_sec_all’ defined but not used [-Werror=unused-function]
 test_3DES_chain_dpaa_sec_all(void)
 ^
../app/test/test_cryptodev.c:6586:1: error: ‘test_3DES_cipheronly_dpaa_sec_all’ defined but not used [-Werror=unused-function]
 test_3DES_cipheronly_dpaa_sec_all(void)
 ^
../app/test/test_cryptodev.c:6605:1: error: ‘test_3DES_chain_dpaa2_sec_all’ defined but not used [-Werror=unused-function]
 test_3DES_chain_dpaa2_sec_all(void)
 ^
../app/test/test_cryptodev.c:6624:1: error: ‘test_3DES_cipheronly_dpaa2_sec_all’ defined but not used [-Werror=unused-function]
 test_3DES_cipheronly_dpaa2_sec_all(void)
 ^
../app/test/test_cryptodev.c:6643:1: error: ‘test_3DES_chain_ccp_all’ defined but not used [-Werror=unused-function]
 test_3DES_chain_ccp_all(void)
 ^
../app/test/test_cryptodev.c:6662:1: error: ‘test_3DES_cipheronly_ccp_all’ defined but not used [-Werror=unused-function]
 test_3DES_cipheronly_ccp_all(void)
 ^
../app/test/test_cryptodev.c:6681:1: error: ‘test_3DES_cipheronly_qat_all’ defined but not used [-Werror=unused-function]
 test_3DES_cipheronly_qat_all(void)
 ^
../app/test/test_cryptodev.c:6700:1: error: ‘test_3DES_chain_openssl_all’ defined but not used [-Werror=unused-function]
 test_3DES_chain_openssl_all(void)
 ^
cc1: all warnings being treated as errors
[1724/1949] Compiling C object 'app/test/3062f5d@@dpdk-test at exe/test_logs.c.o'.
[1725/1949] Compiling C object 'app/test/3062f5d@@dpdk-test at exe/test_link_bonding_rssconf.c.o'.
[1726/1949] Compiling C object 'app/test/3062f5d@@dpdk-test at exe/test_ipsec.c.o'.
[1727/1949] Compiling C object 'app/test/3062f5d@@dpdk-test at exe/test_link_bonding_mode4.c.o'.
[1728/1949] Compiling C object 'app/test/3062f5d@@dpdk-test at exe/test_link_bonding.c.o'.
ninja: build stopped: subcommand failed




*Meson Build Failed #4:
OS: FC31-64
Target:./build-gcc-static
FAILED: app/test/3062f5d@@dpdk-test at exe/test_cryptodev.c.o 
gcc -Iapp/test/3062f5d@@dpdk-test at exe -Iapp/test -I../app/test -Ilib/librte_acl -I../lib/librte_acl -I. -I../ -Iconfig -I../config -Ilib/librte_eal/common/include -I../lib/librte_eal/common/include -I../lib/librte_eal/linux/eal/include -Ilib/librte_eal/common -I../lib/librte_eal/common -Ilib/librte_eal/common/include/arch/x86 -I../lib/librte_eal/common/include/arch/x86 -Ilib/librte_eal -I../lib/librte_eal -Ilib/librte_kvargs -I../lib/librte_kvargs -Ilib/librte_bitratestats -I../lib/librte_bitratestats -Ilib/librte_ethdev -I../lib/librte_ethdev -Ilib/librte_net -I../lib/librte_net -Ilib/librte_mbuf -I../lib/librte_mbuf -Ilib/librte_mempool -I../lib/librte_mempool -Ilib/librte_ring -I../lib/librte_ring -Ilib/librte_meter -I../lib/librte_meter -Ilib/librte_metrics -I../lib/librte_metrics -Ilib/librte_bpf -I../lib/librte_bpf -Ilib/librte_cfgfile -I../lib/librte_cfgfile -Ilib/librte_cmdline -I../lib/librte_cmdline -Ilib/librte_cryptodev -I../lib/librte_cryptodev -Ilib/librte_distributor -I../lib/librte_distributor -Ilib/librte_efd -I../lib/librte_efd -Ilib/librte_hash -I../lib/librte_hash -Ilib/librte_eventdev -I../lib/librte_eventdev -Ilib/librte_timer -I../lib/librte_timer -Ilib/librte_fib -I../lib/librte_fib -Ilib/librte_rib -I../lib/librte_rib -Ilib/librte_flow_classify -I../lib/librte_flow_classify -Ilib/librte_table -I../lib/librte_table -Ilib/librte_port -I../lib/librte_port -Ilib/librte_sched -I../lib/librte_sched -Ilib/librte_ip_frag -I../lib/librte_ip_frag -Ilib/librte_kni -I../lib/librte_kni -Ilib/librte_pci -I../lib/librte_pci -Ilib/librte_lpm -I../lib/librte_lpm -Ilib/librte_ipsec -I../lib/librte_ipsec -Ilib/librte_security -I../lib/librte_security -Ilib/librte_latencystats -I../lib/librte_latencystats -Ilib/librte_member -I../lib/librte_member -Ilib/librte_pipeline -I../lib/librte_pipeline -Ilib/librte_rawdev -I../lib/librte_rawdev -Ilib/librte_rcu -I../lib/librte_rcu -Ilib/librte_reorder -I../lib/librte_reorder -Ilib/librte_stack -I../lib/librte_stack -Idrivers/mempool/ring -I../drivers/mempool/ring -Idrivers/mempool/stack -I../drivers/mempool/stack -Idrivers/event/skeleton -I../drivers/event/skeleton -Idrivers/bus/pci -I../drivers/bus/pci -I../drivers/bus/pci/linux -Idrivers/bus/vdev -I../drivers/bus/vdev -Idrivers/net/bonding -I../drivers/net/bonding -Idrivers/net/ring -I../drivers/net/ring -Ilib/librte_power -I../lib/librte_power -Ilib/librte_pdump -I../lib/librte_pdump -Ilib/librte_compressdev -I../lib/librte_compressdev -fdiagnostics-color=always -pipe -D_FILE_OFFSET_BITS=64 -Wall -Winvalid-pch -Werror -O3 -include rte_config.h -Wextra -Wcast-qual -Wdeprecated -Wformat-nonliteral -Wformat-security -Wmissing-declarations -Wmissing-prototypes -Wnested-externs -Wold-style-definition -Wpointer-arith -Wsign-compare -Wstrict-prototypes -Wundef -Wwrite-strings -Wno-address-of-packed-member -Wno-packed-not-aligned -Wno-missing-field-initializers -march=native -Wno-format-truncation -D_GNU_SOURCE -DALLOW_EXPERIMENTAL_API -MD -MQ 'app/test/3062f5d@@dpdk-test at exe/test_cryptodev.c.o' -MF 'app/test/3062f5d@@dpdk-test at exe/test_cryptodev.c.o.d' -o 'app/test/3062f5d@@dpdk-test at exe/test_cryptodev.c.o' -c ../app/test/test_cryptodev.c
../app/test/test_cryptodev.c:6700:1: error: ‘test_3DES_chain_openssl_all’ defined but not used [-Werror=unused-function]
 6700 | test_3DES_chain_openssl_all(void)
      | ^~~~~~~~~~~~~~~~~~~~~~~~~~~
../app/test/test_cryptodev.c:6681:1: error: ‘test_3DES_cipheronly_qat_all’ defined but not used [-Werror=unused-function]
 6681 | test_3DES_cipheronly_qat_all(void)
      | ^~~~~~~~~~~~~~~~~~~~~~~~~~~~
../app/test/test_cryptodev.c:6662:1: error: ‘test_3DES_cipheronly_ccp_all’ defined but not used [-Werror=unused-function]
 6662 | test_3DES_cipheronly_ccp_all(void)
      | ^~~~~~~~~~~~~~~~~~~~~~~~~~~~
../app/test/test_cryptodev.c:6643:1: error: ‘test_3DES_chain_ccp_all’ defined but not used [-Werror=unused-function]
 6643 | test_3DES_chain_ccp_all(void)
      | ^~~~~~~~~~~~~~~~~~~~~~~
../app/test/test_cryptodev.c:6624:1: error: ‘test_3DES_cipheronly_dpaa2_sec_all’ defined but not used [-Werror=unused-function]
 6624 | test_3DES_cipheronly_dpaa2_sec_all(void)
      | ^~~~~~~~~~~~~~~~~~~~~~~~~~~~~~~~~~
../app/test/test_cryptodev.c:6605:1: error: ‘test_3DES_chain_dpaa2_sec_all’ defined but not used [-Werror=unused-function]
 6605 | test_3DES_chain_dpaa2_sec_all(void)
      | ^~~~~~~~~~~~~~~~~~~~~~~~~~~~~
../app/test/test_cryptodev.c:6586:1: error: ‘test_3DES_cipheronly_dpaa_sec_all’ defined but not used [-Werror=unused-function]
 6586 | test_3DES_cipheronly_dpaa_sec_all(void)
      | ^~~~~~~~~~~~~~~~~~~~~~~~~~~~~~~~~
../app/test/test_cryptodev.c:6567:1: error: ‘test_3DES_chain_dpaa_sec_all’ defined but not used [-Werror=unused-function]
 6567 | test_3DES_chain_dpaa_sec_all(void)
      | ^~~~~~~~~~~~~~~~~~~~~~~~~~~~
../app/test/test_cryptodev.c:6548:1: error: ‘test_3DES_cipheronly_caam_jr_all’ defined but not used [-Werror=unused-function]
 6548 | test_3DES_cipheronly_caam_jr_all(void)
      | ^~~~~~~~~~~~~~~~~~~~~~~~~~~~~~~~
../app/test/test_cryptodev.c:6529:1: error: ‘test_3DES_chain_caam_jr_all’ defined but not used [-Werror=unused-function]
 6529 | test_3DES_chain_caam_jr_all(void)
      | ^~~~~~~~~~~~~~~~~~~~~~~~~~~
../app/test/test_cryptodev.c:6510:1: error: ‘test_DES_docsis_mb_all’ defined but not used [-Werror=unused-function]
 6510 | test_DES_docsis_mb_all(void)
      | ^~~~~~~~~~~~~~~~~~~~~~
../app/test/test_cryptodev.c:6491:1: error: ‘test_3DES_cipheronly_mb_all’ defined but not used [-Werror=unused-function]
 6491 | test_3DES_cipheronly_mb_all(void)
      | ^~~~~~~~~~~~~~~~~~~~~~~~~~~
../app/test/test_cryptodev.c:6473:1: error: ‘test_DES_cipheronly_mb_all’ defined but not used [-Werror=unused-function]
 6473 | test_DES_cipheronly_mb_all(void)
      | ^~~~~~~~~~~~~~~~~~~~~~~~~~
../app/test/test_cryptodev.c:6454:1: error: ‘test_DES_docsis_openssl_all’ defined but not used [-Werror=unused-function]
 6454 | test_DES_docsis_openssl_all(void)
      | ^~~~~~~~~~~~~~~~~~~~~~~~~~~
../app/test/test_cryptodev.c:6435:1: error: ‘test_DES_cipheronly_openssl_all’ defined but not used [-Werror=unused-function]
 6435 | test_DES_cipheronly_openssl_all(void)
      | ^~~~~~~~~~~~~~~~~~~~~~~~~~~~~~~
../app/test/test_cryptodev.c:6416:1: error: ‘test_DES_cipheronly_qat_all’ defined but not used [-Werror=unused-function]
 6416 | test_DES_cipheronly_qat_all(void)
      | ^~~~~~~~~~~~~~~~~~~~~~~~~~~
../app/test/test_cryptodev.c:6397:1: error: ‘test_3DES_chain_qat_all’ defined but not used [-Werror=unused-function]
 6397 | test_3DES_chain_qat_all(void)
      | ^~~~~~~~~~~~~~~~~~~~~~~
cc1: all warnings being treated as errors
[1970/2198] Compiling C object 'app/test/3062f5d@@dpdk-test at exe/test_power.c.o'.
[1971/2198] Compiling C object 'app/test/3062f5d@@dpdk-test at exe/test_pdump.c.o'.
[1972/2198] Compiling C object 'app/test/3062f5d@@dpdk-test at exe/test_mp_secondary.c.o'.
[1973/2198] Compiling C object 'app/test/3062f5d@@dpdk-test at exe/test_pmd_ring.c.o'.
[1974/2198] Compiling C object 'app/test/3062f5d@@dpdk-test at exe/test_pmd_perf.c.o'.
[1975/2198] Compiling C object 'app/test/3062f5d@@dpdk-test at exe/test_pmd_ring_perf.c.o'.
[1976/2198] Compiling C object 'app/test/3062f5d@@dpdk-test at exe/test_mbuf.c.o'.
ninja: build stopped: subcommand failed




*Meson Build Failed #5:
OS: UB1804-64
Target:./build-gcc-static
FAILED: app/test/3062f5d@@dpdk-test at exe/test_cryptodev.c.o 
gcc -Iapp/test/3062f5d@@dpdk-test at exe -Iapp/test -I../app/test -Ilib/librte_acl -I../lib/librte_acl -I. -I../ -Iconfig -I../config -Ilib/librte_eal/common/include -I../lib/librte_eal/common/include -I../lib/librte_eal/linux/eal/include -Ilib/librte_eal/common -I../lib/librte_eal/common -Ilib/librte_eal/common/include/arch/x86 -I../lib/librte_eal/common/include/arch/x86 -Ilib/librte_eal -I../lib/librte_eal -Ilib/librte_kvargs -I../lib/librte_kvargs -Ilib/librte_bitratestats -I../lib/librte_bitratestats -Ilib/librte_ethdev -I../lib/librte_ethdev -Ilib/librte_net -I../lib/librte_net -Ilib/librte_mbuf -I../lib/librte_mbuf -Ilib/librte_mempool -I../lib/librte_mempool -Ilib/librte_ring -I../lib/librte_ring -Ilib/librte_meter -I../lib/librte_meter -Ilib/librte_metrics -I../lib/librte_metrics -Ilib/librte_bpf -I../lib/librte_bpf -Ilib/librte_cfgfile -I../lib/librte_cfgfile -Ilib/librte_cmdline -I../lib/librte_cmdline -Ilib/librte_cryptodev -I../lib/librte_cryptodev -Ilib/librte_distributor -I../lib/librte_distributor -Ilib/librte_efd -I../lib/librte_efd -Ilib/librte_hash -I../lib/librte_hash -Ilib/librte_eventdev -I../lib/librte_eventdev -Ilib/librte_timer -I../lib/librte_timer -Ilib/librte_fib -I../lib/librte_fib -Ilib/librte_rib -I../lib/librte_rib -Ilib/librte_flow_classify -I../lib/librte_flow_classify -Ilib/librte_table -I../lib/librte_table -Ilib/librte_port -I../lib/librte_port -Ilib/librte_sched -I../lib/librte_sched -Ilib/librte_ip_frag -I../lib/librte_ip_frag -Ilib/librte_kni -I../lib/librte_kni -Ilib/librte_pci -I../lib/librte_pci -Ilib/librte_lpm -I../lib/librte_lpm -Ilib/librte_ipsec -I../lib/librte_ipsec -Ilib/librte_security -I../lib/librte_security -Ilib/librte_latencystats -I../lib/librte_latencystats -Ilib/librte_member -I../lib/librte_member -Ilib/librte_pipeline -I../lib/librte_pipeline -Ilib/librte_rawdev -I../lib/librte_rawdev -Ilib/librte_rcu -I../lib/librte_rcu -Ilib/librte_reorder -I../lib/librte_reorder -Ilib/librte_stack -I../lib/librte_stack -Idrivers/mempool/ring -I../drivers/mempool/ring -Idrivers/mempool/stack -I../drivers/mempool/stack -Idrivers/event/skeleton -I../drivers/event/skeleton -Idrivers/bus/pci -I../drivers/bus/pci -I../drivers/bus/pci/linux -Idrivers/bus/vdev -I../drivers/bus/vdev -Idrivers/net/bonding -I../drivers/net/bonding -Idrivers/net/ring -I../drivers/net/ring -Ilib/librte_power -I../lib/librte_power -Ilib/librte_pdump -I../lib/librte_pdump -Ilib/librte_compressdev -I../lib/librte_compressdev -fdiagnostics-color=always -pipe -D_FILE_OFFSET_BITS=64 -Wall -Winvalid-pch -Werror -O3 -include rte_config.h -Wextra -Wcast-qual -Wdeprecated -Wformat-nonliteral -Wformat-security -Wmissing-declarations -Wmissing-prototypes -Wnested-externs -Wold-style-definition -Wpointer-arith -Wsign-compare -Wstrict-prototypes -Wundef -Wwrite-strings -Wno-missing-field-initializers -march=native -mno-avx512f -Wno-format-truncation -D_GNU_SOURCE -DALLOW_EXPERIMENTAL_API -MD -MQ 'app/test/3062f5d@@dpdk-test at exe/test_cryptodev.c.o' -MF 'app/test/3062f5d@@dpdk-test at exe/test_cryptodev.c.o.d' -o 'app/test/3062f5d@@dpdk-test at exe/test_cryptodev.c.o' -c ../app/test/test_cryptodev.c
../app/test/test_cryptodev.c:6700:1: error: ‘test_3DES_chain_openssl_all’ defined but not used [-Werror=unused-function]
 test_3DES_chain_openssl_all(void)
 ^~~~~~~~~~~~~~~~~~~~~~~~~~~
../app/test/test_cryptodev.c:6681:1: error: ‘test_3DES_cipheronly_qat_all’ defined but not used [-Werror=unused-function]
 test_3DES_cipheronly_qat_all(void)
 ^~~~~~~~~~~~~~~~~~~~~~~~~~~~
../app/test/test_cryptodev.c:6662:1: error: ‘test_3DES_cipheronly_ccp_all’ defined but not used [-Werror=unused-function]
 test_3DES_cipheronly_ccp_all(void)
 ^~~~~~~~~~~~~~~~~~~~~~~~~~~~
../app/test/test_cryptodev.c:6643:1: error: ‘test_3DES_chain_ccp_all’ defined but not used [-Werror=unused-function]
 test_3DES_chain_ccp_all(void)
 ^~~~~~~~~~~~~~~~~~~~~~~
../app/test/test_cryptodev.c:6624:1: error: ‘test_3DES_cipheronly_dpaa2_sec_all’ defined but not used [-Werror=unused-function]
 test_3DES_cipheronly_dpaa2_sec_all(void)
 ^~~~~~~~~~~~~~~~~~~~~~~~~~~~~~~~~~
../app/test/test_cryptodev.c:6605:1: error: ‘test_3DES_chain_dpaa2_sec_all’ defined but not used [-Werror=unused-function]
 test_3DES_chain_dpaa2_sec_all(void)
 ^~~~~~~~~~~~~~~~~~~~~~~~~~~~~
../app/test/test_cryptodev.c:6586:1: error: ‘test_3DES_cipheronly_dpaa_sec_all’ defined but not used [-Werror=unused-function]
 test_3DES_cipheronly_dpaa_sec_all(void)
 ^~~~~~~~~~~~~~~~~~~~~~~~~~~~~~~~~
../app/test/test_cryptodev.c:6567:1: error: ‘test_3DES_chain_dpaa_sec_all’ defined but not used [-Werror=unused-function]
 test_3DES_chain_dpaa_sec_all(void)
 ^~~~~~~~~~~~~~~~~~~~~~~~~~~~
../app/test/test_cryptodev.c:6548:1: error: ‘test_3DES_cipheronly_caam_jr_all’ defined but not used [-Werror=unused-function]
 test_3DES_cipheronly_caam_jr_all(void)
 ^~~~~~~~~~~~~~~~~~~~~~~~~~~~~~~~
../app/test/test_cryptodev.c:6529:1: error: ‘test_3DES_chain_caam_jr_all’ defined but not used [-Werror=unused-function]
 test_3DES_chain_caam_jr_all(void)
 ^~~~~~~~~~~~~~~~~~~~~~~~~~~
../app/test/test_cryptodev.c:6510:1: error: ‘test_DES_docsis_mb_all’ defined but not used [-Werror=unused-function]
 test_DES_docsis_mb_all(void)
 ^~~~~~~~~~~~~~~~~~~~~~
../app/test/test_cryptodev.c:6491:1: error: ‘test_3DES_cipheronly_mb_all’ defined but not used [-Werror=unused-function]
 test_3DES_cipheronly_mb_all(void)
 ^~~~~~~~~~~~~~~~~~~~~~~~~~~
../app/test/test_cryptodev.c:6473:1: error: ‘test_DES_cipheronly_mb_all’ defined but not used [-Werror=unused-function]
 test_DES_cipheronly_mb_all(void)
 ^~~~~~~~~~~~~~~~~~~~~~~~~~
../app/test/test_cryptodev.c:6454:1: error: ‘test_DES_docsis_openssl_all’ defined but not used [-Werror=unused-function]
 test_DES_docsis_openssl_all(void)
 ^~~~~~~~~~~~~~~~~~~~~~~~~~~
../app/test/test_cryptodev.c:6435:1: error: ‘test_DES_cipheronly_openssl_all’ defined but not used [-Werror=unused-function]
 test_DES_cipheronly_openssl_all(void)
 ^~~~~~~~~~~~~~~~~~~~~~~~~~~~~~~
../app/test/test_cryptodev.c:6416:1: error: ‘test_DES_cipheronly_qat_all’ defined but not used [-Werror=unused-function]
 test_DES_cipheronly_qat_all(void)
 ^~~~~~~~~~~~~~~~~~~~~~~~~~~
../app/test/test_cryptodev.c:6397:1: error: ‘test_3DES_chain_qat_all’ defined but not used [-Werror=unused-function]
 test_3DES_chain_qat_all(void)
 ^~~~~~~~~~~~~~~~~~~~~~~
cc1: all warnings being treated as errors
[1891/2137] Compiling C object 'app/test/3062f5d@@dpdk-test at exe/test_kvargs.c.o'.
[1892/2137] Compiling C object 'app/test/3062f5d@@dpdk-test at exe/test_ipsec_sad.c.o'.
[1893/2137] Compiling C object 'app/test/3062f5d@@dpdk-test at exe/test_latencystats.c.o'.
[1894/2137] Compiling C object 'app/test/3062f5d@@dpdk-test at exe/test_kni.c.o'.
[1895/2137] Compiling C object 'app/test/3062f5d@@dpdk-test at exe/test_ipsec.c.o'.
ninja: build stopped: subcommand failed




*Meson Build Failed #6:
OS: FreeBSD1201-64
Target:./build-gcc-static
FAILED: app/test/3062f5d@@dpdk-test at exe/test_cryptodev.c.o 
gcc -Iapp/test/3062f5d@@dpdk-test at exe -Iapp/test -I../app/test -Ilib/librte_acl -I../lib/librte_acl -I. -I../ -Iconfig -I../config -Ilib/librte_eal/common/include -I../lib/librte_eal/common/include -I../lib/librte_eal/freebsd/eal/include -Ilib/librte_eal/common -I../lib/librte_eal/common -Ilib/librte_eal/common/include/arch/x86 -I../lib/librte_eal/common/include/arch/x86 -Ilib/librte_eal -I../lib/librte_eal -Ilib/librte_kvargs -I../lib/librte_kvargs -Ilib/librte_bitratestats -I../lib/librte_bitratestats -Ilib/librte_ethdev -I../lib/librte_ethdev -Ilib/librte_net -I../lib/librte_net -Ilib/librte_mbuf -I../lib/librte_mbuf -Ilib/librte_mempool -I../lib/librte_mempool -Ilib/librte_ring -I../lib/librte_ring -Ilib/librte_meter -I../lib/librte_meter -Ilib/librte_metrics -I../lib/librte_metrics -Ilib/librte_bpf -I../lib/librte_bpf -Ilib/librte_cfgfile -I../lib/librte_cfgfile -Ilib/librte_cmdline -I../lib/librte_cmdline -Ilib/librte_cryptodev -I../lib/librte_cryptodev -Ilib/librte_distributor -I../lib/librte_distributor -Ilib/librte_efd -I../lib/librte_efd -Ilib/librte_hash -I../lib/librte_hash -Ilib/librte_eventdev -I../lib/librte_eventdev -Ilib/librte_timer -I../lib/librte_timer -Ilib/librte_fib -I../lib/librte_fib -Ilib/librte_rib -I../lib/librte_rib -Ilib/librte_flow_classify -I../lib/librte_flow_classify -Ilib/librte_table -I../lib/librte_table -Ilib/librte_port -I../lib/librte_port -Ilib/librte_sched -I../lib/librte_sched -Ilib/librte_ip_frag -I../lib/librte_ip_frag -Ilib/librte_lpm -I../lib/librte_lpm -Ilib/librte_ipsec -I../lib/librte_ipsec -Ilib/librte_security -I../lib/librte_security -Ilib/librte_latencystats -I../lib/librte_latencystats -Ilib/librte_member -I../lib/librte_member -Ilib/librte_pipeline -I../lib/librte_pipeline -Ilib/librte_rawdev -I../lib/librte_rawdev -Ilib/librte_rcu -I../lib/librte_rcu -Ilib/librte_reorder -I../lib/librte_reorder -Ilib/librte_stack -I../lib/librte_stack -Idrivers/mempool/ring -I../drivers/mempool/ring -Idrivers/mempool/stack -I../drivers/mempool/stack -Idrivers/event/skeleton -I../drivers/event/skeleton -Idrivers/bus/pci -I../drivers/bus/pci -I../drivers/bus/pci/bsd -Ilib/librte_pci -I../lib/librte_pci -Idrivers/bus/vdev -I../drivers/bus/vdev -Idrivers/net/bonding -I../drivers/net/bonding -Idrivers/net/ring -I../drivers/net/ring -Ilib/librte_pdump -I../lib/librte_pdump -Ilib/librte_compressdev -I../lib/librte_compressdev -fdiagnostics-color=always -pipe -D_FILE_OFFSET_BITS=64 -Wall -Winvalid-pch -Werror -O3 -include rte_config.h -Wextra -Wcast-qual -Wdeprecated -Wformat-nonliteral -Wformat-security -Wmissing-declarations -Wmissing-prototypes -Wnested-externs -Wold-style-definition -Wpointer-arith -Wsign-compare -Wstrict-prototypes -Wundef -Wwrite-strings -Wno-address-of-packed-member -Wno-packed-not-aligned -Wno-missing-field-initializers -D__BSD_VISIBLE -march=native -Wno-format-truncation -D_GNU_SOURCE -DALLOW_EXPERIMENTAL_API -MD -MQ 'app/test/3062f5d@@dpdk-test at exe/test_cryptodev.c.o' -MF 'app/test/3062f5d@@dpdk-test at exe/test_cryptodev.c.o.d' -o 'app/test/3062f5d@@dpdk-test at exe/test_cryptodev.c.o' -c ../app/test/test_cryptodev.c
../app/test/test_cryptodev.c:6700:1: error: 'test_3DES_chain_openssl_all' defined but not used [-Werror=unused-function]
 6700 | test_3DES_chain_openssl_all(void)
      | ^~~~~~~~~~~~~~~~~~~~~~~~~~~
../app/test/test_cryptodev.c:6681:1: error: 'test_3DES_cipheronly_qat_all' defined but not used [-Werror=unused-function]
 6681 | test_3DES_cipheronly_qat_all(void)
      | ^~~~~~~~~~~~~~~~~~~~~~~~~~~~
../app/test/test_cryptodev.c:6662:1: error: 'test_3DES_cipheronly_ccp_all' defined but not used [-Werror=unused-function]
 6662 | test_3DES_cipheronly_ccp_all(void)
      | ^~~~~~~~~~~~~~~~~~~~~~~~~~~~
../app/test/test_cryptodev.c:6643:1: error: 'test_3DES_chain_ccp_all' defined but not used [-Werror=unused-function]
 6643 | test_3DES_chain_ccp_all(void)
      | ^~~~~~~~~~~~~~~~~~~~~~~
../app/test/test_cryptodev.c:6624:1: error: 'test_3DES_cipheronly_dpaa2_sec_all' defined but not used [-Werror=unused-function]
 6624 | test_3DES_cipheronly_dpaa2_sec_all(void)
      | ^~~~~~~~~~~~~~~~~~~~~~~~~~~~~~~~~~
../app/test/test_cryptodev.c:6605:1: error: 'test_3DES_chain_dpaa2_sec_all' defined but not used [-Werror=unused-function]
 6605 | test_3DES_chain_dpaa2_sec_all(void)
      | ^~~~~~~~~~~~~~~~~~~~~~~~~~~~~
../app/test/test_cryptodev.c:6586:1: error: 'test_3DES_cipheronly_dpaa_sec_all' defined but not used [-Werror=unused-function]
 6586 | test_3DES_cipheronly_dpaa_sec_all(void)
      | ^~~~~~~~~~~~~~~~~~~~~~~~~~~~~~~~~
../app/test/test_cryptodev.c:6567:1: error: 'test_3DES_chain_dpaa_sec_all' defined but not used [-Werror=unused-function]
 6567 | test_3DES_chain_dpaa_sec_all(void)
      | ^~~~~~~~~~~~~~~~~~~~~~~~~~~~
../app/test/test_cryptodev.c:6548:1: error: 'test_3DES_cipheronly_caam_jr_all' defined but not used [-Werror=unused-function]
 6548 | test_3DES_cipheronly_caam_jr_all(void)
      | ^~~~~~~~~~~~~~~~~~~~~~~~~~~~~~~~
../app/test/test_cryptodev.c:6529:1: error: 'test_3DES_chain_caam_jr_all' defined but not used [-Werror=unused-function]
 6529 | test_3DES_chain_caam_jr_all(void)
      | ^~~~~~~~~~~~~~~~~~~~~~~~~~~
../app/test/test_cryptodev.c:6510:1: error: 'test_DES_docsis_mb_all' defined but not used [-Werror=unused-function]
 6510 | test_DES_docsis_mb_all(void)
      | ^~~~~~~~~~~~~~~~~~~~~~
../app/test/test_cryptodev.c:6491:1: error: 'test_3DES_cipheronly_mb_all' defined but not used [-Werror=unused-function]
 6491 | test_3DES_cipheronly_mb_all(void)
      | ^~~~~~~~~~~~~~~~~~~~~~~~~~~
../app/test/test_cryptodev.c:6473:1: error: 'test_DES_cipheronly_mb_all' defined but not used [-Werror=unused-function]
 6473 | test_DES_cipheronly_mb_all(void)
      | ^~~~~~~~~~~~~~~~~~~~~~~~~~
../app/test/test_cryptodev.c:6454:1: error: 'test_DES_docsis_openssl_all' defined but not used [-Werror=unused-function]
 6454 | test_DES_docsis_openssl_all(void)
      | ^~~~~~~~~~~~~~~~~~~~~~~~~~~
../app/test/test_cryptodev.c:6435:1: error: 'test_DES_cipheronly_openssl_all' defined but not used [-Werror=unused-function]
 6435 | test_DES_cipheronly_openssl_all(void)
      | ^~~~~~~~~~~~~~~~~~~~~~~~~~~~~~~
../app/test/test_cryptodev.c:6416:1: error: 'test_DES_cipheronly_qat_all' defined but not used [-Werror=unused-function]
 6416 | test_DES_cipheronly_qat_all(void)
      | ^~~~~~~~~~~~~~~~~~~~~~~~~~~
../app/test/test_cryptodev.c:6397:1: error: 'test_3DES_chain_qat_all' defined but not used [-Werror=unused-function]
 6397 | test_3DES_chain_qat_all(void)
      | ^~~~~~~~~~~~~~~~~~~~~~~
cc1: all warnings being treated as errors
[1399/1614] Compiling C object 'app/test/3062f5d@@dpdk-test at exe/test_interrupts.c.o'.
[1400/1614] Compiling C object 'app/test/3062f5d@@dpdk-test at exe/test_hash_readwrite.c.o'.
[1401/1614] Compiling C object 'app/test/3062f5d@@dpdk-test at exe/test_hash_perf.c.o'.
[1402/1614] Compiling C object 'app/test/3062f5d@@dpdk-test at exe/test_hash.c.o'.
[1403/1614] Compiling C object 'app/test/3062f5d@@dpdk-test at exe/test_hash_readwrite_lf.c.o'.
ninja: build stopped: subcommand failed



DPDK STV team


More information about the test-report mailing list