[dpdk-test-report] |FAILURE| pw68663ci: remove aarch64 from Travis jobs

sys_stv at intel.com sys_stv at intel.com
Fri Apr 17 07:12:30 CEST 2020


Test-Label: Intel-compilation
Test-Status: FAILURE
http://dpdk.org/patch/68663

_Compilation issues_

Submitter: Thomas Monjalon <thomas at monjalon.net>
Date: 2020-04-16 11:00:53
Reply_mail: 20200416110053.2547791-1-thomas at monjalon.net
DPDK git baseline: Repo:dpdk, CommitID: b11ecebc045e7e4705584eff7c49ebdec217930b

Makefile build Summary: 23 Builds Done, 23 Successful, 0 Failures

Meson build Summary: 8 Builds Done, 7 Successful, 1 Failures

               +==============================================+===========+==========+
               |                   Makefile                   |   Meson   | Document |
+----------------+------+-------+------+------------+-----------+-----------+----------+
| os             | gcc  | clang | icc  | gcc+shared | gcc+debug | gcc/clang | pdf/html |
+----------------+------+-------+------+------------+-----------+-----------+----------+
| RHEL80-64      | pass |       |      |            |           |           |          |
| UB1804-64      | pass | pass  | pass |            |           | pass      | pass     |
| UB1604-32      | pass |       |      |            |           | pass      |          |
| CENTOS77-64    | pass |       |      |            |           |           |          |
| UB1604-64      | pass | pass  |      |            |           |           |          |
| CENTOS80-64    | pass | pass  | pass | pass       | pass      | FAIL      |          |
| UB1910-64      | pass |       |      |            |           |           |          |
| FC31-64        | pass | pass  |      |            |           | pass      |          |
| WIN10-64       |      |       |      |            |           | pass      |          |
| FreeBSD1201-64 | pass | pass  |      | pass       | pass      | pass      |          |
| RHEL77-64      | pass |       |      |            |           |           |          |
| SUSE15-64      | pass | pass  |      |            |           | pass      |          |
+----------------+------+-------+------+------------+-----------+-----------+----------+

Test environment and configuration as below:

** Makefile build **


OS: UB1804-64
	Kernel Version: 4.15.0-20-generic
	CPU info: Intel(R) Xeon(R) CPU E5-2699 v3 @ 2.30GHz
	GCC Version: gcc (Ubuntu 7.3.0-16ubuntu3) 7.3.0
	Clang Version: 6.0.0-1ubuntu2 (tags/RELEASE_600/final)
	x86_64-native-linuxapp-clang
	x86_64-native-linuxapp-icc
	x86_64-native-linuxapp-gcc


OS: UB1604-32
	Kernel Version: 4.4.0-131-generic
	CPU info: Intel(R) Xeon(R) Platinum 8180 CPU @ 2.50GHz
	GCC Version: gcc (Ubuntu 5.4.0-6ubuntu1~16.04.11) 5.4.0 20160609
	Clang Version: 3.8.0-2ubuntu4 (tags/RELEASE_380/final)
	i686-native-linuxapp-gcc


OS: CENTOS77-64
	Kernel Version: 3.10.0-1062.9.1.el7.x86_64
	CPU info: Intel(R) Xeon(R) CPU E5-2699 v3 @ 2.30GHz
	GCC Version: gcc (GCC) 4.8.5 20150623 (Red Hat 4.8.5-39)
	Clang Version: 3.4.2 (tags/RELEASE_34/dot2-final)
	x86_64-native-linuxapp-gcc


OS: UB1604-64
	Kernel Version: 4.4.0-176-generic
	CPU info: Intel(R) Xeon(R) CPU E5-2699 v3 @ 2.30GHz
	GCC Version: gcc (Ubuntu 5.4.0-6ubuntu1~16.04.12) 5.4.0 20160609
	Clang Version: 3.8.0-2ubuntu4 (tags/RELEASE_380/final)
	x86_64-native-linuxapp-clang
	x86_64-native-linuxapp-gcc


OS: CENTOS80-64
	Kernel Version: 4.18.0-80.11.2.el8_0.x86_64
	CPU info: Intel(R) Xeon(R) CPU E5-2699 v3 @ 2.30GHz
	GCC Version: gcc (GCC) 8.2.1 20180905 (Red Hat 8.2.1-3)
	Clang Version: 7.0.1 (tags/RELEASE_701/final)
	x86_64-native-linuxapp-gcc+shared
	x86_64-native-linuxapp-gcc+debug
	x86_64-native-linuxapp-gcc
	x86_64-native-linuxapp-clang
	x86_64-native-linuxapp-icc


OS: UB1910-64
	Kernel Version: 5.3.0-18-generic
	CPU info: Intel(R) Xeon(R) Platinum 8180 CPU @ 2.50GHz
	GCC Version: gcc (Ubuntu 9.2.1-9ubuntu2) 9.2.1 20191008
	Clang Version: 9.0.0-2 (tags/RELEASE_900/final)
	x86_64-native-linuxapp-gcc


OS: FC31-64
	Kernel Version: 5.3.15-300.fc31.x86_64
	CPU info: Intel(R) Xeon(R) CPU E5-2699 v4 @ 2.20GHz
	GCC Version: gcc (GCC) 9.2.1 20190827 (Red Hat 9.2.1-1)
	Clang Version: 9.0.0 (Fedora 9.0.0-1.fc31)
	x86_64-native-linuxapp-gcc
	x86_64-native-linuxapp-clang


OS: RHEL80-64
	Kernel Version: 4.18.0-80.el8.x86_64
	CPU info: Intel(R) Xeon(R) CPU E5-2699 v4 @ 2.20GHz
	GCC Version: gcc (GCC) 8.2.1 20180905 (Red Hat 8.2.1-3)
	Clang Version: 6.0.1 (tags/RELEASE_601/final)
	x86_64-native-linuxapp-gcc


OS: FreeBSD1201-64
	Kernel Version: 12.1-RELEASE
	CPU info: Intel(R) Xeon(R) CPU E5-2699 v3 @ 2.30GHz (2294.75-MHz K8-class CPU)
	GCC Version: gcc (FreeBSD Ports Collection) 9.2.0
	Clang Version: 8.0.1 (tags/RELEASE_801/final 366581) (based on LLVM 8.0.1)
	x86_64-native-bsdapp-gcc+debug
	x86_64-native-bsdapp-gcc+shared
	x86_64-native-bsdapp-gcc
	x86_64-native-bsdapp-clang


OS: RHEL77-64
	Kernel Version: 3.10.0-1062.9.1.el7.x86_64
	CPU info: Intel(R) Xeon(R) CPU E5-2699 v4 @ 2.20GHz
	GCC Version: gcc (GCC) 4.8.5 20150623 (Red Hat 4.8.5-39)
	Clang Version: 3.4.2 (tags/RELEASE_34/dot2-final)
	x86_64-native-linuxapp-gcc


OS: SUSE15-64
	Kernel Version: 4.12.14-lp150.11-default
	CPU info: Intel(R) Xeon(R) CPU E5-2699 v4 @ 2.20GHz
	GCC Version: gcc (SUSE Linux) 7.3.1 20180323 [gcc-7-branch revision 258812]
	Clang Version: 5.0.1 (tags/RELEASE_501/final 312548)
	x86_64-native-linuxapp-clang
	x86_64-native-linuxapp-gcc


** Meson build **


OS: UB1804-64
	Kernel Version: 4.15.0-20-generic
	CPU info: Intel(R) Xeon(R) CPU E5-2699 v4 @ 2.20GHz
	GCC Version: gcc (Ubuntu 7.3.0-27ubuntu1~18.04) 7.3.0
	Clang Version: 6.0.0-1ubuntu2 (tags/RELEASE_600/final)
	x86_64-native-linuxapp-doc
	./build-gcc-static
	./build-gcc-shared
	./build-clang-static
	./build-clang-shared
	./build-x86-default


OS: UB1604-32
	Kernel Version: 4.4.0-131-generic
	CPU info: Intel(R) Xeon(R) CPU E5-2699 v4 @ 2.20GHz
	GCC Version: gcc (Ubuntu 5.4.0-6ubuntu1~16.04.11) 5.4.0 20160609
	Clang Version: 3.8.0-2ubuntu4 (tags/RELEASE_380/final)
	./build-gcc-static
	./build-gcc-shared
	./build-clang-static
	./build-clang-shared
	./build-x86-default


OS: CENTOS80-64
	Kernel Version: 4.18.0-80.11.2.el8_0.x86_64
	CPU info: Intel(R) Xeon(R) CPU E5-2699 v4 @ 2.20GHz
	GCC Version: gcc (GCC) 8.2.1 20180905 (Red Hat 8.2.1-3)
	Clang Version: 7.0.1 (tags/RELEASE_701/final)
	./build-gcc-static
	./build-gcc-shared
	./build-clang-static
	./build-clang-shared
	./build-x86-default


OS: FC31-64
	Kernel Version: 5.4.18-200.fc31.x86_64
	CPU info: Intel(R) Xeon(R) CPU E5-2699 v4 @ 2.20GHz
	GCC Version: gcc (GCC) 9.2.1 20190827 (Red Hat 9.2.1-1)
	Clang Version: 9.0.0 (Fedora 9.0.0-1.fc31)
	./build-gcc-static
	./build-gcc-shared
	./build-clang-static
	./build-clang-shared
	./build-x86-default


OS: WIN10-64
	Kernel Version: N/A
	CPU info: N/A
	GCC Version: N/A
	Clang Version: Clang 8.0.0
	x86_64-windows-clang


OS: FreeBSD1201-64
	Kernel Version: 12.1-RELEASE
	CPU info: Intel(R) Xeon(R) CPU E5-2699 v4 @ 2.20GHz (2194.98-MHz K8-class CPU)
	GCC Version: gcc (FreeBSD Ports Collection) 9.2.0
	Clang Version: 8.0.1 (tags/RELEASE_801/final 366581) (based on LLVM 8.0.1)
	./build-gcc-static
	./build-gcc-shared
	./build-clang-static
	./build-clang-shared
	./build-x86-default


OS: SUSE15-64
	Kernel Version: 4.12.14-lp150.12.82-default
	CPU info: Intel(R) Xeon(R) CPU E5-2699 v4 @ 2.20GHz
	GCC Version: gcc (SUSE Linux) 7.4.1 20190905 [gcc-7-branch revision 275407]
	Clang Version: 5.0.1 (tags/RELEASE_501/final 312548)
	./build-gcc-static
	./build-gcc-shared
	./build-clang-static
	./build-clang-shared
	./build-x86-default


*Meson Build Failed #1:
OS: CENTOS80-64
Target:./build-gcc-static
[94/2253] Generating pci_def with a custom command.
[95/2253] Compiling C object 'lib/76b5a35@@rte_ethdev at sta/librte_ethdev_rte_class_eth.c.o'.
[96/2253] Generating net.exp_chk with a meson_exe.py custom command.
[97/2253] Compiling C object 'lib/76b5a35@@rte_cmdline at sta/librte_cmdline_cmdline.c.o'.
[98/2253] Compiling C object 'lib/76b5a35@@rte_eal at sta/librte_eal_common_eal_common_options.c.o'.
FAILED: lib/76b5a35@@rte_eal at sta/librte_eal_common_eal_common_options.c.o 
clang -Ilib/76b5a35@@rte_eal at sta -Ilib -I../lib -I. -I../ -Iconfig -I../config -Ilib/librte_eal/include -I../lib/librte_eal/include -Ilib/librte_eal/linux/include -I../lib/librte_eal/linux/include -Ilib/librte_eal/common -I../lib/librte_eal/common -Ilib/librte_eal/x86/include -I../lib/librte_eal/x86/include -Ilib/librte_eal -I../lib/librte_eal -Ilib/librte_kvargs -I../lib/librte_kvargs -Xclang -fcolor-diagnostics -pipe -D_FILE_OFFSET_BITS=64 -Wall -Winvalid-pch -Werror -O2 -g -include rte_config.h -Wextra -Wcast-qual -Wdeprecated -Wformat-nonliteral -Wformat-security -Wmissing-declarations -Wmissing-prototypes -Wnested-externs -Wold-style-definition -Wpointer-arith -Wsign-compare -Wstrict-prototypes -Wundef -Wwrite-strings -Wno-address-of-packed-member -Wno-missing-field-initializers -D_GNU_SOURCE -fPIC -march=native -mno-avx512f -DALLOW_EXPERIMENTAL_API -DRTE_LIBEAL_USE_GETENTROPY -DHAVE_GETOPT_H -DHAVE_GETOPT -DHAVE_GETOPT_LONG -MD -MQ 'lib/76b5a35@@rte_eal at sta/librte_eal_common_eal_common_options.c.o' -MF 'lib/76b5a35@@rte_eal at sta/librte_eal_common_eal_common_options.c.o.d' -o 'lib/76b5a35@@rte_eal at sta/librte_eal_common_eal_common_options.c.o' -c ../lib/librte_eal/common/eal_common_options.c
Stack dump:
0.	Program arguments: /usr/bin/clang-7 -cc1 -triple x86_64-unknown-linux-gnu -emit-obj -disable-free -disable-llvm-verifier -discard-value-names -main-file-name eal_common_options.c -mrelocation-model pic -pic-level 2 -mthread-model posix -fmath-errno -masm-verbose -mconstructor-aliases -munwind-tables -fuse-init-array -target-cpu broadwell -target-feature +sse2 -target-feature +cx16 -target-feature +sahf -target-feature -tbm -target-feature -avx512ifma -target-feature -sha -target-feature -gfni -target-feature -fma4 -target-feature -vpclmulqdq -target-feature +prfchw -target-feature +bmi2 -target-feature -cldemote -target-feature +fsgsbase -target-feature -ptwrite -target-feature -xsavec -target-feature +popcnt -target-feature +aes -target-feature -avx512bitalg -target-feature -movdiri -target-feature -xsaves -target-feature -avx512er -target-feature -avx512vnni -target-feature -avx512vpopcntdq -target-feature -pconfig -target-feature -clwb -target-feature -clzero -target-feature -pku -target-feature +mmx -target-feature -lwp -target-feature -rdpid -target-feature -xop -target-feature +rdseed -target-feature -waitpkg -target-feature -movdir64b -target-feature -sse4a -target-feature -avx512bw -target-feature -clflushopt -target-feature +xsave -target-feature -avx512vbmi2 -target-feature -avx512vl -target-feature +invpcid -target-feature -avx512cd -target-feature +avx -target-feature -vaes -target-feature +rtm -target-feature +fma -target-feature +bmi -target-feature +rdrnd -target-feature -mwaitx -target-feature +sse4.1 -target-feature +sse4.2 -target-feature +avx2 -target-feature -wbnoinvd -target-feature +sse -target-feature +lzcnt -target-feature +pclmul -target-feature -prefetchwt1 -target-feature +f16c -target-feature +ssse3 -target-feature -sgx -target-feature -shstk -target-feature +cmov -target-feature -avx512vbmi -target-feature +movbe -target-feature +xsaveopt -target-feature -avx512dq -target-feature +adx -target-feature -avx512pf -target-feature +sse3 -target-feature -avx512f -dwarf-column-info -debug-info-kind=limited -dwarf-version=4 -debugger-tuning=gdb -momit-leaf-frame-pointer -coverage-notes-file /root/CENTOS80-64_K4.18.0_GCC8.2.1/x86_64-native-linuxapp-gcc/a1dbe86f6b814c2d9cde956009ebaf13/dpdk/build-clang-static/lib/76b5a35@@rte_eal at sta/librte_eal_common_eal_common_options.c.gcno -resource-dir /usr/lib64/clang/7.0.1 -dependency-file lib/76b5a35@@rte_eal at sta/librte_eal_common_eal_common_options.c.o.d -sys-header-deps -MT lib/76b5a35@@rte_eal at sta/librte_eal_common_eal_common_options.c.o -include rte_config.h -I lib/76b5a35@@rte_eal at sta -I lib -I ../lib -I . -I ../ -I config -I ../config -I lib/librte_eal/include -I ../lib/librte_eal/include -I lib/librte_eal/linux/include -I ../lib/librte_eal/linux/include -I lib/librte_eal/common -I ../lib/librte_eal/common -I lib/librte_eal/x86/include -I ../lib/librte_eal/x86/include -I lib/librte_eal -I ../lib/librte_eal -I lib/librte_kvargs -I ../lib/librte_kvargs -D _FILE_OFFSET_BITS=64 -D _GNU_SOURCE -D ALLOW_EXPERIMENTAL_API -D RTE_LIBEAL_USE_GETENTROPY -D HAVE_GETOPT_H -D HAVE_GETOPT -D HAVE_GETOPT_LONG -internal-isystem /usr/local/include -internal-isystem /usr/lib64/clang/7.0.1/include -internal-externc-isystem /include -internal-externc-isystem /usr/include -O2 -Wall -Winvalid-pch -Werror -Wextra -Wcast-qual -Wdeprecated -Wformat-nonliteral -Wformat-security -Wmissing-declarations -Wmissing-prototypes -Wnested-externs -Wold-style-definition -Wpointer-arith -Wsign-compare -Wstrict-prototypes -Wundef -Wwrite-strings -Wno-address-of-packed-member -Wno-missing-field-initializers -fconst-strings -fdebug-compilation-dir /root/CENTOS80-64_K4.18.0_GCC8.2.1/x86_64-native-linuxapp-gcc/a1dbe86f6b814c2d9cde956009ebaf13/dpdk/build-clang-static -ferror-limit 19 -fmessage-length 0 -fobjc-runtime=gcc -fdiagnostics-show-option -vectorize-loops -vectorize-slp -fcolor-diagnostics -o lib/76b5a35@@rte_eal at sta/librte_eal_common_eal_common_options.c.o -x c ../lib/librte_eal/common/eal_common_options.c -faddrsig 
1.	<eof> parser at end of file
2.	Per-function optimization
--
/lib64/libLLVM-7.so(+0x8fd465)[0x7fcce4618465]
/lib64/libpthread.so.0(+0x12d80)[0x7fcce3b0dd80]
/lib64/libLLVM-7.so(_ZNK4llvm10DataLayout22getIndexedOffsetInTypeEPNS_4TypeENS_8ArrayRefIPNS_5ValueEEE+0x2cc)[0x7fcce469260c]
[0x55afa3a36ff8]
clang-7: error: unable to execute command: Segmentation fault (core dumped)
clang-7: error: clang frontend command failed due to signal (use -v to see invocation)
clang version 7.0.1 (tags/RELEASE_701/final)
Target: x86_64-unknown-linux-gnu
Thread model: posix
InstalledDir: /usr/bin
clang-7: note: diagnostic msg: PLEASE submit a bug report to  and include the crash backtrace, preprocessed source, and associated run script.
--
[103/2253] Compiling C object 'lib/76b5a35@@rte_cmdline at sta/librte_cmdline_cmdline_parse.c.o'.
[104/2253] Compiling C object 'lib/76b5a35@@rte_cmdline at sta/librte_cmdline_cmdline_rdline.c.o'.
[105/2253] Compiling C object 'lib/76b5a35@@rte_ethdev at sta/librte_ethdev_rte_tm.c.o'.
[106/2253] Compiling C object 'lib/76b5a35@@rte_ethdev at sta/librte_ethdev_rte_flow.c.o'.
[107/2253] Compiling C object 'lib/76b5a35@@rte_ethdev at sta/librte_ethdev_rte_ethdev.c.o'.
ninja: build stopped: subcommand failed.
meson  --werror -Dexamples=all --buildtype=debugoptimized --default-library=shared /root/CENTOS80-64_K4.18.0_GCC8.2.1/x86_64-native-linuxapp-gcc/a1dbe86f6b814c2d9cde956009ebaf13/dpdk/devtools/.. ./build-clang-shared
The Meson build system
Version: 0.52.1
Source dir: /root/CENTOS80-64_K4.18.0_GCC8.2.1/x86_64-native-linuxapp-gcc/a1dbe86f6b814c2d9cde956009ebaf13/dpdk
Build dir: /root/CENTOS80-64_K4.18.0_GCC8.2.1/x86_64-native-linuxapp-gcc/a1dbe86f6b814c2d9cde956009ebaf13/dpdk/build-clang-shared

DPDK STV team


More information about the test-report mailing list