[dpdk-test-report] |FAILURE| pw(85651) [v2, 2/2] examples/vhost: refactor vhost data path

sys_stv at intel.com sys_stv at intel.com
Tue Dec 22 12:44:45 CET 2020


Test-Label: Intel-compilation
Test-Status: FAILURE
http://dpdk.org/patch/85651

_Compilation issues_

Submitter: Cheng Jiang <Cheng1.jiang at intel.com>
Date: 2020-12-22 08:36:23
Reply_mail: 20201222083623.36763-3-Cheng1.jiang at intel.com

DPDK git baseline: Repo:dpdk-next-virtio, CommitID: af356f5ca2f7a92d65f99472d431d9759f85cbba


Meson Build Summary: 22 Builds Done, 7 Successful, 15 Failures, 0 Blocked

+----------------+------------+--------------+------------+------------+-----------+----------+
| os             | gcc-static | clang-static | icc-static | gcc-shared | gcc-debug | document |
+----------------+------------+--------------+------------+------------+-----------+----------+
| CENTOS82-64    | FAIL       | FAIL         | FAIL       | pass       | FAIL      |          |
| RHEL82-64      | FAIL       |              |            |            |           |          |
| UB1804-64      | FAIL       |              |            |            |           |          |
| FC33-64        | FAIL       | FAIL         |            |            |           |          |
| UB2010-64      | FAIL       |              |            |            |           |          |
| UB2004-64      | FAIL       | FAIL         | FAIL       |            |           | pass     |
| WIN10-64       |            | pass         |            |            |           |          |
| UB2004-32      | FAIL       |              |            |            |           |          |
| FreeBSD1201-64 | pass       | pass         |            | pass       | pass      |          |
| SUSE15-64      | FAIL       | FAIL         |            |            |           |          |
+----------------+------------+--------------+------------+------------+-----------+----------+
Test environment and configuration as below:


OS: CENTOS82-64
	Kernel Version: 4.18.0-193.14.2.el8_2.x86_64
	CPU info: Intel(R) Xeon(R) Platinum 8280M CPU @ 2.70GHz
	GCC Version: gcc (GCC) 8.3.1 20191121 (Red Hat 8.3.1-5)
	Clang Version: 10.0.1 (Red Hat 10.0.1-1.module_el8.3.0+467+cb298d5b)
	x86_64-native-linuxapp-gcc
	x86_64-native-linuxapp-clang
	x86_64-native-linuxapp-icc
	x86_64-native-linuxapp-gcc+shared
	x86_64-native-linuxapp-gcc+debug

OS: RHEL82-64
	Kernel Version: 4.18.0-193.el8.x86_64
	CPU info: Intel(R) Xeon(R) CPU E5-2699 v4 @ 2.20GHz
	GCC Version: gcc (GCC) 8.3.1 20191121 (Red Hat 8.3.1-5)
	Clang Version: 8.0.1 (Red Hat 8.0.1-1.module_el8.1.0+215+a01033fb)
	x86_64-native-linuxapp-gcc

OS: UB1804-64
	Kernel Version: 5.3.0-59-generic
	CPU info: Intel(R) Xeon(R) Platinum 8180 CPU @ 2.50GHz
	GCC Version: gcc (Ubuntu 8.4.0-1ubuntu1~18.04) 8.4.0
	Clang Version: 6.0.0-1ubuntu2 (tags/RELEASE_600/final)
	x86_64-native-linuxapp-gcc

OS: FC33-64
	Kernel Version: 5.8.16-300.fc33.x86_64
	CPU info: Intel(R) Xeon(R) CPU E5-2699 v4 @ 2.20GHz
	GCC Version: gcc (GCC) 10.2.1 20201005 (Red Hat 10.2.1-5)
	Clang Version: 11.0.0 (Fedora 11.0.0-1.fc33)
	x86_64-native-linuxapp-gcc
	x86_64-native-linuxapp-clang

OS: UB2010-64
	Kernel Version: 5.8.0-25-generic
	CPU info: Intel(R) Xeon(R) CPU E5-2699 v4 @ 2.20GHz
	GCC Version: gcc (Ubuntu 10.2.0-13ubuntu1) 10.2.0
	Clang Version: 11.0.0-2
	x86_64-native-linuxapp-gcc

OS: UB2004-64
	Kernel Version: 5.4.0-47-generic
	CPU info: Intel(R) Xeon(R) Platinum 8180 CPU @ 2.50GHz
	GCC Version: gcc (Ubuntu 10-20200416-0ubuntu1) 10.0.1 20200416 (experimental) [master revision 3c3f12e2a76:dcee354ce56:44b326839d864fc10c459916abcc97f35a9ac3de]
	Clang Version: 10.0.0-4ubuntu1
	x86_64-native-linuxapp-clang
	x86_64-native-linuxapp-gcc
	x86_64-native-linuxapp-icc
	x86_64-native-linuxapp-doc

OS: WIN10-64
	Kernel Version: N/A
	CPU info: N/A
	GCC Version: N/A
	Clang Version: Clang 8.0.0
	x86_64-windows-clang

OS: UB2004-32
	Kernel Version: 5.4.0-47-generic
	CPU info: Intel(R) Xeon(R) Platinum 8180 CPU @ 2.50GHz
	GCC Version: gcc (Ubuntu 9.3.0-10ubuntu2) 9.3.0
	Clang Version: 10.0.0-4ubuntu1
	i686-native-linuxapp-gcc

OS: FreeBSD1201-64
	Kernel Version: 12.1-RELEASE
	CPU info: Intel(R) Xeon(R) CPU E5-2699 v3 @ 2.30GHz (2294.74-MHz K8-class CPU)
	GCC Version: gcc (FreeBSD Ports Collection) 9.2.0
	Clang Version: 8.0.1 (tags/RELEASE_801/final 366581) (based on LLVM 8.0.1)
	x86_64-native-bsdapp-gcc
	x86_64-native-bsdapp-clang
	x86_64-native-bsdapp-gcc+shared
	x86_64-native-bsdapp-gcc+debug

OS: SUSE15-64
	Kernel Version: 4.12.14-lp150.11-default
	CPU info: Intel(R) Xeon(R) CPU E5-2699 v4 @ 2.20GHz
	GCC Version: gcc (SUSE Linux) 7.3.1 20180323 [gcc-7-branch revision 258812]
	Clang Version: 5.0.1 (tags/RELEASE_501/final 312548)
	x86_64-native-linuxapp-clang
	x86_64-native-linuxapp-gcc



*Build Failed #1:
OS: CENTOS82-64
Target: x86_64-native-linuxapp-gcc
FAILED: examples/dpdk-vhost.p/vhost_main.c.o 
gcc -Iexamples/dpdk-vhost.p -Iexamples -I../examples -Iexamples/vhost -I../examples/vhost -I. -I.. -Iconfig -I../config -Ilib/librte_eal/include -I../lib/librte_eal/include -Ilib/librte_eal/linux/include -I../lib/librte_eal/linux/include -Ilib/librte_eal/x86/include -I../lib/librte_eal/x86/include -Ilib/librte_eal/common -I../lib/librte_eal/common -Ilib/librte_eal -I../lib/librte_eal -Ilib/librte_kvargs -I../lib/librte_kvargs -Ilib/librte_metrics -I../lib/librte_metrics -Ilib/librte_telemetry -I../lib/librte_telemetry -Ilib/librte_mempool -I../lib/librte_mempool -Ilib/librte_ring -I../lib/librte_ring -Ilib/librte_net -I../lib/librte_net -Ilib/librte_mbuf -I../lib/librte_mbuf -Ilib/librte_ethdev -I../lib/librte_ethdev -Ilib/librte_meter -I../lib/librte_meter -Ilib/librte_cmdline -I../lib/librte_cmdline -Ilib/librte_vhost -I../lib/librte_vhost -Ilib/librte_cryptodev -I../lib/librte_cryptodev -Ilib/librte_hash -I../lib/librte_hash -Ilib/librte_rcu -I../lib/librte_rcu -Ilib/librte_pci -I../lib/librte_pci -Idrivers/raw/ioat -I../drivers/raw/ioat -Ilib/librte_rawdev -I../lib/librte_rawdev -Idrivers/bus/pci -I../drivers/bus/pci -I../drivers/bus/pci/linux -Idrivers/bus/vdev -I../drivers/bus/vdev -fdiagnostics-color=always -pipe -D_FILE_OFFSET_BITS=64 -Wall -Winvalid-pch -Werror -O3 -include rte_config.h -Wextra -Wcast-qual -Wdeprecated -Wformat -Wformat-nonliteral -Wformat-security -Wmissing-declarations -Wmissing-prototypes -Wnested-externs -Wold-style-definition -Wpointer-arith -Wsign-compare -Wstrict-prototypes -Wundef -Wwrite-strings -Wno-packed-not-aligned -Wno-missing-field-initializers -D_GNU_SOURCE -march=native -Wno-format-truncation -DALLOW_EXPERIMENTAL_API -MD -MQ examples/dpdk-vhost.p/vhost_main.c.o -MF examples/dpdk-vhost.p/vhost_main.c.o.d -o examples/dpdk-vhost.p/vhost_main.c.o -c ../examples/vhost/main.c
../examples/vhost/main.c: In function ‘drain_vhost’:
../examples/vhost/main.c:871:9: error: too many arguments to function ‘rte_vhost_submit_enqueue_burst’
   ret = rte_vhost_submit_enqueue_burst(vdev->vid, VIRTIO_RXQ,
         ^~~~~~~~~~~~~~~~~~~~~~~~~~~~~~
In file included from ../examples/vhost/ioat.h:10,
                 from ../examples/vhost/main.c:28:
../lib/librte_vhost/rte_vhost_async.h:166:10: note: declared here
 uint16_t rte_vhost_submit_enqueue_burst(int vid, uint16_t queue_id,
          ^~~~~~~~~~~~~~~~~~~~~~~~~~~~~~
../examples/vhost/main.c: In function ‘drain_eth_rx’:
../examples/vhost/main.c:1171:19: error: too many arguments to function ‘rte_vhost_submit_enqueue_burst’
   enqueue_count = rte_vhost_submit_enqueue_burst(vdev->vid,
                   ^~~~~~~~~~~~~~~~~~~~~~~~~~~~~~
In file included from ../examples/vhost/ioat.h:10,
                 from ../examples/vhost/main.c:28:
../lib/librte_vhost/rte_vhost_async.h:166:10: note: declared here
 uint16_t rte_vhost_submit_enqueue_burst(int vid, uint16_t queue_id,
          ^~~~~~~~~~~~~~~~~~~~~~~~~~~~~~
[2657/2737] Compiling C object examples/dpdk-vhost_blk.p/vhost_blk_vhost_blk.c.o
[2658/2737] Compiling C object examples/dpdk-vhost.p/vhost_ioat.c.o
[2659/2737] Compiling C object examples/dpdk-vmdq_dcb.p/vmdq_dcb_main.c.o
[2660/2737] Compiling C object examples/dpdk-vhost.p/vhost_virtio_net.c.o
[2661/2737] Compiling C object drivers/libtmp_rte_event_octeontx2.a.p/event_octeontx2_otx2_worker_dual.c.o
[2662/2737] Compiling C object drivers/libtmp_rte_event_octeontx2.a.p/event_octeontx2_otx2_worker.c.o
[2663/2737] Generating rte_kni with a custom command
make: Entering directory '/usr/src/kernels/4.18.0-193.14.2.el8_2.x86_64'
  CC [M]  /root/CENTOS82-64_K4.18.0_GCC8.3.1/x86_64-native-linuxapp-gcc/58b516968ddb4c309879333801f5b2b3/dpdk/x86_64-native-linuxapp-gcc/kernel/linux/kni/kni_net.o
  CC [M]  /root/CENTOS82-64_K4.18.0_GCC8.3.1/x86_64-native-linuxapp-gcc/58b516968ddb4c309879333801f5b2b3/dpdk/x86_64-native-linuxapp-gcc/kernel/linux/kni/kni_misc.o
  LD [M]  /root/CENTOS82-64_K4.18.0_GCC8.3.1/x86_64-native-linuxapp-gcc/58b516968ddb4c309879333801f5b2b3/dpdk/x86_64-native-linuxapp-gcc/kernel/linux/kni/rte_kni.o
  Building modules, stage 2.
  MODPOST 1 modules
  CC      /root/CENTOS82-64_K4.18.0_GCC8.3.1/x86_64-native-linuxapp-gcc/58b516968ddb4c309879333801f5b2b3/dpdk/x86_64-native-linuxapp-gcc/kernel/linux/kni/rte_kni.mod.o
  LD [M]  /root/CENTOS82-64_K4.18.0_GCC8.3.1/x86_64-native-linuxapp-gcc/58b516968ddb4c309879333801f5b2b3/dpdk/x86_64-native-linuxapp-gcc/kernel/linux/kni/rte_kni.ko
make: Leaving directory '/usr/src/kernels/4.18.0-193.14.2.el8_2.x86_64'
ninja: build stopped




*Build Failed #2:
OS: CENTOS82-64
Target: x86_64-native-linuxapp-clang
FAILED: examples/dpdk-vhost.p/vhost_main.c.o 
clang -Iexamples/dpdk-vhost.p -Iexamples -I../examples -Iexamples/vhost -I../examples/vhost -I. -I.. -Iconfig -I../config -Ilib/librte_eal/include -I../lib/librte_eal/include -Ilib/librte_eal/linux/include -I../lib/librte_eal/linux/include -Ilib/librte_eal/x86/include -I../lib/librte_eal/x86/include -Ilib/librte_eal/common -I../lib/librte_eal/common -Ilib/librte_eal -I../lib/librte_eal -Ilib/librte_kvargs -I../lib/librte_kvargs -Ilib/librte_metrics -I../lib/librte_metrics -Ilib/librte_telemetry -I../lib/librte_telemetry -Ilib/librte_mempool -I../lib/librte_mempool -Ilib/librte_ring -I../lib/librte_ring -Ilib/librte_net -I../lib/librte_net -Ilib/librte_mbuf -I../lib/librte_mbuf -Ilib/librte_ethdev -I../lib/librte_ethdev -Ilib/librte_meter -I../lib/librte_meter -Ilib/librte_cmdline -I../lib/librte_cmdline -Ilib/librte_vhost -I../lib/librte_vhost -Ilib/librte_cryptodev -I../lib/librte_cryptodev -Ilib/librte_hash -I../lib/librte_hash -Ilib/librte_rcu -I../lib/librte_rcu -Ilib/librte_pci -I../lib/librte_pci -Idrivers/raw/ioat -I../drivers/raw/ioat -Ilib/librte_rawdev -I../lib/librte_rawdev -Idrivers/bus/pci -I../drivers/bus/pci -I../drivers/bus/pci/linux -Idrivers/bus/vdev -I../drivers/bus/vdev -Xclang -fcolor-diagnostics -pipe -D_FILE_OFFSET_BITS=64 -Wall -Winvalid-pch -Werror -O3 -include rte_config.h -Wextra -Wcast-qual -Wdeprecated -Wformat -Wformat-nonliteral -Wformat-security -Wmissing-declarations -Wmissing-prototypes -Wnested-externs -Wold-style-definition -Wpointer-arith -Wsign-compare -Wstrict-prototypes -Wundef -Wwrite-strings -Wno-address-of-packed-member -Wno-missing-field-initializers -D_GNU_SOURCE -march=native -DALLOW_EXPERIMENTAL_API -MD -MQ examples/dpdk-vhost.p/vhost_main.c.o -MF examples/dpdk-vhost.p/vhost_main.c.o.d -o examples/dpdk-vhost.p/vhost_main.c.o -c ../examples/vhost/main.c
../examples/vhost/main.c:872:18: error: too many arguments to function call, expected 4, have 6
                                        m, nr_xmit, m_cpu_cpl, &cpu_cpl_nr);
                                                    ^~~~~~~~~~~~~~~~~~~~~~
../lib/librte_vhost/rte_vhost_async.h:165:1: note: 'rte_vhost_submit_enqueue_burst' declared here
__rte_experimental
^
../lib/librte_eal/include/rte_compat.h:17:28: note: expanded from macro '__rte_experimental'
#define __rte_experimental \
                           ^
../examples/vhost/main.c:1173:6: error: too many arguments to function call, expected 4, have 6
                                        m_cpu_cpl, &cpu_cpl_nr);
                                        ^~~~~~~~~~~~~~~~~~~~~~
../lib/librte_vhost/rte_vhost_async.h:165:1: note: 'rte_vhost_submit_enqueue_burst' declared here
__rte_experimental
^
../lib/librte_eal/include/rte_compat.h:17:28: note: expanded from macro '__rte_experimental'
#define __rte_experimental \
                           ^
2 errors generated.
[2651/2740] Compiling C object examples/dpdk-vdpa.p/vdpa_main.c.o
[2652/2740] Compiling C object examples/dpdk-efd_node.p/server_node_efd_node_node.c.o
[2653/2740] Compiling C object examples/dpdk-vhost.p/vhost_ioat.c.o
[2654/2740] Compiling C object examples/dpdk-efd_server.p/server_node_efd_server_main.c.o
[2655/2740] Compiling C object examples/dpdk-vhost.p/vhost_virtio_net.c.o
[2656/2740] Compiling C object app/test/dpdk-test.p/test_ring.c.o
[2657/2740] Compiling C object drivers/libtmp_rte_event_octeontx2.a.p/event_octeontx2_otx2_worker.c.o
[2658/2740] Compiling C object drivers/libtmp_rte_event_octeontx2.a.p/event_octeontx2_otx2_worker_dual.c.o
[2659/2740] Compiling C object app/test/dpdk-test.p/test_ring_perf.c.o
ninja: build stopped




*Build Failed #3:
OS: CENTOS82-64
Target: x86_64-native-linuxapp-icc
FAILED: examples/dpdk-vhost.p/vhost_main.c.o 
icc -Iexamples/dpdk-vhost.p -Iexamples -I../examples -Iexamples/vhost -I../examples/vhost -I. -I.. -Iconfig -I../config -Ilib/librte_eal/include -I../lib/librte_eal/include -Ilib/librte_eal/linux/include -I../lib/librte_eal/linux/include -Ilib/librte_eal/x86/include -I../lib/librte_eal/x86/include -Ilib/librte_eal/common -I../lib/librte_eal/common -Ilib/librte_eal -I../lib/librte_eal -Ilib/librte_kvargs -I../lib/librte_kvargs -Ilib/librte_metrics -I../lib/librte_metrics -Ilib/librte_telemetry -I../lib/librte_telemetry -Ilib/librte_mempool -I../lib/librte_mempool -Ilib/librte_ring -I../lib/librte_ring -Ilib/librte_net -I../lib/librte_net -Ilib/librte_mbuf -I../lib/librte_mbuf -Ilib/librte_ethdev -I../lib/librte_ethdev -Ilib/librte_meter -I../lib/librte_meter -Ilib/librte_cmdline -I../lib/librte_cmdline -Ilib/librte_vhost -I../lib/librte_vhost -Ilib/librte_cryptodev -I../lib/librte_cryptodev -Ilib/librte_hash -I../lib/librte_hash -Ilib/librte_rcu -I../lib/librte_rcu -Ilib/librte_pci -I../lib/librte_pci -Idrivers/raw/ioat -I../drivers/raw/ioat -Ilib/librte_rawdev -I../lib/librte_rawdev -Idrivers/bus/pci -I../drivers/bus/pci -I../drivers/bus/pci/linux -Idrivers/bus/vdev -I../drivers/bus/vdev -pipe -D_FILE_OFFSET_BITS=64 -Wall -w3 -diag-disable:remark -Werror -O3 -include rte_config.h -Wextra -Wcast-qual -Wdeprecated -Wformat -Wformat-security -Wmissing-declarations -Wmissing-prototypes -Wold-style-definition -Wpointer-arith -Wsign-compare -Wstrict-prototypes -Wundef -Wwrite-strings -Wno-missing-field-initializers -diag-disable=181 -diag-disable=188 -diag-disable=2203 -diag-disable=2279 -diag-disable=2557 -diag-disable=3179 -diag-disable=3656 -D_GNU_SOURCE -march=native -DALLOW_EXPERIMENTAL_API -MD -MQ examples/dpdk-vhost.p/vhost_main.c.o -MF examples/dpdk-vhost.p/vhost_main.c.o.d -o examples/dpdk-vhost.p/vhost_main.c.o -c ../examples/vhost/main.c
../examples/vhost/main.c(832): error #2330: argument of type "atomic_int_least16_t={_Atomic(short)} *" is incompatible with parameter of type "volatile void *" (dropping qualifiers)
  		atomic_fetch_sub(&vdev->nr_async_pkts, complete_count);
  		^

../examples/vhost/main.c(850): error #2330: argument of type "atomic_int_least64_t={_Atomic(long)} *" is incompatible with parameter of type "volatile void *" (dropping qualifiers)
  		atomic_fetch_add(&dst_vdev->stats.rx_total_atomic, 1);
  		^

../examples/vhost/main.c(851): error #2330: argument of type "atomic_int_least64_t={_Atomic(long)} *" is incompatible with parameter of type "volatile void *" (dropping qualifiers)
  		atomic_fetch_add(&dst_vdev->stats.rx_atomic, ret);
  		^

../examples/vhost/main.c(872): error #140: too many arguments in function call
  					m, nr_xmit, m_cpu_cpl, &cpu_cpl_nr);
  					            ^

../examples/vhost/main.c(873): error #2330: argument of type "atomic_int_least16_t={_Atomic(short)} *" is incompatible with parameter of type "volatile void *" (dropping qualifiers)
  		atomic_fetch_add(&vdev->nr_async_pkts, ret - cpu_cpl_nr);
  		^

../examples/vhost/main.c(884): error #2330: argument of type "atomic_int_least64_t={_Atomic(long)} *" is incompatible with parameter of type "volatile void *" (dropping qualifiers)
  		atomic_fetch_add(&vdev->stats.rx_total_atomic, nr_xmit);
  		^

../examples/vhost/main.c(885): error #2330: argument of type "atomic_int_least64_t={_Atomic(long)} *" is incompatible with parameter of type "volatile void *" (dropping qualifiers)
  		atomic_fetch_add(&vdev->stats.rx_atomic, ret);
  		^

../examples/vhost/main.c(1173): error #140: too many arguments in function call
  					m_cpu_cpl, &cpu_cpl_nr);
  					^

../examples/vhost/main.c(1174): error #2330: argument of type "atomic_int_least16_t={_Atomic(short)} *" is incompatible with parameter of type "volatile void *" (dropping qualifiers)
  		atomic_fetch_add(&vdev->nr_async_pkts,
  		^

../examples/vhost/main.c(1186): error #2330: argument of type "atomic_int_least64_t={_Atomic(long)} *" is incompatible with parameter of type "volatile void *" (dropping qualifiers)
  		atomic_fetch_add(&vdev->stats.rx_total_atomic, rx_count);
  		^

../examples/vhost/main.c(1187): error #2330: argument of type "atomic_int_least64_t={_Atomic(long)} *" is incompatible with parameter of type "volatile void *" (dropping qualifiers)
  		atomic_fetch_add(&vdev->stats.rx_atomic, enqueue_count);
  		^

../examples/vhost/main.c(1460): error #2330: argument of type "atomic_int_least64_t={_Atomic(long)} *" is incompatible with parameter of type "const volatile void *" (dropping qualifiers)
  			rx_total   = atomic_load(&vdev->stats.rx_total_atomic);
  			             ^

../examples/vhost/main.c(1461): error #2330: argument of type "atomic_int_least64_t={_Atomic(long)} *" is incompatible with parameter of type "const volatile void *" (dropping qualifiers)
  			rx         = atomic_load(&vdev->stats.rx_atomic);
  			             ^

compilation aborted for ../examples/vhost/main.c (code 2)
[2645/2740] Compiling C object examples/dpdk-efd_server.p/server_node_efd_server_args.c.o
[2646/2740] Compiling C object examples/dpdk-efd_server.p/server_node_efd_server_init.c.o
[2647/2740] Compiling C object examples/dpdk-rxtx_callbacks.p/rxtx_callbacks_main.c.o
[2648/2740] Compiling C object examples/dpdk-skeleton.p/skeleton_basicfwd.c.o
[2649/2740] Compiling C object examples/dpdk-vdpa.p/vdpa_main.c.o
[2650/2740] Compiling C object examples/dpdk-efd_node.p/server_node_efd_node_node.c.o
[2651/2740] Compiling C object app/test/dpdk-test.p/test_ring.c.o
[2652/2740] Compiling C object app/test/dpdk-test.p/test_ring_perf.c.o
[2653/2740] Compiling C object app/test/dpdk-test.p/test_memcpy_perf.c.o
[2654/2740] Compiling C object drivers/libtmp_rte_event_octeontx2.a.p/event_octeontx2_otx2_worker.c.o
[2655/2740] Compiling C object drivers/libtmp_rte_event_octeontx2.a.p/event_octeontx2_otx2_worker_dual.c.o
ninja: build stopped




*Build Failed #4:
OS: CENTOS82-64
Target: x86_64-native-linuxapp-gcc+debug
FAILED: examples/dpdk-vhost.p/vhost_main.c.o 
gcc -Iexamples/dpdk-vhost.p -Iexamples -I../examples -Iexamples/vhost -I../examples/vhost -I. -I.. -Iconfig -I../config -Ilib/librte_eal/include -I../lib/librte_eal/include -Ilib/librte_eal/linux/include -I../lib/librte_eal/linux/include -Ilib/librte_eal/x86/include -I../lib/librte_eal/x86/include -Ilib/librte_eal/common -I../lib/librte_eal/common -Ilib/librte_eal -I../lib/librte_eal -Ilib/librte_kvargs -I../lib/librte_kvargs -Ilib/librte_metrics -I../lib/librte_metrics -Ilib/librte_telemetry -I../lib/librte_telemetry -Ilib/librte_mempool -I../lib/librte_mempool -Ilib/librte_ring -I../lib/librte_ring -Ilib/librte_net -I../lib/librte_net -Ilib/librte_mbuf -I../lib/librte_mbuf -Ilib/librte_ethdev -I../lib/librte_ethdev -Ilib/librte_meter -I../lib/librte_meter -Ilib/librte_cmdline -I../lib/librte_cmdline -Ilib/librte_vhost -I../lib/librte_vhost -Ilib/librte_cryptodev -I../lib/librte_cryptodev -Ilib/librte_hash -I../lib/librte_hash -Ilib/librte_rcu -I../lib/librte_rcu -Ilib/librte_pci -I../lib/librte_pci -Idrivers/raw/ioat -I../drivers/raw/ioat -Ilib/librte_rawdev -I../lib/librte_rawdev -Idrivers/bus/pci -I../drivers/bus/pci -I../drivers/bus/pci/linux -Idrivers/bus/vdev -I../drivers/bus/vdev -fdiagnostics-color=always -pipe -D_FILE_OFFSET_BITS=64 -Wall -Winvalid-pch -Werror -O2 -g -include rte_config.h -Wextra -Wcast-qual -Wdeprecated -Wformat -Wformat-nonliteral -Wformat-security -Wmissing-declarations -Wmissing-prototypes -Wnested-externs -Wold-style-definition -Wpointer-arith -Wsign-compare -Wstrict-prototypes -Wundef -Wwrite-strings -Wno-packed-not-aligned -Wno-missing-field-initializers -D_GNU_SOURCE -march=native -Wno-format-truncation -DALLOW_EXPERIMENTAL_API -MD -MQ examples/dpdk-vhost.p/vhost_main.c.o -MF examples/dpdk-vhost.p/vhost_main.c.o.d -o examples/dpdk-vhost.p/vhost_main.c.o -c ../examples/vhost/main.c
../examples/vhost/main.c: In function ‘drain_vhost’:
../examples/vhost/main.c:871:9: error: too many arguments to function ‘rte_vhost_submit_enqueue_burst’
   ret = rte_vhost_submit_enqueue_burst(vdev->vid, VIRTIO_RXQ,
         ^~~~~~~~~~~~~~~~~~~~~~~~~~~~~~
In file included from ../examples/vhost/ioat.h:10,
                 from ../examples/vhost/main.c:28:
../lib/librte_vhost/rte_vhost_async.h:166:10: note: declared here
 uint16_t rte_vhost_submit_enqueue_burst(int vid, uint16_t queue_id,
          ^~~~~~~~~~~~~~~~~~~~~~~~~~~~~~
../examples/vhost/main.c: In function ‘drain_eth_rx’:
../examples/vhost/main.c:1171:19: error: too many arguments to function ‘rte_vhost_submit_enqueue_burst’
   enqueue_count = rte_vhost_submit_enqueue_burst(vdev->vid,
                   ^~~~~~~~~~~~~~~~~~~~~~~~~~~~~~
In file included from ../examples/vhost/ioat.h:10,
                 from ../examples/vhost/main.c:28:
../lib/librte_vhost/rte_vhost_async.h:166:10: note: declared here
 uint16_t rte_vhost_submit_enqueue_burst(int vid, uint16_t queue_id,
          ^~~~~~~~~~~~~~~~~~~~~~~~~~~~~~
[2716/2737] Linking target examples/dpdk-rxtx_callbacks
[2717/2737] Linking target examples/dpdk-efd_server
[2718/2737] Linking target examples/dpdk-service_cores
[2719/2737] Linking target examples/dpdk-skeleton
[2720/2737] Linking target examples/dpdk-efd_node
ninja: build stopped




*Build Failed #5:
OS: FC33-64
Target: x86_64-native-linuxapp-gcc
FAILED: examples/dpdk-vhost.p/vhost_main.c.o 
gcc -Iexamples/dpdk-vhost.p -Iexamples -I../examples -Iexamples/vhost -I../examples/vhost -I. -I.. -Iconfig -I../config -Ilib/librte_eal/include -I../lib/librte_eal/include -Ilib/librte_eal/linux/include -I../lib/librte_eal/linux/include -Ilib/librte_eal/x86/include -I../lib/librte_eal/x86/include -Ilib/librte_eal/common -I../lib/librte_eal/common -Ilib/librte_eal -I../lib/librte_eal -Ilib/librte_kvargs -I../lib/librte_kvargs -Ilib/librte_metrics -I../lib/librte_metrics -Ilib/librte_telemetry -I../lib/librte_telemetry -Ilib/librte_mempool -I../lib/librte_mempool -Ilib/librte_ring -I../lib/librte_ring -Ilib/librte_net -I../lib/librte_net -Ilib/librte_mbuf -I../lib/librte_mbuf -Ilib/librte_ethdev -I../lib/librte_ethdev -Ilib/librte_meter -I../lib/librte_meter -Ilib/librte_cmdline -I../lib/librte_cmdline -Ilib/librte_vhost -I../lib/librte_vhost -Ilib/librte_cryptodev -I../lib/librte_cryptodev -Ilib/librte_hash -I../lib/librte_hash -Ilib/librte_rcu -I../lib/librte_rcu -Ilib/librte_pci -I../lib/librte_pci -Idrivers/raw/ioat -I../drivers/raw/ioat -Ilib/librte_rawdev -I../lib/librte_rawdev -Idrivers/bus/pci -I../drivers/bus/pci -I../drivers/bus/pci/linux -Idrivers/bus/vdev -I../drivers/bus/vdev -fdiagnostics-color=always -pipe -D_FILE_OFFSET_BITS=64 -Wall -Winvalid-pch -Werror -O3 -include rte_config.h -Wextra -Wcast-qual -Wdeprecated -Wformat -Wformat-nonliteral -Wformat-security -Wmissing-declarations -Wmissing-prototypes -Wnested-externs -Wold-style-definition -Wpointer-arith -Wsign-compare -Wstrict-prototypes -Wundef -Wwrite-strings -Wno-address-of-packed-member -Wno-packed-not-aligned -Wno-missing-field-initializers -Wno-zero-length-bounds -D_GNU_SOURCE -march=native -Wno-format-truncation -DALLOW_EXPERIMENTAL_API -MD -MQ examples/dpdk-vhost.p/vhost_main.c.o -MF examples/dpdk-vhost.p/vhost_main.c.o.d -o examples/dpdk-vhost.p/vhost_main.c.o -c ../examples/vhost/main.c
../examples/vhost/main.c: In function ‘drain_vhost’:
../examples/vhost/main.c:871:9: error: too many arguments to function ‘rte_vhost_submit_enqueue_burst’
  871 |   ret = rte_vhost_submit_enqueue_burst(vdev->vid, VIRTIO_RXQ,
      |         ^~~~~~~~~~~~~~~~~~~~~~~~~~~~~~
In file included from ../examples/vhost/ioat.h:10,
                 from ../examples/vhost/main.c:28:
../lib/librte_vhost/rte_vhost_async.h:166:10: note: declared here
  166 | uint16_t rte_vhost_submit_enqueue_burst(int vid, uint16_t queue_id,
      |          ^~~~~~~~~~~~~~~~~~~~~~~~~~~~~~
../examples/vhost/main.c: In function ‘drain_eth_rx’:
../examples/vhost/main.c:1171:19: error: too many arguments to function ‘rte_vhost_submit_enqueue_burst’
 1171 |   enqueue_count = rte_vhost_submit_enqueue_burst(vdev->vid,
      |                   ^~~~~~~~~~~~~~~~~~~~~~~~~~~~~~
In file included from ../examples/vhost/ioat.h:10,
                 from ../examples/vhost/main.c:28:
../lib/librte_vhost/rte_vhost_async.h:166:10: note: declared here
  166 | uint16_t rte_vhost_submit_enqueue_burst(int vid, uint16_t queue_id,
      |          ^~~~~~~~~~~~~~~~~~~~~~~~~~~~~~
[2706/2795] Compiling C object examples/dpdk-qos_sched.p/qos_sched_cmdline.c.o
[2707/2795] Compiling C object examples/dpdk-qos_sched.p/qos_sched_app_thread.c.o
[2708/2795] Compiling C object examples/dpdk-efd_node.p/server_node_efd_node_node.c.o
[2709/2795] Compiling C object examples/dpdk-rxtx_callbacks.p/rxtx_callbacks_main.c.o
[2710/2795] Compiling C object examples/dpdk-vhost_blk.p/vhost_blk_vhost_blk_compat.c.o
[2711/2795] Compiling C object examples/dpdk-vhost_blk.p/vhost_blk_blk.c.o
[2712/2795] Compiling C object examples/dpdk-vhost.p/vhost_ioat.c.o
[2713/2795] Compiling C object examples/dpdk-efd_server.p/server_node_efd_server_main.c.o
[2714/2795] Compiling C object examples/dpdk-vhost.p/vhost_virtio_net.c.o
[2715/2795] Compiling C object drivers/libtmp_rte_event_octeontx2.a.p/event_octeontx2_otx2_worker_dual.c.o
[2716/2795] Compiling C object drivers/libtmp_rte_event_octeontx2.a.p/event_octeontx2_otx2_worker.c.o
ninja: build stopped




*Build Failed #6:
OS: FC33-64
Target: x86_64-native-linuxapp-clang
FAILED: examples/dpdk-vhost.p/vhost_main.c.o 
clang -Iexamples/dpdk-vhost.p -Iexamples -I../examples -Iexamples/vhost -I../examples/vhost -I. -I.. -Iconfig -I../config -Ilib/librte_eal/include -I../lib/librte_eal/include -Ilib/librte_eal/linux/include -I../lib/librte_eal/linux/include -Ilib/librte_eal/x86/include -I../lib/librte_eal/x86/include -Ilib/librte_eal/common -I../lib/librte_eal/common -Ilib/librte_eal -I../lib/librte_eal -Ilib/librte_kvargs -I../lib/librte_kvargs -Ilib/librte_metrics -I../lib/librte_metrics -Ilib/librte_telemetry -I../lib/librte_telemetry -Ilib/librte_mempool -I../lib/librte_mempool -Ilib/librte_ring -I../lib/librte_ring -Ilib/librte_net -I../lib/librte_net -Ilib/librte_mbuf -I../lib/librte_mbuf -Ilib/librte_ethdev -I../lib/librte_ethdev -Ilib/librte_meter -I../lib/librte_meter -Ilib/librte_cmdline -I../lib/librte_cmdline -Ilib/librte_vhost -I../lib/librte_vhost -Ilib/librte_cryptodev -I../lib/librte_cryptodev -Ilib/librte_hash -I../lib/librte_hash -Ilib/librte_rcu -I../lib/librte_rcu -Ilib/librte_pci -I../lib/librte_pci -Idrivers/raw/ioat -I../drivers/raw/ioat -Ilib/librte_rawdev -I../lib/librte_rawdev -Idrivers/bus/pci -I../drivers/bus/pci -I../drivers/bus/pci/linux -Idrivers/bus/vdev -I../drivers/bus/vdev -Xclang -fcolor-diagnostics -pipe -D_FILE_OFFSET_BITS=64 -Wall -Winvalid-pch -Werror -O3 -include rte_config.h -Wextra -Wcast-qual -Wdeprecated -Wformat -Wformat-nonliteral -Wformat-security -Wmissing-declarations -Wmissing-prototypes -Wnested-externs -Wold-style-definition -Wpointer-arith -Wsign-compare -Wstrict-prototypes -Wundef -Wwrite-strings -Wno-address-of-packed-member -Wno-missing-field-initializers -D_GNU_SOURCE -march=native -DALLOW_EXPERIMENTAL_API -MD -MQ examples/dpdk-vhost.p/vhost_main.c.o -MF examples/dpdk-vhost.p/vhost_main.c.o.d -o examples/dpdk-vhost.p/vhost_main.c.o -c ../examples/vhost/main.c
../examples/vhost/main.c:872:18: error: too many arguments to function call, expected 4, have 6
                                        m, nr_xmit, m_cpu_cpl, &cpu_cpl_nr);
                                                    ^~~~~~~~~~~~~~~~~~~~~~
../lib/librte_vhost/rte_vhost_async.h:166:10: note: 'rte_vhost_submit_enqueue_burst' declared here
uint16_t rte_vhost_submit_enqueue_burst(int vid, uint16_t queue_id,
         ^
../examples/vhost/main.c:1173:6: error: too many arguments to function call, expected 4, have 6
                                        m_cpu_cpl, &cpu_cpl_nr);
                                        ^~~~~~~~~~~~~~~~~~~~~~
../lib/librte_vhost/rte_vhost_async.h:166:10: note: 'rte_vhost_submit_enqueue_burst' declared here
uint16_t rte_vhost_submit_enqueue_burst(int vid, uint16_t queue_id,
         ^
2 errors generated.
[2715/2795] Compiling C object examples/dpdk-vhost_crypto.p/vhost_crypto_main.c.o
[2716/2795] Compiling C object examples/dpdk-vmdq_dcb.p/vmdq_dcb_main.c.o
[2717/2795] Compiling C object app/test/dpdk-test.p/test_ring.c.o
[2718/2795] Generating rte_kni with a custom command
make: Entering directory '/usr/src/kernels/5.8.16-300.fc33.x86_64'
  CC [M]  /root/FC33-64_K5.8.16_Clang11.0.0/x86_64-native-linuxapp-clang/58b516968ddb4c309879333801f5b2b3/dpdk/x86_64-native-linuxapp-clang/kernel/linux/kni/kni_misc.o
  CC [M]  /root/FC33-64_K5.8.16_Clang11.0.0/x86_64-native-linuxapp-clang/58b516968ddb4c309879333801f5b2b3/dpdk/x86_64-native-linuxapp-clang/kernel/linux/kni/kni_net.o
  LD [M]  /root/FC33-64_K5.8.16_Clang11.0.0/x86_64-native-linuxapp-clang/58b516968ddb4c309879333801f5b2b3/dpdk/x86_64-native-linuxapp-clang/kernel/linux/kni/rte_kni.o
  MODPOST /root/FC33-64_K5.8.16_Clang11.0.0/x86_64-native-linuxapp-clang/58b516968ddb4c309879333801f5b2b3/dpdk/x86_64-native-linuxapp-clang/kernel/linux/kni/Module.symvers
  CC [M]  /root/FC33-64_K5.8.16_Clang11.0.0/x86_64-native-linuxapp-clang/58b516968ddb4c309879333801f5b2b3/dpdk/x86_64-native-linuxapp-clang/kernel/linux/kni/rte_kni.mod.o
  LD [M]  /root/FC33-64_K5.8.16_Clang11.0.0/x86_64-native-linuxapp-clang/58b516968ddb4c309879333801f5b2b3/dpdk/x86_64-native-linuxapp-clang/kernel/linux/kni/rte_kni.ko
make: Leaving directory '/usr/src/kernels/5.8.16-300.fc33.x86_64'
[2719/2795] Compiling C object drivers/libtmp_rte_event_octeontx2.a.p/event_octeontx2_otx2_worker.c.o
[2720/2795] Compiling C object drivers/libtmp_rte_event_octeontx2.a.p/event_octeontx2_otx2_worker_dual.c.o
[2721/2795] Compiling C object app/test/dpdk-test.p/test_ring_perf.c.o
ninja: build stopped




*Build Failed #7:
OS: RHEL82-64
Target: x86_64-native-linuxapp-gcc
FAILED: examples/dpdk-vhost.p/vhost_main.c.o 
gcc -Iexamples/dpdk-vhost.p -Iexamples -I../examples -Iexamples/vhost -I../examples/vhost -I. -I.. -Iconfig -I../config -Ilib/librte_eal/include -I../lib/librte_eal/include -Ilib/librte_eal/linux/include -I../lib/librte_eal/linux/include -Ilib/librte_eal/x86/include -I../lib/librte_eal/x86/include -Ilib/librte_eal/common -I../lib/librte_eal/common -Ilib/librte_eal -I../lib/librte_eal -Ilib/librte_kvargs -I../lib/librte_kvargs -Ilib/librte_metrics -I../lib/librte_metrics -Ilib/librte_telemetry -I../lib/librte_telemetry -Ilib/librte_mempool -I../lib/librte_mempool -Ilib/librte_ring -I../lib/librte_ring -Ilib/librte_net -I../lib/librte_net -Ilib/librte_mbuf -I../lib/librte_mbuf -Ilib/librte_ethdev -I../lib/librte_ethdev -Ilib/librte_meter -I../lib/librte_meter -Ilib/librte_cmdline -I../lib/librte_cmdline -Ilib/librte_vhost -I../lib/librte_vhost -Ilib/librte_cryptodev -I../lib/librte_cryptodev -Ilib/librte_hash -I../lib/librte_hash -Ilib/librte_rcu -I../lib/librte_rcu -Ilib/librte_pci -I../lib/librte_pci -Idrivers/raw/ioat -I../drivers/raw/ioat -Ilib/librte_rawdev -I../lib/librte_rawdev -Idrivers/bus/pci -I../drivers/bus/pci -I../drivers/bus/pci/linux -Idrivers/bus/vdev -I../drivers/bus/vdev -fdiagnostics-color=always -pipe -D_FILE_OFFSET_BITS=64 -Wall -Winvalid-pch -Werror -O3 -include rte_config.h -Wextra -Wcast-qual -Wdeprecated -Wformat -Wformat-nonliteral -Wformat-security -Wmissing-declarations -Wmissing-prototypes -Wnested-externs -Wold-style-definition -Wpointer-arith -Wsign-compare -Wstrict-prototypes -Wundef -Wwrite-strings -Wno-packed-not-aligned -Wno-missing-field-initializers -D_GNU_SOURCE -march=native -mno-avx512f -Wno-format-truncation -DALLOW_EXPERIMENTAL_API -MD -MQ examples/dpdk-vhost.p/vhost_main.c.o -MF examples/dpdk-vhost.p/vhost_main.c.o.d -o examples/dpdk-vhost.p/vhost_main.c.o -c ../examples/vhost/main.c
../examples/vhost/main.c: In function ‘drain_vhost’:
../examples/vhost/main.c:871:9: error: too many arguments to function ‘rte_vhost_submit_enqueue_burst’
   ret = rte_vhost_submit_enqueue_burst(vdev->vid, VIRTIO_RXQ,
         ^~~~~~~~~~~~~~~~~~~~~~~~~~~~~~
In file included from ../examples/vhost/ioat.h:10,
                 from ../examples/vhost/main.c:28:
../lib/librte_vhost/rte_vhost_async.h:166:10: note: declared here
 uint16_t rte_vhost_submit_enqueue_burst(int vid, uint16_t queue_id,
          ^~~~~~~~~~~~~~~~~~~~~~~~~~~~~~
../examples/vhost/main.c: In function ‘drain_eth_rx’:
../examples/vhost/main.c:1171:19: error: too many arguments to function ‘rte_vhost_submit_enqueue_burst’
   enqueue_count = rte_vhost_submit_enqueue_burst(vdev->vid,
                   ^~~~~~~~~~~~~~~~~~~~~~~~~~~~~~
In file included from ../examples/vhost/ioat.h:10,
                 from ../examples/vhost/main.c:28:
../lib/librte_vhost/rte_vhost_async.h:166:10: note: declared here
 uint16_t rte_vhost_submit_enqueue_burst(int vid, uint16_t queue_id,
          ^~~~~~~~~~~~~~~~~~~~~~~~~~~~~~
[2652/2736] Compiling C object examples/dpdk-vhost_blk.p/vhost_blk_blk.c.o
[2653/2736] Compiling C object examples/dpdk-vhost_crypto.p/vhost_crypto_main.c.o
[2654/2736] Compiling C object examples/dpdk-efd_node.p/server_node_efd_node_node.c.o
[2655/2736] Compiling C object examples/dpdk-vhost.p/vhost_ioat.c.o
[2656/2736] Compiling C object examples/dpdk-efd_server.p/server_node_efd_server_main.c.o
[2657/2736] Compiling C object examples/dpdk-vhost_blk.p/vhost_blk_vhost_blk.c.o
[2658/2736] Compiling C object examples/dpdk-vhost.p/vhost_virtio_net.c.o
[2659/2736] Compiling C object drivers/libtmp_rte_event_octeontx2.a.p/event_octeontx2_otx2_worker_dual.c.o
[2660/2736] Compiling C object drivers/libtmp_rte_event_octeontx2.a.p/event_octeontx2_otx2_worker.c.o
ninja: build stopped




*Build Failed #8:
OS: SUSE15-64
Target: x86_64-native-linuxapp-clang
FAILED: examples/dpdk-vhost.p/vhost_main.c.o 
clang -Iexamples/dpdk-vhost.p -Iexamples -I../examples -Iexamples/vhost -I../examples/vhost -I. -I.. -Iconfig -I../config -Ilib/librte_eal/include -I../lib/librte_eal/include -Ilib/librte_eal/linux/include -I../lib/librte_eal/linux/include -Ilib/librte_eal/x86/include -I../lib/librte_eal/x86/include -Ilib/librte_eal/common -I../lib/librte_eal/common -Ilib/librte_eal -I../lib/librte_eal -Ilib/librte_kvargs -I../lib/librte_kvargs -Ilib/librte_metrics -I../lib/librte_metrics -Ilib/librte_telemetry -I../lib/librte_telemetry -Ilib/librte_mempool -I../lib/librte_mempool -Ilib/librte_ring -I../lib/librte_ring -Ilib/librte_net -I../lib/librte_net -Ilib/librte_mbuf -I../lib/librte_mbuf -Ilib/librte_ethdev -I../lib/librte_ethdev -Ilib/librte_meter -I../lib/librte_meter -Ilib/librte_cmdline -I../lib/librte_cmdline -Ilib/librte_vhost -I../lib/librte_vhost -Ilib/librte_cryptodev -I../lib/librte_cryptodev -Ilib/librte_hash -I../lib/librte_hash -Ilib/librte_rcu -I../lib/librte_rcu -Ilib/librte_pci -I../lib/librte_pci -Idrivers/raw/ioat -I../drivers/raw/ioat -Ilib/librte_rawdev -I../lib/librte_rawdev -Idrivers/bus/pci -I../drivers/bus/pci -I../drivers/bus/pci/linux -Idrivers/bus/vdev -I../drivers/bus/vdev -Xclang -fcolor-diagnostics -pipe -D_FILE_OFFSET_BITS=64 -Wall -Winvalid-pch -Werror -O3 -include rte_config.h -Wextra -Wcast-qual -Wdeprecated -Wformat -Wformat-nonliteral -Wformat-security -Wmissing-declarations -Wmissing-prototypes -Wnested-externs -Wold-style-definition -Wpointer-arith -Wsign-compare -Wstrict-prototypes -Wundef -Wwrite-strings -Wno-address-of-packed-member -Wno-missing-field-initializers -D_GNU_SOURCE -march=native -DALLOW_EXPERIMENTAL_API -MD -MQ examples/dpdk-vhost.p/vhost_main.c.o -MF examples/dpdk-vhost.p/vhost_main.c.o.d -o examples/dpdk-vhost.p/vhost_main.c.o -c ../examples/vhost/main.c
../examples/vhost/main.c:872:18: error: too many arguments to function call, expected 4, have 6
                                        m, nr_xmit, m_cpu_cpl, &cpu_cpl_nr);
                                                    ^~~~~~~~~~~~~~~~~~~~~~
../lib/librte_vhost/rte_vhost_async.h:165:1: note: 'rte_vhost_submit_enqueue_burst' declared here
__rte_experimental
^
../lib/librte_eal/include/rte_compat.h:17:28: note: expanded from macro '__rte_experimental'
#define __rte_experimental \
                           ^
../examples/vhost/main.c:1173:6: error: too many arguments to function call, expected 4, have 6
                                        m_cpu_cpl, &cpu_cpl_nr);
                                        ^~~~~~~~~~~~~~~~~~~~~~
../lib/librte_vhost/rte_vhost_async.h:165:1: note: 'rte_vhost_submit_enqueue_burst' declared here
__rte_experimental
^
../lib/librte_eal/include/rte_compat.h:17:28: note: expanded from macro '__rte_experimental'
#define __rte_experimental \
                           ^
2 errors generated.
[2626/2715] Compiling C object examples/dpdk-efd_server.p/server_node_efd_server_init.c.o
[2627/2715] Compiling C object examples/dpdk-skeleton.p/skeleton_basicfwd.c.o
[2628/2715] Compiling C object examples/dpdk-vdpa.p/vdpa_main.c.o
[2629/2715] Compiling C object examples/dpdk-vhost.p/vhost_ioat.c.o
[2630/2715] Compiling C object examples/dpdk-efd_server.p/server_node_efd_server_main.c.o
[2631/2715] Compiling C object examples/dpdk-vhost.p/vhost_virtio_net.c.o
[2632/2715] Compiling C object app/test/dpdk-test.p/test_ring_perf.c.o
[2633/2715] Compiling C object drivers/libtmp_rte_event_octeontx2.a.p/event_octeontx2_otx2_worker.c.o
[2634/2715] Compiling C object drivers/libtmp_rte_event_octeontx2.a.p/event_octeontx2_otx2_worker_dual.c.o
ninja: build stopped




*Build Failed #9:
OS: SUSE15-64
Target: x86_64-native-linuxapp-gcc
FAILED: examples/dpdk-vhost.p/vhost_main.c.o 
gcc -Iexamples/dpdk-vhost.p -Iexamples -I../examples -Iexamples/vhost -I../examples/vhost -I. -I.. -Iconfig -I../config -Ilib/librte_eal/include -I../lib/librte_eal/include -Ilib/librte_eal/linux/include -I../lib/librte_eal/linux/include -Ilib/librte_eal/x86/include -I../lib/librte_eal/x86/include -Ilib/librte_eal/common -I../lib/librte_eal/common -Ilib/librte_eal -I../lib/librte_eal -Ilib/librte_kvargs -I../lib/librte_kvargs -Ilib/librte_metrics -I../lib/librte_metrics -Ilib/librte_telemetry -I../lib/librte_telemetry -Ilib/librte_mempool -I../lib/librte_mempool -Ilib/librte_ring -I../lib/librte_ring -Ilib/librte_net -I../lib/librte_net -Ilib/librte_mbuf -I../lib/librte_mbuf -Ilib/librte_ethdev -I../lib/librte_ethdev -Ilib/librte_meter -I../lib/librte_meter -Ilib/librte_cmdline -I../lib/librte_cmdline -Ilib/librte_vhost -I../lib/librte_vhost -Ilib/librte_cryptodev -I../lib/librte_cryptodev -Ilib/librte_hash -I../lib/librte_hash -Ilib/librte_rcu -I../lib/librte_rcu -Ilib/librte_pci -I../lib/librte_pci -Idrivers/raw/ioat -I../drivers/raw/ioat -Ilib/librte_rawdev -I../lib/librte_rawdev -Idrivers/bus/pci -I../drivers/bus/pci -I../drivers/bus/pci/linux -Idrivers/bus/vdev -I../drivers/bus/vdev -fdiagnostics-color=always -pipe -D_FILE_OFFSET_BITS=64 -Wall -Winvalid-pch -Werror -O3 -include rte_config.h -Wextra -Wcast-qual -Wdeprecated -Wformat -Wformat-nonliteral -Wformat-security -Wmissing-declarations -Wmissing-prototypes -Wnested-externs -Wold-style-definition -Wpointer-arith -Wsign-compare -Wstrict-prototypes -Wundef -Wwrite-strings -Wno-missing-field-initializers -D_GNU_SOURCE -march=native -Wno-format-truncation -DALLOW_EXPERIMENTAL_API -MD -MQ examples/dpdk-vhost.p/vhost_main.c.o -MF examples/dpdk-vhost.p/vhost_main.c.o.d -o examples/dpdk-vhost.p/vhost_main.c.o -c ../examples/vhost/main.c
../examples/vhost/main.c: In function ‘drain_vhost’:
../examples/vhost/main.c:871:9: error: too many arguments to function ‘rte_vhost_submit_enqueue_burst’
   ret = rte_vhost_submit_enqueue_burst(vdev->vid, VIRTIO_RXQ,
         ^~~~~~~~~~~~~~~~~~~~~~~~~~~~~~
In file included from ../examples/vhost/ioat.h:10:0,
                 from ../examples/vhost/main.c:28:
../lib/librte_vhost/rte_vhost_async.h:166:10: note: declared here
 uint16_t rte_vhost_submit_enqueue_burst(int vid, uint16_t queue_id,
          ^~~~~~~~~~~~~~~~~~~~~~~~~~~~~~
../examples/vhost/main.c: In function ‘drain_eth_rx’:
../examples/vhost/main.c:1171:19: error: too many arguments to function ‘rte_vhost_submit_enqueue_burst’
   enqueue_count = rte_vhost_submit_enqueue_burst(vdev->vid,
                   ^~~~~~~~~~~~~~~~~~~~~~~~~~~~~~
In file included from ../examples/vhost/ioat.h:10:0,
                 from ../examples/vhost/main.c:28:
../lib/librte_vhost/rte_vhost_async.h:166:10: note: declared here
 uint16_t rte_vhost_submit_enqueue_burst(int vid, uint16_t queue_id,
          ^~~~~~~~~~~~~~~~~~~~~~~~~~~~~~
[2629/2712] Generating rte_kni_makefile with a custom command
[2630/2712] Compiling C object examples/dpdk-vhost_crypto.p/vhost_crypto_main.c.o
[2631/2712] Compiling C object examples/dpdk-vhost_blk.p/vhost_blk_blk.c.o
[2632/2712] Compiling C object examples/dpdk-vhost_blk.p/vhost_blk_vhost_blk.c.o
[2633/2712] Compiling C object examples/dpdk-vmdq_dcb.p/vmdq_dcb_main.c.o
[2634/2712] Compiling C object app/test/dpdk-test.p/test_ring.c.o
[2635/2712] Compiling C object app/test/dpdk-test.p/test_ring_perf.c.o
[2636/2712] Compiling C object drivers/libtmp_rte_event_octeontx2.a.p/event_octeontx2_otx2_worker.c.o
[2637/2712] Compiling C object drivers/libtmp_rte_event_octeontx2.a.p/event_octeontx2_otx2_worker_dual.c.o
ninja: build stopped




*Build Failed #10:
OS: UB1804-64
Target: x86_64-native-linuxapp-gcc
FAILED: examples/dpdk-vhost.p/vhost_main.c.o 
gcc -Iexamples/dpdk-vhost.p -Iexamples -I../examples -Iexamples/vhost -I../examples/vhost -I. -I.. -Iconfig -I../config -Ilib/librte_eal/include -I../lib/librte_eal/include -Ilib/librte_eal/linux/include -I../lib/librte_eal/linux/include -Ilib/librte_eal/x86/include -I../lib/librte_eal/x86/include -Ilib/librte_eal/common -I../lib/librte_eal/common -Ilib/librte_eal -I../lib/librte_eal -Ilib/librte_kvargs -I../lib/librte_kvargs -Ilib/librte_metrics -I../lib/librte_metrics -Ilib/librte_telemetry -I../lib/librte_telemetry -Ilib/librte_mempool -I../lib/librte_mempool -Ilib/librte_ring -I../lib/librte_ring -Ilib/librte_net -I../lib/librte_net -Ilib/librte_mbuf -I../lib/librte_mbuf -Ilib/librte_ethdev -I../lib/librte_ethdev -Ilib/librte_meter -I../lib/librte_meter -Ilib/librte_cmdline -I../lib/librte_cmdline -Ilib/librte_vhost -I../lib/librte_vhost -Ilib/librte_cryptodev -I../lib/librte_cryptodev -Ilib/librte_hash -I../lib/librte_hash -Ilib/librte_rcu -I../lib/librte_rcu -Ilib/librte_pci -I../lib/librte_pci -Idrivers/raw/ioat -I../drivers/raw/ioat -Ilib/librte_rawdev -I../lib/librte_rawdev -Idrivers/bus/pci -I../drivers/bus/pci -I../drivers/bus/pci/linux -Idrivers/bus/vdev -I../drivers/bus/vdev -fdiagnostics-color=always -pipe -D_FILE_OFFSET_BITS=64 -Wall -Winvalid-pch -Werror -O3 -include rte_config.h -Wextra -Wcast-qual -Wdeprecated -Wformat -Wformat-nonliteral -Wformat-security -Wmissing-declarations -Wmissing-prototypes -Wnested-externs -Wold-style-definition -Wpointer-arith -Wsign-compare -Wstrict-prototypes -Wundef -Wwrite-strings -Wno-packed-not-aligned -Wno-missing-field-initializers -D_GNU_SOURCE -march=native -mno-avx512f -Wno-format-truncation -DALLOW_EXPERIMENTAL_API -MD -MQ examples/dpdk-vhost.p/vhost_main.c.o -MF examples/dpdk-vhost.p/vhost_main.c.o.d -o examples/dpdk-vhost.p/vhost_main.c.o -c ../examples/vhost/main.c
../examples/vhost/main.c: In function ‘drain_vhost’:
../examples/vhost/main.c:871:9: error: too many arguments to function ‘rte_vhost_submit_enqueue_burst’
   ret = rte_vhost_submit_enqueue_burst(vdev->vid, VIRTIO_RXQ,
         ^~~~~~~~~~~~~~~~~~~~~~~~~~~~~~
In file included from ../examples/vhost/ioat.h:10,
                 from ../examples/vhost/main.c:28:
../lib/librte_vhost/rte_vhost_async.h:166:10: note: declared here
 uint16_t rte_vhost_submit_enqueue_burst(int vid, uint16_t queue_id,
          ^~~~~~~~~~~~~~~~~~~~~~~~~~~~~~
../examples/vhost/main.c: In function ‘drain_eth_rx’:
../examples/vhost/main.c:1171:19: error: too many arguments to function ‘rte_vhost_submit_enqueue_burst’
   enqueue_count = rte_vhost_submit_enqueue_burst(vdev->vid,
                   ^~~~~~~~~~~~~~~~~~~~~~~~~~~~~~
In file included from ../examples/vhost/ioat.h:10,
                 from ../examples/vhost/main.c:28:
../lib/librte_vhost/rte_vhost_async.h:166:10: note: declared here
 uint16_t rte_vhost_submit_enqueue_burst(int vid, uint16_t queue_id,
          ^~~~~~~~~~~~~~~~~~~~~~~~~~~~~~
[2638/2725] Compiling C object examples/dpdk-vhost_crypto.p/vhost_crypto_main.c.o
[2639/2725] Compiling C object examples/dpdk-vhost.p/vhost_ioat.c.o
[2640/2725] Compiling C object examples/dpdk-vmdq_dcb.p/vmdq_dcb_main.c.o
[2641/2725] Compiling C object examples/dpdk-vhost_blk.p/vhost_blk_vhost_blk_compat.c.o
[2642/2725] Compiling C object examples/dpdk-skeleton.p/skeleton_basicfwd.c.o
[2643/2725] Compiling C object examples/dpdk-vdpa.p/vdpa_main.c.o
[2644/2725] Compiling C object examples/dpdk-vhost_blk.p/vhost_blk_vhost_blk.c.o
[2645/2725] Compiling C object drivers/libtmp_rte_event_octeontx2.a.p/event_octeontx2_otx2_worker.c.o
[2646/2725] Compiling C object drivers/libtmp_rte_event_octeontx2.a.p/event_octeontx2_otx2_worker_dual.c.o
ninja: build stopped




*Build Failed #11:
OS: UB2004-32
Target: i686-native-linuxapp-gcc
FAILED: examples/dpdk-vhost.p/vhost_main.c.o 
gcc -Iexamples/dpdk-vhost.p -Iexamples -I../examples -Iexamples/vhost -I../examples/vhost -I. -I.. -Iconfig -I../config -Ilib/librte_eal/include -I../lib/librte_eal/include -Ilib/librte_eal/linux/include -I../lib/librte_eal/linux/include -Ilib/librte_eal/x86/include -I../lib/librte_eal/x86/include -Ilib/librte_eal/common -I../lib/librte_eal/common -Ilib/librte_eal -I../lib/librte_eal -Ilib/librte_kvargs -I../lib/librte_kvargs -Ilib/librte_metrics -I../lib/librte_metrics -Ilib/librte_telemetry -I../lib/librte_telemetry -Ilib/librte_mempool -I../lib/librte_mempool -Ilib/librte_ring -I../lib/librte_ring -Ilib/librte_net -I../lib/librte_net -Ilib/librte_mbuf -I../lib/librte_mbuf -Ilib/librte_ethdev -I../lib/librte_ethdev -Ilib/librte_meter -I../lib/librte_meter -Ilib/librte_cmdline -I../lib/librte_cmdline -Ilib/librte_vhost -I../lib/librte_vhost -Ilib/librte_cryptodev -I../lib/librte_cryptodev -Ilib/librte_hash -I../lib/librte_hash -Ilib/librte_rcu -I../lib/librte_rcu -Ilib/librte_pci -I../lib/librte_pci -Idrivers/raw/ioat -I../drivers/raw/ioat -Ilib/librte_rawdev -I../lib/librte_rawdev -Idrivers/bus/pci -I../drivers/bus/pci -I../drivers/bus/pci/linux -Idrivers/bus/vdev -I../drivers/bus/vdev -fdiagnostics-color=always -pipe -D_FILE_OFFSET_BITS=64 -Wall -Winvalid-pch -Werror -O3 -include rte_config.h -Wextra -Wcast-qual -Wdeprecated -Wformat -Wformat-nonliteral -Wformat-security -Wmissing-declarations -Wmissing-prototypes -Wnested-externs -Wold-style-definition -Wpointer-arith -Wsign-compare -Wstrict-prototypes -Wundef -Wwrite-strings -Wno-address-of-packed-member -Wno-packed-not-aligned -Wno-missing-field-initializers -Wno-pointer-to-int-cast -D_GNU_SOURCE -m32 -march=native -Wno-format-truncation -DALLOW_EXPERIMENTAL_API -MD -MQ examples/dpdk-vhost.p/vhost_main.c.o -MF examples/dpdk-vhost.p/vhost_main.c.o.d -o examples/dpdk-vhost.p/vhost_main.c.o -c ../examples/vhost/main.c
../examples/vhost/main.c: In function ‘drain_vhost’:
../examples/vhost/main.c:871:9: error: too many arguments to function ‘rte_vhost_submit_enqueue_burst’
  871 |   ret = rte_vhost_submit_enqueue_burst(vdev->vid, VIRTIO_RXQ,
      |         ^~~~~~~~~~~~~~~~~~~~~~~~~~~~~~
In file included from ../examples/vhost/ioat.h:10,
                 from ../examples/vhost/main.c:28:
../lib/librte_vhost/rte_vhost_async.h:166:10: note: declared here
  166 | uint16_t rte_vhost_submit_enqueue_burst(int vid, uint16_t queue_id,
      |          ^~~~~~~~~~~~~~~~~~~~~~~~~~~~~~
../examples/vhost/main.c: In function ‘drain_eth_rx’:
../examples/vhost/main.c:1171:19: error: too many arguments to function ‘rte_vhost_submit_enqueue_burst’
 1171 |   enqueue_count = rte_vhost_submit_enqueue_burst(vdev->vid,
      |                   ^~~~~~~~~~~~~~~~~~~~~~~~~~~~~~
In file included from ../examples/vhost/ioat.h:10,
                 from ../examples/vhost/main.c:28:
../lib/librte_vhost/rte_vhost_async.h:166:10: note: declared here
  166 | uint16_t rte_vhost_submit_enqueue_burst(int vid, uint16_t queue_id,
      |          ^~~~~~~~~~~~~~~~~~~~~~~~~~~~~~
[2277/2296] Compiling C object examples/dpdk-vhost_crypto.p/vhost_crypto_main.c.o
[2278/2296] Linking target examples/dpdk-efd_server
[2279/2296] Compiling C object examples/dpdk-vhost.p/vhost_ioat.c.o
[2280/2296] Compiling C object examples/dpdk-vdpa.p/vdpa_main.c.o
[2281/2296] Linking target examples/dpdk-efd_node
[2282/2296] Linking target app/test/dpdk-test
[2283/2296] Compiling C object examples/dpdk-vhost.p/vhost_virtio_net.c.o
[2284/2296] Linking target examples/dpdk-skeleton
[2285/2296] Generating rte_kni with a custom command
make: Entering directory '/usr/src/linux-headers-5.4.0-47-generic'
  CC [M]  /root/UB2004-32_K4.15.0_GCC9.3.0/i686-native-linuxapp-gcc/58b516968ddb4c309879333801f5b2b3/dpdk/i686-native-linuxapp-gcc/kernel/linux/kni/kni_net.o
  CC [M]  /root/UB2004-32_K4.15.0_GCC9.3.0/i686-native-linuxapp-gcc/58b516968ddb4c309879333801f5b2b3/dpdk/i686-native-linuxapp-gcc/kernel/linux/kni/kni_misc.o
  LD [M]  /root/UB2004-32_K4.15.0_GCC9.3.0/i686-native-linuxapp-gcc/58b516968ddb4c309879333801f5b2b3/dpdk/i686-native-linuxapp-gcc/kernel/linux/kni/rte_kni.o
  Building modules, stage 2.
  MODPOST 1 modules
  CC [M]  /root/UB2004-32_K4.15.0_GCC9.3.0/i686-native-linuxapp-gcc/58b516968ddb4c309879333801f5b2b3/dpdk/i686-native-linuxapp-gcc/kernel/linux/kni/rte_kni.mod.o
  LD [M]  /root/UB2004-32_K4.15.0_GCC9.3.0/i686-native-linuxapp-gcc/58b516968ddb4c309879333801f5b2b3/dpdk/i686-native-linuxapp-gcc/kernel/linux/kni/rte_kni.ko
make: Leaving directory '/usr/src/linux-headers-5.4.0-47-generic'
ninja: build stopped




*Build Failed #12:
OS: UB2004-64
Target: x86_64-native-linuxapp-clang
FAILED: examples/dpdk-vhost.p/vhost_main.c.o 
clang -Iexamples/dpdk-vhost.p -Iexamples -I../examples -Iexamples/vhost -I../examples/vhost -I. -I.. -Iconfig -I../config -Ilib/librte_eal/include -I../lib/librte_eal/include -Ilib/librte_eal/linux/include -I../lib/librte_eal/linux/include -Ilib/librte_eal/x86/include -I../lib/librte_eal/x86/include -Ilib/librte_eal/common -I../lib/librte_eal/common -Ilib/librte_eal -I../lib/librte_eal -Ilib/librte_kvargs -I../lib/librte_kvargs -Ilib/librte_metrics -I../lib/librte_metrics -Ilib/librte_telemetry -I../lib/librte_telemetry -Ilib/librte_mempool -I../lib/librte_mempool -Ilib/librte_ring -I../lib/librte_ring -Ilib/librte_net -I../lib/librte_net -Ilib/librte_mbuf -I../lib/librte_mbuf -Ilib/librte_ethdev -I../lib/librte_ethdev -Ilib/librte_meter -I../lib/librte_meter -Ilib/librte_cmdline -I../lib/librte_cmdline -Ilib/librte_vhost -I../lib/librte_vhost -Ilib/librte_cryptodev -I../lib/librte_cryptodev -Ilib/librte_hash -I../lib/librte_hash -Ilib/librte_rcu -I../lib/librte_rcu -Ilib/librte_pci -I../lib/librte_pci -Idrivers/raw/ioat -I../drivers/raw/ioat -Ilib/librte_rawdev -I../lib/librte_rawdev -Idrivers/bus/pci -I../drivers/bus/pci -I../drivers/bus/pci/linux -Idrivers/bus/vdev -I../drivers/bus/vdev -Xclang -fcolor-diagnostics -pipe -D_FILE_OFFSET_BITS=64 -Wall -Winvalid-pch -Werror -O3 -include rte_config.h -Wextra -Wcast-qual -Wdeprecated -Wformat -Wformat-nonliteral -Wformat-security -Wmissing-declarations -Wmissing-prototypes -Wnested-externs -Wold-style-definition -Wpointer-arith -Wsign-compare -Wstrict-prototypes -Wundef -Wwrite-strings -Wno-address-of-packed-member -Wno-missing-field-initializers -D_GNU_SOURCE -march=native -DALLOW_EXPERIMENTAL_API -MD -MQ examples/dpdk-vhost.p/vhost_main.c.o -MF examples/dpdk-vhost.p/vhost_main.c.o.d -o examples/dpdk-vhost.p/vhost_main.c.o -c ../examples/vhost/main.c
../examples/vhost/main.c:872:18: error: too many arguments to function call, expected 4, have 6
                                        m, nr_xmit, m_cpu_cpl, &cpu_cpl_nr);
                                                    ^~~~~~~~~~~~~~~~~~~~~~
../lib/librte_vhost/rte_vhost_async.h:165:1: note: 'rte_vhost_submit_enqueue_burst' declared here
__rte_experimental
^
../lib/librte_eal/include/rte_compat.h:17:28: note: expanded from macro '__rte_experimental'
#define __rte_experimental \
                           ^
../examples/vhost/main.c:1173:6: error: too many arguments to function call, expected 4, have 6
                                        m_cpu_cpl, &cpu_cpl_nr);
                                        ^~~~~~~~~~~~~~~~~~~~~~
../lib/librte_vhost/rte_vhost_async.h:165:1: note: 'rte_vhost_submit_enqueue_burst' declared here
__rte_experimental
^
../lib/librte_eal/include/rte_compat.h:17:28: note: expanded from macro '__rte_experimental'
#define __rte_experimental \
                           ^
2 errors generated.
[2650/2736] Compiling C object examples/dpdk-vhost_blk.p/vhost_blk_vhost_blk_compat.c.o
[2651/2736] Compiling C object examples/dpdk-efd_server.p/server_node_efd_server_main.c.o
[2652/2736] Compiling C object examples/dpdk-vhost_crypto.p/vhost_crypto_main.c.o
[2653/2736] Compiling C object examples/dpdk-vhost.p/vhost_virtio_net.c.o
[2654/2736] Compiling C object examples/dpdk-vmdq_dcb.p/vmdq_dcb_main.c.o
[2655/2736] Compiling C object app/test/dpdk-test.p/test_ring.c.o
[2656/2736] Compiling C object drivers/libtmp_rte_event_octeontx2.a.p/event_octeontx2_otx2_worker.c.o
[2657/2736] Compiling C object drivers/libtmp_rte_event_octeontx2.a.p/event_octeontx2_otx2_worker_dual.c.o
[2658/2736] Compiling C object app/test/dpdk-test.p/test_ring_perf.c.o
ninja: build stopped




*Build Failed #13:
OS: UB2004-64
Target: x86_64-native-linuxapp-gcc
FAILED: examples/dpdk-vhost.p/vhost_main.c.o 
gcc -Iexamples/dpdk-vhost.p -Iexamples -I../examples -Iexamples/vhost -I../examples/vhost -I. -I.. -Iconfig -I../config -Ilib/librte_eal/include -I../lib/librte_eal/include -Ilib/librte_eal/linux/include -I../lib/librte_eal/linux/include -Ilib/librte_eal/x86/include -I../lib/librte_eal/x86/include -Ilib/librte_eal/common -I../lib/librte_eal/common -Ilib/librte_eal -I../lib/librte_eal -Ilib/librte_kvargs -I../lib/librte_kvargs -Ilib/librte_metrics -I../lib/librte_metrics -Ilib/librte_telemetry -I../lib/librte_telemetry -Ilib/librte_mempool -I../lib/librte_mempool -Ilib/librte_ring -I../lib/librte_ring -Ilib/librte_net -I../lib/librte_net -Ilib/librte_mbuf -I../lib/librte_mbuf -Ilib/librte_ethdev -I../lib/librte_ethdev -Ilib/librte_meter -I../lib/librte_meter -Ilib/librte_cmdline -I../lib/librte_cmdline -Ilib/librte_vhost -I../lib/librte_vhost -Ilib/librte_cryptodev -I../lib/librte_cryptodev -Ilib/librte_hash -I../lib/librte_hash -Ilib/librte_rcu -I../lib/librte_rcu -Ilib/librte_pci -I../lib/librte_pci -Idrivers/raw/ioat -I../drivers/raw/ioat -Ilib/librte_rawdev -I../lib/librte_rawdev -Idrivers/bus/pci -I../drivers/bus/pci -I../drivers/bus/pci/linux -Idrivers/bus/vdev -I../drivers/bus/vdev -fdiagnostics-color=always -pipe -D_FILE_OFFSET_BITS=64 -Wall -Winvalid-pch -Werror -O3 -include rte_config.h -Wextra -Wcast-qual -Wdeprecated -Wformat -Wformat-nonliteral -Wformat-security -Wmissing-declarations -Wmissing-prototypes -Wnested-externs -Wold-style-definition -Wpointer-arith -Wsign-compare -Wstrict-prototypes -Wundef -Wwrite-strings -Wno-address-of-packed-member -Wno-packed-not-aligned -Wno-missing-field-initializers -Wno-zero-length-bounds -D_GNU_SOURCE -march=native -Wno-format-truncation -DALLOW_EXPERIMENTAL_API -MD -MQ examples/dpdk-vhost.p/vhost_main.c.o -MF examples/dpdk-vhost.p/vhost_main.c.o.d -o examples/dpdk-vhost.p/vhost_main.c.o -c ../examples/vhost/main.c
../examples/vhost/main.c: In function ‘drain_vhost’:
../examples/vhost/main.c:871:9: error: too many arguments to function ‘rte_vhost_submit_enqueue_burst’
  871 |   ret = rte_vhost_submit_enqueue_burst(vdev->vid, VIRTIO_RXQ,
      |         ^~~~~~~~~~~~~~~~~~~~~~~~~~~~~~
In file included from ../examples/vhost/ioat.h:10,
                 from ../examples/vhost/main.c:28:
../lib/librte_vhost/rte_vhost_async.h:166:10: note: declared here
  166 | uint16_t rte_vhost_submit_enqueue_burst(int vid, uint16_t queue_id,
      |          ^~~~~~~~~~~~~~~~~~~~~~~~~~~~~~
../examples/vhost/main.c: In function ‘drain_eth_rx’:
../examples/vhost/main.c:1171:19: error: too many arguments to function ‘rte_vhost_submit_enqueue_burst’
 1171 |   enqueue_count = rte_vhost_submit_enqueue_burst(vdev->vid,
      |                   ^~~~~~~~~~~~~~~~~~~~~~~~~~~~~~
In file included from ../examples/vhost/ioat.h:10,
                 from ../examples/vhost/main.c:28:
../lib/librte_vhost/rte_vhost_async.h:166:10: note: declared here
  166 | uint16_t rte_vhost_submit_enqueue_burst(int vid, uint16_t queue_id,
      |          ^~~~~~~~~~~~~~~~~~~~~~~~~~~~~~
[2659/2736] Compiling C object examples/dpdk-vhost.p/vhost_virtio_net.c.o
[2660/2736] Generating rte_kni with a custom command
make: Entering directory '/usr/src/linux-headers-5.4.0-47-generic'
  CC [M]  /root/UB2004-64_K5.4.0_GCC9.3.0/x86_64-native-linuxapp-gcc/58b516968ddb4c309879333801f5b2b3/dpdk/x86_64-native-linuxapp-gcc/kernel/linux/kni/kni_net.o
  CC [M]  /root/UB2004-64_K5.4.0_GCC9.3.0/x86_64-native-linuxapp-gcc/58b516968ddb4c309879333801f5b2b3/dpdk/x86_64-native-linuxapp-gcc/kernel/linux/kni/kni_misc.o
  LD [M]  /root/UB2004-64_K5.4.0_GCC9.3.0/x86_64-native-linuxapp-gcc/58b516968ddb4c309879333801f5b2b3/dpdk/x86_64-native-linuxapp-gcc/kernel/linux/kni/rte_kni.o
  Building modules, stage 2.
  MODPOST 1 modules
  CC [M]  /root/UB2004-64_K5.4.0_GCC9.3.0/x86_64-native-linuxapp-gcc/58b516968ddb4c309879333801f5b2b3/dpdk/x86_64-native-linuxapp-gcc/kernel/linux/kni/rte_kni.mod.o
  LD [M]  /root/UB2004-64_K5.4.0_GCC9.3.0/x86_64-native-linuxapp-gcc/58b516968ddb4c309879333801f5b2b3/dpdk/x86_64-native-linuxapp-gcc/kernel/linux/kni/rte_kni.ko
make: Leaving directory '/usr/src/linux-headers-5.4.0-47-generic'
[2661/2736] Compiling C object drivers/libtmp_rte_event_octeontx2.a.p/event_octeontx2_otx2_worker.c.o
[2662/2736] Compiling C object drivers/libtmp_rte_event_octeontx2.a.p/event_octeontx2_otx2_worker_dual.c.o
ninja: build stopped




*Build Failed #14:
OS: UB2004-64
Target: x86_64-native-linuxapp-icc
FAILED: examples/dpdk-vhost.p/vhost_main.c.o 
icc -Iexamples/dpdk-vhost.p -Iexamples -I../examples -Iexamples/vhost -I../examples/vhost -I. -I.. -Iconfig -I../config -Ilib/librte_eal/include -I../lib/librte_eal/include -Ilib/librte_eal/linux/include -I../lib/librte_eal/linux/include -Ilib/librte_eal/x86/include -I../lib/librte_eal/x86/include -Ilib/librte_eal/common -I../lib/librte_eal/common -Ilib/librte_eal -I../lib/librte_eal -Ilib/librte_kvargs -I../lib/librte_kvargs -Ilib/librte_metrics -I../lib/librte_metrics -Ilib/librte_telemetry -I../lib/librte_telemetry -Ilib/librte_mempool -I../lib/librte_mempool -Ilib/librte_ring -I../lib/librte_ring -Ilib/librte_net -I../lib/librte_net -Ilib/librte_mbuf -I../lib/librte_mbuf -Ilib/librte_ethdev -I../lib/librte_ethdev -Ilib/librte_meter -I../lib/librte_meter -Ilib/librte_cmdline -I../lib/librte_cmdline -Ilib/librte_vhost -I../lib/librte_vhost -Ilib/librte_cryptodev -I../lib/librte_cryptodev -Ilib/librte_hash -I../lib/librte_hash -Ilib/librte_rcu -I../lib/librte_rcu -Ilib/librte_pci -I../lib/librte_pci -Idrivers/raw/ioat -I../drivers/raw/ioat -Ilib/librte_rawdev -I../lib/librte_rawdev -Idrivers/bus/pci -I../drivers/bus/pci -I../drivers/bus/pci/linux -Idrivers/bus/vdev -I../drivers/bus/vdev -pipe -D_FILE_OFFSET_BITS=64 -Wall -w3 -diag-disable:remark -Werror -O3 -include rte_config.h -Wextra -Wcast-qual -Wdeprecated -Wformat -Wformat-security -Wmissing-declarations -Wmissing-prototypes -Wold-style-definition -Wpointer-arith -Wsign-compare -Wstrict-prototypes -Wundef -Wwrite-strings -Wno-missing-field-initializers -diag-disable=181 -diag-disable=188 -diag-disable=2203 -diag-disable=2279 -diag-disable=2557 -diag-disable=3179 -diag-disable=3656 -D_GNU_SOURCE -march=native -DALLOW_EXPERIMENTAL_API -MD -MQ examples/dpdk-vhost.p/vhost_main.c.o -MF examples/dpdk-vhost.p/vhost_main.c.o.d -o examples/dpdk-vhost.p/vhost_main.c.o -c ../examples/vhost/main.c
../examples/vhost/main.c(832): error #2330: argument of type "atomic_int_least16_t={_Atomic(short)} *" is incompatible with parameter of type "volatile void *" (dropping qualifiers)
  		atomic_fetch_sub(&vdev->nr_async_pkts, complete_count);
  		^

../examples/vhost/main.c(850): error #2330: argument of type "atomic_int_least64_t={_Atomic(long)} *" is incompatible with parameter of type "volatile void *" (dropping qualifiers)
  		atomic_fetch_add(&dst_vdev->stats.rx_total_atomic, 1);
  		^

../examples/vhost/main.c(851): error #2330: argument of type "atomic_int_least64_t={_Atomic(long)} *" is incompatible with parameter of type "volatile void *" (dropping qualifiers)
  		atomic_fetch_add(&dst_vdev->stats.rx_atomic, ret);
  		^

../examples/vhost/main.c(872): error #140: too many arguments in function call
  					m, nr_xmit, m_cpu_cpl, &cpu_cpl_nr);
  					            ^

../examples/vhost/main.c(873): error #2330: argument of type "atomic_int_least16_t={_Atomic(short)} *" is incompatible with parameter of type "volatile void *" (dropping qualifiers)
  		atomic_fetch_add(&vdev->nr_async_pkts, ret - cpu_cpl_nr);
  		^

../examples/vhost/main.c(884): error #2330: argument of type "atomic_int_least64_t={_Atomic(long)} *" is incompatible with parameter of type "volatile void *" (dropping qualifiers)
  		atomic_fetch_add(&vdev->stats.rx_total_atomic, nr_xmit);
  		^

../examples/vhost/main.c(885): error #2330: argument of type "atomic_int_least64_t={_Atomic(long)} *" is incompatible with parameter of type "volatile void *" (dropping qualifiers)
  		atomic_fetch_add(&vdev->stats.rx_atomic, ret);
  		^

../examples/vhost/main.c(1173): error #140: too many arguments in function call
  					m_cpu_cpl, &cpu_cpl_nr);
  					^

../examples/vhost/main.c(1174): error #2330: argument of type "atomic_int_least16_t={_Atomic(short)} *" is incompatible with parameter of type "volatile void *" (dropping qualifiers)
  		atomic_fetch_add(&vdev->nr_async_pkts,
  		^

../examples/vhost/main.c(1186): error #2330: argument of type "atomic_int_least64_t={_Atomic(long)} *" is incompatible with parameter of type "volatile void *" (dropping qualifiers)
  		atomic_fetch_add(&vdev->stats.rx_total_atomic, rx_count);
  		^

../examples/vhost/main.c(1187): error #2330: argument of type "atomic_int_least64_t={_Atomic(long)} *" is incompatible with parameter of type "volatile void *" (dropping qualifiers)
  		atomic_fetch_add(&vdev->stats.rx_atomic, enqueue_count);
  		^

../examples/vhost/main.c(1460): error #2330: argument of type "atomic_int_least64_t={_Atomic(long)} *" is incompatible with parameter of type "const volatile void *" (dropping qualifiers)
  			rx_total   = atomic_load(&vdev->stats.rx_total_atomic);
  			             ^

../examples/vhost/main.c(1461): error #2330: argument of type "atomic_int_least64_t={_Atomic(long)} *" is incompatible with parameter of type "const volatile void *" (dropping qualifiers)
  			rx         = atomic_load(&vdev->stats.rx_atomic);
  			             ^

compilation aborted for ../examples/vhost/main.c (code 2)
[2648/2736] Compiling C object examples/dpdk-efd_server.p/server_node_efd_server_main.c.o
[2649/2736] Compiling C object examples/dpdk-timer.p/timer_main.c.o
[2650/2736] Compiling C object examples/dpdk-vhost.p/vhost_ioat.c.o
In file included from ../drivers/raw/ioat/rte_ioat_rawdev.h(169),
                 from ../examples/vhost/ioat.c(8):
../drivers/raw/ioat/rte_ioat_rawdev_fns.h(254): warning #300: const variable "null_hdl" requires an initializer
  	static const uintptr_t null_hdl;
  	                               ^

In file included from ../drivers/raw/ioat/rte_ioat_rawdev.h(169),
                 from ../examples/vhost/ioat.c(8):
../drivers/raw/ioat/rte_ioat_rawdev_fns.h(450): warning #300: const variable "null_hdl" requires an initializer
  	static const struct rte_idxd_user_hdl null_hdl;
  	                                              ^

[2651/2736] Compiling C object examples/dpdk-vhost_blk.p/vhost_blk_vhost_blk_compat.c.o
[2652/2736] Compiling C object examples/dpdk-vmdq_dcb.p/vmdq_dcb_main.c.o
[2653/2736] Compiling C object app/test/dpdk-test.p/test_ring_perf.c.o
[2654/2736] Compiling C object app/test/dpdk-test.p/test_memcpy_perf.c.o
[2655/2736] Compiling C object drivers/libtmp_rte_event_octeontx2.a.p/event_octeontx2_otx2_worker.c.o
[2656/2736] Compiling C object drivers/libtmp_rte_event_octeontx2.a.p/event_octeontx2_otx2_worker_dual.c.o
ninja: build stopped




*Build Failed #15:
OS: UB2010-64
Target: x86_64-native-linuxapp-gcc
FAILED: examples/c590b3c@@dpdk-vhost at exe/vhost_main.c.o 
gcc -Iexamples/c590b3c@@dpdk-vhost at exe -Iexamples -I../examples -Iexamples/vhost -I../examples/vhost -I. -I../ -Iconfig -I../config -Ilib/librte_eal/include -I../lib/librte_eal/include -Ilib/librte_eal/linux/include -I../lib/librte_eal/linux/include -Ilib/librte_eal/x86/include -I../lib/librte_eal/x86/include -Ilib/librte_eal/common -I../lib/librte_eal/common -Ilib/librte_eal -I../lib/librte_eal -Ilib/librte_kvargs -I../lib/librte_kvargs -Ilib/librte_telemetry/../librte_metrics -I../lib/librte_telemetry/../librte_metrics -Ilib/librte_telemetry -I../lib/librte_telemetry -Ilib/librte_mempool -I../lib/librte_mempool -Ilib/librte_ring -I../lib/librte_ring -Ilib/librte_net -I../lib/librte_net -Ilib/librte_mbuf -I../lib/librte_mbuf -Ilib/librte_ethdev -I../lib/librte_ethdev -Ilib/librte_meter -I../lib/librte_meter -Ilib/librte_cmdline -I../lib/librte_cmdline -Ilib/librte_vhost -I../lib/librte_vhost -Ilib/librte_cryptodev -I../lib/librte_cryptodev -Ilib/librte_hash -I../lib/librte_hash -Ilib/librte_rcu -I../lib/librte_rcu -Ilib/librte_pci -I../lib/librte_pci -Idrivers/raw/ioat -I../drivers/raw/ioat -Ilib/librte_rawdev -I../lib/librte_rawdev -Idrivers/bus/pci -I../drivers/bus/pci -I../drivers/bus/pci/linux -Idrivers/bus/vdev -I../drivers/bus/vdev -fdiagnostics-color=always -pipe -D_FILE_OFFSET_BITS=64 -Wall -Winvalid-pch -Werror -O3 -include rte_config.h -Wextra -Wcast-qual -Wdeprecated -Wformat -Wformat-nonliteral -Wformat-security -Wmissing-declarations -Wmissing-prototypes -Wnested-externs -Wold-style-definition -Wpointer-arith -Wsign-compare -Wstrict-prototypes -Wundef -Wwrite-strings -Wno-address-of-packed-member -Wno-packed-not-aligned -Wno-missing-field-initializers -Wno-zero-length-bounds -D_GNU_SOURCE -march=native -Wno-format-truncation -DALLOW_EXPERIMENTAL_API -MD -MQ 'examples/c590b3c@@dpdk-vhost at exe/vhost_main.c.o' -MF 'examples/c590b3c@@dpdk-vhost at exe/vhost_main.c.o.d' -o 'examples/c590b3c@@dpdk-vhost at exe/vhost_main.c.o' -c ../examples/vhost/main.c
../examples/vhost/main.c: In function ‘drain_vhost’:
../examples/vhost/main.c:871:9: error: too many arguments to function ‘rte_vhost_submit_enqueue_burst’
  871 |   ret = rte_vhost_submit_enqueue_burst(vdev->vid, VIRTIO_RXQ,
      |         ^~~~~~~~~~~~~~~~~~~~~~~~~~~~~~
In file included from ../examples/vhost/ioat.h:10,
                 from ../examples/vhost/main.c:28:
../lib/librte_vhost/rte_vhost_async.h:166:10: note: declared here
  166 | uint16_t rte_vhost_submit_enqueue_burst(int vid, uint16_t queue_id,
      |          ^~~~~~~~~~~~~~~~~~~~~~~~~~~~~~
../examples/vhost/main.c: In function ‘drain_eth_rx’:
../examples/vhost/main.c:1171:19: error: too many arguments to function ‘rte_vhost_submit_enqueue_burst’
 1171 |   enqueue_count = rte_vhost_submit_enqueue_burst(vdev->vid,
      |                   ^~~~~~~~~~~~~~~~~~~~~~~~~~~~~~
In file included from ../examples/vhost/ioat.h:10,
                 from ../examples/vhost/main.c:28:
../lib/librte_vhost/rte_vhost_async.h:166:10: note: declared here
  166 | uint16_t rte_vhost_submit_enqueue_burst(int vid, uint16_t queue_id,
      |          ^~~~~~~~~~~~~~~~~~~~~~~~~~~~~~
[2656/2739] Compiling C object 'examples/c590b3c@@dpdk-vhost_blk at exe/vhost_blk_vhost_blk_compat.c.o'.
[2657/2739] Compiling C object 'examples/c590b3c@@dpdk-vhost at exe/vhost_virtio_net.c.o'.
[2658/2739] Compiling C object 'examples/c590b3c@@dpdk-vhost at exe/vhost_ioat.c.o'.
[2659/2739] Compiling C object 'examples/c590b3c@@dpdk-vhost_blk at exe/vhost_blk_vhost_blk.c.o'.
[2660/2739] Compiling C object 'examples/c590b3c@@dpdk-efd_server at exe/server_node_efd_server_main.c.o'.
[2661/2739] Compiling C object 'examples/c590b3c@@dpdk-vmdq at exe/vmdq_main.c.o'.
[2662/2739] Compiling C object 'examples/c590b3c@@dpdk-vmdq_dcb at exe/vmdq_dcb_main.c.o'.
[2663/2739] Compiling C object 'drivers/a715181@@tmp_rte_event_octeontx2 at sta/event_octeontx2_otx2_worker.c.o'.
[2664/2739] Compiling C object 'drivers/a715181@@tmp_rte_event_octeontx2 at sta/event_octeontx2_otx2_worker_dual.c.o'.
ninja: build stopped


DPDK STV team


More information about the test-report mailing list