[dpdk-test-report] |FAILURE| pw64275[v3, 1/2] ethdev: add L2TPv3 over IP header to flow API

sys_stv at intel.com sys_stv at intel.com
Tue Jan 7 17:08:48 CET 2020


Test-Label: Intel-compilation
Test-Status: FAILURE
http://dpdk.org/patch/64275

_Compilation issues_

Submitter: Rory Sexton <rory.sexton at intel.com>
Date: 2020-01-07 15:39:45
Reply_mail: 20200107153946.6876-1-rory.sexton at intel.com
DPDK git baseline: Repo:dpdk-next-net, CommitID: f8b977c17e410a72ebf7ef85ee1bf7a80f8b159b

Makefile build Summary: 23 Builds Done, 0 Successful, 23 Failures

Meson build Summary: 8 Builds Done, 2 Successful, 6 Failures

               +==============================================+===========+==========+
               |                   Makefile                   |   Meson   | Document |
+----------------+------+-------+------+------------+-----------+-----------+----------+
| os             | gcc  | clang | icc  | gcc+shared | gcc+debug | gcc/clang | pdf/html |
+----------------+------+-------+------+------------+-----------+-----------+----------+
| RHEL80-64      | FAIL |       |      |            |           |           |          |
| UB1804-64      | FAIL | FAIL  | FAIL |            |           | FAIL      | pass     |
| UB1604-32      | FAIL |       |      |            |           | FAIL      |          |
| CENTOS77-64    | FAIL | FAIL  | FAIL | FAIL       | FAIL      | FAIL      |          |
| UB1604-64      | FAIL | FAIL  |      |            |           |           |          |
| FC30-64        | FAIL |       |      |            |           |           |          |
| WIN10-64       |      |       |      |            |           | pass      |          |
| UB1910-64      | FAIL |       |      |            |           |           |          |
| FC31-64        | FAIL | FAIL  |      |            |           | FAIL      |          |
| CENTOS80-64    | FAIL |       |      |            |           |           |          |
| FreeBSD1201-64 | FAIL | FAIL  |      | FAIL       | FAIL      | FAIL      |          |
| RHEL77-64      | FAIL |       |      |            |           |           |          |
| SUSE15-64      | FAIL | FAIL  |      |            |           | FAIL      |          |
+----------------+------+-------+------+------------+-----------+-----------+----------+

Test environment and configuration as below:

** Makefile build **


OS: UB1804-64
	Kernel Version: 4.15.0-20-generic
	CPU info: Intel(R) Xeon(R) CPU E5-2699 v3 @ 2.30GHz
	GCC Version: gcc (Ubuntu 7.3.0-27ubuntu1~18.04) 7.3.0
	Clang Version: 6.0.0-1ubuntu2 (tags/RELEASE_600/final)
	x86_64-native-linuxapp-icc
	x86_64-native-linuxapp-clang
	x86_64-native-linuxapp-gcc


OS: UB1604-32
	Kernel Version: 4.4.0-131-generic
	CPU info: Intel(R) Xeon(R) CPU E5-2699 v3 @ 2.30GHz
	GCC Version: gcc (Ubuntu 5.4.0-6ubuntu1~16.04.11) 5.4.0 20160609
	Clang Version: 3.8.0-2ubuntu4 (tags/RELEASE_380/final)
	i686-native-linuxapp-gcc


OS: CENTOS77-64
	Kernel Version: 3.10.0-1062.9.1.el7.x86_64
	CPU info: Intel(R) Xeon(R) CPU E5-2699 v4 @ 2.20GHz
	GCC Version: gcc (GCC) 4.8.5 20150623 (Red Hat 4.8.5-39)
	Clang Version: 3.4.2 (tags/RELEASE_34/dot2-final)
	x86_64-native-linuxapp-gcc+debug
	x86_64-native-linuxapp-gcc+shared
	x86_64-native-linuxapp-gcc
	x86_64-native-linuxapp-clang
	x86_64-native-linuxapp-icc


OS: UB1910-64
	Kernel Version: 5.3.0-18-generic
	CPU info: Intel(R) Xeon(R) CPU E5-2699 v3 @ 2.30GHz
	GCC Version: gcc (Ubuntu 9.2.1-9ubuntu2) 9.2.1 20191008
	Clang Version: 9.0.0-2 (tags/RELEASE_900/final)
	x86_64-native-linuxapp-gcc


OS: CENTOS80-64
	Kernel Version: 4.18.0-80.11.2.el8_0.x86_64
	CPU info: Intel(R) Xeon(R) CPU E5-2699 v4 @ 2.20GHz
	GCC Version: gcc (GCC) 8.2.1 20180905 (Red Hat 8.2.1-3)
	Clang Version: 7.0.1 (tags/RELEASE_701/final)
	x86_64-native-linuxapp-gcc


OS: UB1604-64
	Kernel Version: 4.4.0-170-generic
	CPU info: Intel(R) Xeon(R) CPU E5-2699 v3 @ 2.30GHz
	GCC Version: gcc (Ubuntu 5.4.0-6ubuntu1~16.04.12) 5.4.0 20160609
	Clang Version: 3.8.0-2ubuntu4 (tags/RELEASE_380/final)
	x86_64-native-linuxapp-clang
	x86_64-native-linuxapp-gcc


OS: FC31-64
	Kernel Version: 5.3.15-300.fc31.x86_64
	CPU info: Intel(R) Xeon(R) CPU E5-2699 v4 @ 2.20GHz
	GCC Version: gcc (GCC) 9.2.1 20190827 (Red Hat 9.2.1-1)
	Clang Version: 9.0.0 (Fedora 9.0.0-1.fc31)
	x86_64-native-linuxapp-gcc
	x86_64-native-linuxapp-clang


OS: RHEL80-64
	Kernel Version: 4.18.0-80.el8.x86_64
	CPU info: Intel(R) Xeon(R) CPU E5-2699 v4 @ 2.20GHz
	GCC Version: gcc (GCC) 8.2.1 20180905 (Red Hat 8.2.1-3)
	Clang Version: 6.0.1 (tags/RELEASE_601/final)
	x86_64-native-linuxapp-gcc


OS: FreeBSD1201-64
	Kernel Version: 12.1-RELEASE
	CPU info: Intel(R) Xeon(R) CPU E5-2699 v4 @ 2.20GHz (2194.98-MHz K8-class CPU)
	GCC Version: gcc (FreeBSD Ports Collection) 9.2.0
	Clang Version: 8.0.1 (tags/RELEASE_801/final 366581) (based on LLVM 8.0.1)
	x86_64-native-bsdapp-gcc+shared
	x86_64-native-bsdapp-gcc+debug
	x86_64-native-bsdapp-clang
	x86_64-native-bsdapp-gcc


OS: RHEL77-64
	Kernel Version: 3.10.0-1062.9.1.el7.x86_64
	CPU info: Intel(R) Xeon(R) CPU E5-2699 v4 @ 2.20GHz
	GCC Version: gcc (GCC) 4.8.5 20150623 (Red Hat 4.8.5-39)
	Clang Version: 3.4.2 (tags/RELEASE_34/dot2-final)
	x86_64-native-linuxapp-gcc


OS: SUSE15-64
	Kernel Version: 4.12.14-lp150.11-default
	CPU info: Intel(R) Xeon(R) CPU E5-2699 v4 @ 2.20GHz
	GCC Version: gcc (SUSE Linux) 7.3.1 20180323 [gcc-7-branch revision 258812]
	Clang Version: 5.0.1 (tags/RELEASE_501/final 312548)
	x86_64-native-linuxapp-gcc
	x86_64-native-linuxapp-clang


** Meson build **


OS: UB1804-64
	Kernel Version: 4.15.0-20-generic
	CPU info: Intel(R) Xeon(R) CPU E5-2699 v4 @ 2.20GHz
	GCC Version: gcc (Ubuntu 7.3.0-27ubuntu1~18.04) 7.3.0
	Clang Version: 6.0.0-1ubuntu2 (tags/RELEASE_600/final)
	x86_64-native-linuxapp-doc
	./build-gcc-static
	./build-gcc-shared
	./build-clang-static
	./build-clang-shared
	./build-x86-default


OS: UB1604-32
	Kernel Version: 4.4.0-131-generic
	CPU info: Intel(R) Xeon(R) CPU E5-2699 v4 @ 2.20GHz
	GCC Version: gcc (Ubuntu 5.4.0-6ubuntu1~16.04.11) 5.4.0 20160609
	Clang Version: 3.8.0-2ubuntu4 (tags/RELEASE_380/final)
	./build-gcc-static
	./build-gcc-shared
	./build-clang-static
	./build-clang-shared
	./build-x86-default


OS: CENTOS77-64
	Kernel Version: 3.10.0-1062.9.1.el7.x86_64
	CPU info: Intel(R) Xeon(R) CPU E5-2699 v4 @ 2.20GHz
	GCC Version: gcc (GCC) 4.8.5 20150623 (Red Hat 4.8.5-39)
	Clang Version: 3.4.2 (tags/RELEASE_34/dot2-final)
	./build-gcc-static
	./build-gcc-shared
	./build-clang-static
	./build-clang-shared
	./build-x86-default


OS: WIN10-64
	Kernel Version: N/A
	CPU info: N/A
	GCC Version: N/A
	Clang Version: Clang 8.0.0
	x86_64-windows-clang


OS: FC31-64
	Kernel Version: 5.3.14-300.fc31.x86_64
	CPU info: Intel(R) Xeon(R) CPU E5-2699 v4 @ 2.20GHz
	GCC Version: gcc (GCC) 9.2.1 20190827 (Red Hat 9.2.1-1)
	Clang Version: 9.0.0 (Fedora 9.0.0-1.fc31)
	./build-gcc-static
	./build-gcc-shared
	./build-clang-static
	./build-clang-shared
	./build-x86-default


OS: FreeBSD1201-64
	Kernel Version: 12.1-RELEASE
	CPU info: Intel(R) Xeon(R) CPU E5-2699 v4 @ 2.20GHz (2194.97-MHz K8-class CPU)
	GCC Version: gcc (FreeBSD Ports Collection) 9.2.0
	Clang Version: 8.0.1 (tags/RELEASE_801/final 366581) (based on LLVM 8.0.1)
	./build-gcc-static
	./build-gcc-shared
	./build-clang-static
	./build-clang-shared
	./build-x86-default


OS: SUSE15-64
	Kernel Version: 4.12.14-lp150.11-default
	CPU info: Intel(R) Xeon(R) CPU E5-2699 v4 @ 2.20GHz
	GCC Version: gcc (SUSE Linux) 7.3.1 20180323 [gcc-7-branch revision 258812]
	Clang Version: 5.0.1 (tags/RELEASE_501/final 312548)
	./build-gcc-static
	./build-gcc-shared
	./build-clang-static
	./build-clang-shared
	./build-x86-default


*Make Build Failed #1:
OS: UB1604-64
Target: x86_64-native-linuxapp-clang
                                ^     ~~~~~~~~~~~~~~~~~~~~~~~~~~~~~~~~
/root/UB1604-64_K4.4.0_Clang3.8.0/x86_64-native-linuxapp-clang/aa869313e13146b88b8c0b601e1a3d76/dpdk/drivers/net/i40e/i40e_fdir.c:1134:9: note: forward declaration of 'struct rte_flow_item_l2tpv3oip'
        struct rte_flow_item_l2tpv3oip *l2tpv3oip;
               ^
3 errors generated.
/root/UB1604-64_K4.4.0_Clang3.8.0/x86_64-native-linuxapp-clang/aa869313e13146b88b8c0b601e1a3d76/dpdk/mk/internal/rte.compile-pre.mk:114: recipe for target 'i40e_fdir.o' failed
make[6]: *** [i40e_fdir.o] Error 1
make[6]: *** Waiting for unfinished jobs....
  CC octeontx_pkivf.o
  PMDINFO rte_eth_null.o.pmd.c
  CC rte_eth_null.o.pmd.o
  LD rte_eth_null.o
--
  CC octeontx_ethdev.o
  CC hn_vf.o
  CC ice_nvm.o
  CC ice_flex_pipe.o
  CC otx2_rx.o
/root/UB1604-64_K4.4.0_Clang3.8.0/x86_64-native-linuxapp-clang/aa869313e13146b88b8c0b601e1a3d76/dpdk/mk/rte.subdir.mk:35: recipe for target 'i40e' failed
make[5]: *** [i40e] Error 2
make[5]: *** Waiting for unfinished jobs....
  CC otx2_tx.o
  CC ixgbe_dcb_82598.o
  CC otx2_tm.o
  PMDINFO octeontx_ethdev.o.pmd.c
--
  AR librte_pmd_bnxt.a
  INSTALL-LIB librte_pmd_bnxt.a
make[6]: warning:  Clock skew detected.  Your build may be incomplete.
  AR librte_pmd_ixgbe.a
  INSTALL-LIB librte_pmd_ixgbe.a
/root/UB1604-64_K4.4.0_Clang3.8.0/x86_64-native-linuxapp-clang/aa869313e13146b88b8c0b601e1a3d76/dpdk/mk/rte.subdir.mk:35: recipe for target 'net' failed
make[4]: *** [net] Error 2
/root/UB1604-64_K4.4.0_Clang3.8.0/x86_64-native-linuxapp-clang/aa869313e13146b88b8c0b601e1a3d76/dpdk/mk/rte.sdkbuild.mk:46: recipe for target 'drivers' failed
make[3]: *** [drivers] Error 2
/root/UB1604-64_K4.4.0_Clang3.8.0/x86_64-native-linuxapp-clang/aa869313e13146b88b8c0b601e1a3d76/dpdk/mk/rte.sdkroot.mk:98: recipe for target 'all' failed
make[2]: *** [all] Error 2
/root/UB1604-64_K4.4.0_Clang3.8.0/x86_64-native-linuxapp-clang/aa869313e13146b88b8c0b601e1a3d76/dpdk/mk/rte.sdkinstall.mk:60: recipe for target 'pre_install' failed
make[1]: *** [pre_install] Error 2
/root/UB1604-64_K4.4.0_Clang3.8.0/x86_64-native-linuxapp-clang/aa869313e13146b88b8c0b601e1a3d76/dpdk/mk/rte.sdkroot.mk:77: recipe for target 'install' failed
make: *** [install] Error 2


*Make Build Failed #2:
OS: UB1604-32
Target: i686-native-linuxapp-gcc
            ^
  AR librte_pmd_ring.a
  INSTALL-LIB librte_pmd_ring.a
/root/UB1604-32_K4.4.0_GCC5.4.0/i686-native-linuxapp-gcc/aa869313e13146b88b8c0b601e1a3d76/dpdk/drivers/net/i40e/i40e_fdir.c: At top level:
cc1: warning: unrecognized command line option ‘-Wno-address-of-packed-member’
/root/UB1604-32_K4.4.0_GCC5.4.0/i686-native-linuxapp-gcc/aa869313e13146b88b8c0b601e1a3d76/dpdk/mk/internal/rte.compile-pre.mk:114: recipe for target 'i40e_fdir.o' failed
make[6]: *** [i40e_fdir.o] Error 1
/root/UB1604-32_K4.4.0_GCC5.4.0/i686-native-linuxapp-gcc/aa869313e13146b88b8c0b601e1a3d76/dpdk/mk/rte.subdir.mk:35: recipe for target 'i40e' failed
make[5]: *** [i40e] Error 2
make[5]: *** Waiting for unfinished jobs....
  CC ecore_cxt.o
  CC ecore_l2.o
  CC ice_fdir_filter.o
  CC bnxt_ring.o
--
  PMDINFO otx2_ethdev.o.pmd.c
  CC otx2_ethdev.o.pmd.o
  LD otx2_ethdev.o
  AR librte_pmd_octeontx2.a
  INSTALL-LIB librte_pmd_octeontx2.a
/root/UB1604-32_K4.4.0_GCC5.4.0/i686-native-linuxapp-gcc/aa869313e13146b88b8c0b601e1a3d76/dpdk/mk/rte.subdir.mk:35: recipe for target 'net' failed
make[4]: *** [net] Error 2
/root/UB1604-32_K4.4.0_GCC5.4.0/i686-native-linuxapp-gcc/aa869313e13146b88b8c0b601e1a3d76/dpdk/mk/rte.sdkbuild.mk:46: recipe for target 'drivers' failed
make[3]: *** [drivers] Error 2
/root/UB1604-32_K4.4.0_GCC5.4.0/i686-native-linuxapp-gcc/aa869313e13146b88b8c0b601e1a3d76/dpdk/mk/rte.sdkroot.mk:98: recipe for target 'all' failed
make[2]: *** [all] Error 2
/root/UB1604-32_K4.4.0_GCC5.4.0/i686-native-linuxapp-gcc/aa869313e13146b88b8c0b601e1a3d76/dpdk/mk/rte.sdkinstall.mk:60: recipe for target 'pre_install' failed
make[1]: *** [pre_install] Error 2
/root/UB1604-32_K4.4.0_GCC5.4.0/i686-native-linuxapp-gcc/aa869313e13146b88b8c0b601e1a3d76/dpdk/mk/rte.sdkroot.mk:77: recipe for target 'install' failed
make: *** [install] Error 2


*Make Build Failed #3:
OS: UB1910-64
Target: x86_64-native-linuxapp-gcc
 1311 |     l2tpv3oip->session_id =
      |              ^~
/root/UB1910-64_K5.3.0_GCC9.2.1/x86_64-native-linuxapp-gcc/aa869313e13146b88b8c0b601e1a3d76/dpdk/drivers/net/i40e/i40e_fdir.c:1317:12: error: invalid application of ‘sizeof’ to incomplete type ‘struct rte_flow_item_l2tpv3oip’
 1317 |     sizeof(struct rte_flow_item_l2tpv3oip);
      |            ^~~~~~
make[6]: *** [/root/UB1910-64_K5.3.0_GCC9.2.1/x86_64-native-linuxapp-gcc/aa869313e13146b88b8c0b601e1a3d76/dpdk/mk/internal/rte.compile-pre.mk:114: i40e_fdir.o] Error 1
make[5]: *** [/root/UB1910-64_K5.3.0_GCC9.2.1/x86_64-native-linuxapp-gcc/aa869313e13146b88b8c0b601e1a3d76/dpdk/mk/rte.subdir.mk:37: i40e] Error 2
make[5]: *** Waiting for unfinished jobs....
  CC hn_vf.o
  CC ixgbe_hv_vf.o
  CC ixgbe_dcb.o
  CC nfp_mutex.o
--
  CC bnxt_rxtx_vec_sse.o
  INSTALL-LIB librte_pmd_nfp.a
  AR librte_pmd_bnxt.a
  INSTALL-LIB librte_pmd_bnxt.a
make[6]: warning:  Clock skew detected.  Your build may be incomplete.
make[4]: *** [/root/UB1910-64_K5.3.0_GCC9.2.1/x86_64-native-linuxapp-gcc/aa869313e13146b88b8c0b601e1a3d76/dpdk/mk/rte.subdir.mk:35: net] Error 2
make[3]: *** [/root/UB1910-64_K5.3.0_GCC9.2.1/x86_64-native-linuxapp-gcc/aa869313e13146b88b8c0b601e1a3d76/dpdk/mk/rte.sdkbuild.mk:46: drivers] Error 2
make[2]: *** [/root/UB1910-64_K5.3.0_GCC9.2.1/x86_64-native-linuxapp-gcc/aa869313e13146b88b8c0b601e1a3d76/dpdk/mk/rte.sdkroot.mk:99: all] Error 2
make[1]: *** [/root/UB1910-64_K5.3.0_GCC9.2.1/x86_64-native-linuxapp-gcc/aa869313e13146b88b8c0b601e1a3d76/dpdk/mk/rte.sdkinstall.mk:61: pre_install] Error 2
make: *** [/root/UB1910-64_K5.3.0_GCC9.2.1/x86_64-native-linuxapp-gcc/aa869313e13146b88b8c0b601e1a3d76/dpdk/mk/rte.sdkroot.mk:77: install] Error 2


*Make Build Failed #4:
OS: UB1804-64
Target: x86_64-native-linuxapp-icc
/root/UB1804-64_K4.15.0_ICC19.0.0/x86_64-native-linuxapp-icc/aa869313e13146b88b8c0b601e1a3d76/dpdk/drivers/net/i40e/i40e_fdir.c(1317): error: incomplete type is not allowed
  				sizeof(struct rte_flow_item_l2tpv3oip);
  				       ^

compilation aborted for /root/UB1804-64_K4.15.0_ICC19.0.0/x86_64-native-linuxapp-icc/aa869313e13146b88b8c0b601e1a3d76/dpdk/drivers/net/i40e/i40e_fdir.c (code 2)
/root/UB1804-64_K4.15.0_ICC19.0.0/x86_64-native-linuxapp-icc/aa869313e13146b88b8c0b601e1a3d76/dpdk/mk/internal/rte.compile-pre.mk:114: recipe for target 'i40e_fdir.o' failed
make[6]: *** [i40e_fdir.o] Error 2
make[6]: *** Waiting for unfinished jobs....
  CC octeontx_pkovf.o
  LD i40e_ethdev_vf.o
  CC octeontx_pkivf.o
  CC nfp_crc.o
/root/UB1804-64_K4.15.0_ICC19.0.0/x86_64-native-linuxapp-icc/aa869313e13146b88b8c0b601e1a3d76/dpdk/mk/rte.subdir.mk:35: recipe for target 'i40e' failed
make[5]: *** [i40e] Error 2
make[5]: *** Waiting for unfinished jobs....
  CC nfp_mip.o
  CC ice_fdir_filter.o
  CC bnxt_rxq.o
  PMDINFO octeontx_pkovf.o.pmd.c
--
  CC ixgbe_vf_representor.o
  AR librte_pmd_ixgbe.a
  INSTALL-LIB librte_pmd_ixgbe.a
  AR librte_pmd_octeontx2.a
  INSTALL-LIB librte_pmd_octeontx2.a
/root/UB1804-64_K4.15.0_ICC19.0.0/x86_64-native-linuxapp-icc/aa869313e13146b88b8c0b601e1a3d76/dpdk/mk/rte.subdir.mk:35: recipe for target 'net' failed
make[4]: *** [net] Error 2
/root/UB1804-64_K4.15.0_ICC19.0.0/x86_64-native-linuxapp-icc/aa869313e13146b88b8c0b601e1a3d76/dpdk/mk/rte.sdkbuild.mk:46: recipe for target 'drivers' failed
make[3]: *** [drivers] Error 2
/root/UB1804-64_K4.15.0_ICC19.0.0/x86_64-native-linuxapp-icc/aa869313e13146b88b8c0b601e1a3d76/dpdk/mk/rte.sdkroot.mk:98: recipe for target 'all' failed
make[2]: *** [all] Error 2
/root/UB1804-64_K4.15.0_ICC19.0.0/x86_64-native-linuxapp-icc/aa869313e13146b88b8c0b601e1a3d76/dpdk/mk/rte.sdkinstall.mk:60: recipe for target 'pre_install' failed
make[1]: *** [pre_install] Error 2
/root/UB1804-64_K4.15.0_ICC19.0.0/x86_64-native-linuxapp-icc/aa869313e13146b88b8c0b601e1a3d76/dpdk/mk/rte.sdkroot.mk:77: recipe for target 'install' failed
make: *** [install] Error 2


*Make Build Failed #5:
OS: UB1804-64
Target: x86_64-native-linuxapp-clang
             RTE_FLOW_ITEM_TYPE_VOID
/root/UB1804-64_K4.15.0_Clang6.0.0/x86_64-native-linuxapp-clang/aa869313e13146b88b8c0b601e1a3d76/dpdk/x86_64-native-linuxapp-clang/include/rte_flow.h:137:2: note: 'RTE_FLOW_ITEM_TYPE_VOID' declared here
        RTE_FLOW_ITEM_TYPE_VOID,
        ^
3 errors generated.
/root/UB1804-64_K4.15.0_Clang6.0.0/x86_64-native-linuxapp-clang/aa869313e13146b88b8c0b601e1a3d76/dpdk/mk/internal/rte.compile-pre.mk:114: recipe for target 'i40e_fdir.o' failed
make[6]: *** [i40e_fdir.o] Error 1
make[6]: *** Waiting for unfinished jobs....
/root/UB1804-64_K4.15.0_Clang6.0.0/x86_64-native-linuxapp-clang/aa869313e13146b88b8c0b601e1a3d76/dpdk/drivers/net/i40e/i40e_flow.c:3042:8: error: use of undeclared identifier 'RTE_FLOW_ITEM_TYPE_L2TPV3OIP'; did you mean 'RTE_FLOW_ITEM_TYPE_VOID'?
                case RTE_FLOW_ITEM_TYPE_L2TPV3OIP:
                     ^~~~~~~~~~~~~~~~~~~~~~~~~~~~
                     RTE_FLOW_ITEM_TYPE_VOID
--
/root/UB1804-64_K4.15.0_Clang6.0.0/x86_64-native-linuxapp-clang/aa869313e13146b88b8c0b601e1a3d76/dpdk/drivers/net/i40e/i40e_flow.c:2490:15: note: forward declaration of 'struct rte_flow_item_l2tpv3oip'
        const struct rte_flow_item_l2tpv3oip *l2tpv3oip_spec, *l2tpv3oip_mask;
                     ^
== Build drivers/net/bnxt
7 errors generated.
/root/UB1804-64_K4.15.0_Clang6.0.0/x86_64-native-linuxapp-clang/aa869313e13146b88b8c0b601e1a3d76/dpdk/mk/internal/rte.compile-pre.mk:114: recipe for target 'i40e_flow.o' failed
make[6]: *** [i40e_flow.o] Error 1
  AR librte_pmd_lio.a
== Build drivers/net/null
  INSTALL-LIB librte_pmd_lio.a
  CC hn_nvs.o
== Build drivers/net/octeontx
/root/UB1804-64_K4.15.0_Clang6.0.0/x86_64-native-linuxapp-clang/aa869313e13146b88b8c0b601e1a3d76/dpdk/mk/rte.subdir.mk:35: recipe for target 'i40e' failed
make[5]: *** [i40e] Error 2
make[5]: *** Waiting for unfinished jobs....
  CC nfp_resource.o
make[6]: Warning: File 'bnxt_cpr.c' has modification time 18799 s in the future
  SYMLINK-FILE include/rte_pmd_bnxt.h
  CC rte_eth_null.o
--
  INSTALL-LIB librte_pmd_ixgbe.a
  CC bnxt_rxtx_vec_sse.o
  AR librte_pmd_bnxt.a
  INSTALL-LIB librte_pmd_bnxt.a
make[6]: warning:  Clock skew detected.  Your build may be incomplete.
/root/UB1804-64_K4.15.0_Clang6.0.0/x86_64-native-linuxapp-clang/aa869313e13146b88b8c0b601e1a3d76/dpdk/mk/rte.subdir.mk:35: recipe for target 'net' failed
make[4]: *** [net] Error 2
/root/UB1804-64_K4.15.0_Clang6.0.0/x86_64-native-linuxapp-clang/aa869313e13146b88b8c0b601e1a3d76/dpdk/mk/rte.sdkbuild.mk:46: recipe for target 'drivers' failed
make[3]: *** [drivers] Error 2
/root/UB1804-64_K4.15.0_Clang6.0.0/x86_64-native-linuxapp-clang/aa869313e13146b88b8c0b601e1a3d76/dpdk/mk/rte.sdkroot.mk:98: recipe for target 'all' failed
make[2]: *** [all] Error 2
/root/UB1804-64_K4.15.0_Clang6.0.0/x86_64-native-linuxapp-clang/aa869313e13146b88b8c0b601e1a3d76/dpdk/mk/rte.sdkinstall.mk:60: recipe for target 'pre_install' failed
make[1]: *** [pre_install] Error 2
/root/UB1804-64_K4.15.0_Clang6.0.0/x86_64-native-linuxapp-clang/aa869313e13146b88b8c0b601e1a3d76/dpdk/mk/rte.sdkroot.mk:77: recipe for target 'install' failed
make: *** [install] Error 2


*Make Build Failed #6:
OS: CENTOS77-64
Target: x86_64-native-linuxapp-gcc+debug
/root/CENTOS77-64_K3.10.0_GCC4.8.5/x86_64-native-linuxapp-gcc+debug/aa869313e13146b88b8c0b601e1a3d76/dpdk/drivers/net/i40e/i40e_fdir.c:1317:12: error: invalid application of ‘sizeof’ to incomplete type ‘struct rte_flow_item_l2tpv3oip’
     sizeof(struct rte_flow_item_l2tpv3oip);
            ^
/root/CENTOS77-64_K3.10.0_GCC4.8.5/x86_64-native-linuxapp-gcc+debug/aa869313e13146b88b8c0b601e1a3d76/dpdk/drivers/net/i40e/i40e_fdir.c: At top level:
cc1: warning: unrecognized command line option "-Wno-address-of-packed-member" [enabled by default]
make[6]: *** [i40e_fdir.o] Error 1
make[6]: *** Waiting for unfinished jobs....
  CC ice_flow.o
  CC hn_rndis.o
  CC ixgbe_rxtx_vec_sse.o
  PMDINFO i40e_ethdev_vf.o.pmd.c
--
  LD i40e_ethdev_vf.o
  CC nfp_mutex.o
  SYMLINK-FILE include/rte_pmd_bnxt.h
  CC nfp_resource.o
  CC hn_nvs.o
make[5]: *** [i40e] Error 2
make[5]: *** Waiting for unfinished jobs....
  CC bnxt_cpr.o
  PMDINFO ixgbe_ethdev.o.pmd.c
  CC ixgbe_ethdev.o.pmd.o
  CC bnxt_ethdev.o
--
  INSTALL-LIB librte_pmd_nfp.a
  AR librte_pmd_ice.a
  INSTALL-LIB librte_pmd_ice.a
  AR librte_pmd_bnxt.a
  INSTALL-LIB librte_pmd_bnxt.a
make[4]: *** [net] Error 2
make[3]: *** [drivers] Error 2
make[2]: *** [all] Error 2
make[1]: *** [pre_install] Error 2
make: *** [install] Error 2


*Make Build Failed #7:
OS: CENTOS77-64
Target: x86_64-native-linuxapp-gcc+shared
/root/CENTOS77-64_K3.10.0_GCC4.8.5/x86_64-native-linuxapp-gcc+shared/aa869313e13146b88b8c0b601e1a3d76/dpdk/drivers/net/i40e/i40e_fdir.c:1317:12: error: invalid application of ‘sizeof’ to incomplete type ‘struct rte_flow_item_l2tpv3oip’
     sizeof(struct rte_flow_item_l2tpv3oip);
            ^
/root/CENTOS77-64_K3.10.0_GCC4.8.5/x86_64-native-linuxapp-gcc+shared/aa869313e13146b88b8c0b601e1a3d76/dpdk/drivers/net/i40e/i40e_fdir.c: At top level:
cc1: warning: unrecognized command line option "-Wno-address-of-packed-member" [enabled by default]
make[6]: *** [i40e_fdir.o] Error 1
make[6]: *** Waiting for unfinished jobs....
  CC hn_vf.o
  INSTALL-LIB librte_pmd_null.so.20.0.1
== Build drivers/net/octeontx2
/root/CENTOS77-64_K3.10.0_GCC4.8.5/x86_64-native-linuxapp-gcc+shared/aa869313e13146b88b8c0b601e1a3d76/dpdk/drivers/net/i40e/i40e_flow.c:1621:2: error: ‘RTE_FLOW_ITEM_TYPE_L2TPV3OIP’ undeclared here (not in a function)
--
      = l2tpv3oip_spec->session_id;
      ^
/root/CENTOS77-64_K3.10.0_GCC4.8.5/x86_64-native-linuxapp-gcc+shared/aa869313e13146b88b8c0b601e1a3d76/dpdk/drivers/net/i40e/i40e_flow.c: At top level:
cc1: warning: unrecognized command line option "-Wno-address-of-packed-member" [enabled by default]
  CC nfp_resource.o
make[6]: *** [i40e_flow.o] Error 1
make[5]: *** [i40e] Error 2
make[5]: *** Waiting for unfinished jobs....
  CC bnxt_filter.o
  CC bnxt_flow.o
  CC nfp_crc.o
  CC bnxt_hwrm.o
--
  PMDINFO otx2_ethdev.o.pmd.c
  CC otx2_ethdev.o.pmd.o
  LD otx2_ethdev.o
  LD librte_pmd_octeontx2.so.20.0.1
  INSTALL-LIB librte_pmd_octeontx2.so.20.0.1
make[4]: *** [net] Error 2
make[3]: *** [drivers] Error 2
make[2]: *** [all] Error 2
make[1]: *** [pre_install] Error 2
make: *** [install] Error 2


*Make Build Failed #8:
OS: CENTOS77-64
Target: x86_64-native-linuxapp-gcc
/root/CENTOS77-64_K3.10.0_GCC4.8.5/x86_64-native-linuxapp-gcc/aa869313e13146b88b8c0b601e1a3d76/dpdk/drivers/net/i40e/i40e_fdir.c:1317:12: error: invalid application of ‘sizeof’ to incomplete type ‘struct rte_flow_item_l2tpv3oip’
     sizeof(struct rte_flow_item_l2tpv3oip);
            ^
/root/CENTOS77-64_K3.10.0_GCC4.8.5/x86_64-native-linuxapp-gcc/aa869313e13146b88b8c0b601e1a3d76/dpdk/drivers/net/i40e/i40e_fdir.c: At top level:
cc1: warning: unrecognized command line option "-Wno-address-of-packed-member" [enabled by default]
make[6]: *** [i40e_fdir.o] Error 1
make[6]: *** Waiting for unfinished jobs....
== Build drivers/net/qede
  CC ixgbe_api.o
  SYMLINK-FILE include/rte_pmd_bnxt.h
  CC bnxt_cpr.o
make[5]: *** [i40e] Error 2
make[5]: *** Waiting for unfinished jobs....
  CC rte_eth_null.o
  CC octeontx_rxtx.o
  CC ixgbe_vf.o
  CC otx2_rx.o
--
  LD qede_ethdev.o
  AR librte_pmd_ice.a
  INSTALL-LIB librte_pmd_ice.a
  AR librte_pmd_qede.a
  INSTALL-LIB librte_pmd_qede.a
make[4]: *** [net] Error 2
make[3]: *** [drivers] Error 2
make[2]: *** [all] Error 2
make[1]: *** [pre_install] Error 2
make: *** [install] Error 2


*Make Build Failed #9:
OS: CENTOS80-64
Target: x86_64-native-linuxapp-gcc
/root/CENTOS80-64_K4.18.0_GCC8.2.1/x86_64-native-linuxapp-gcc/aa869313e13146b88b8c0b601e1a3d76/dpdk/drivers/net/i40e/i40e_fdir.c:1317:12: error: invalid application of ‘sizeof’ to incomplete type ‘struct rte_flow_item_l2tpv3oip’
     sizeof(struct rte_flow_item_l2tpv3oip);
            ^~~~~~
/root/CENTOS80-64_K4.18.0_GCC8.2.1/x86_64-native-linuxapp-gcc/aa869313e13146b88b8c0b601e1a3d76/dpdk/drivers/net/i40e/i40e_fdir.c: At top level:
cc1: warning: unrecognized command line option ‘-Wno-address-of-packed-member’
make[6]: *** [/root/CENTOS80-64_K4.18.0_GCC8.2.1/x86_64-native-linuxapp-gcc/aa869313e13146b88b8c0b601e1a3d76/dpdk/mk/internal/rte.compile-pre.mk:114: i40e_fdir.o] Error 1
make[5]: *** [/root/CENTOS80-64_K4.18.0_GCC8.2.1/x86_64-native-linuxapp-gcc/aa869313e13146b88b8c0b601e1a3d76/dpdk/mk/rte.subdir.mk:35: i40e] Error 2
make[5]: *** Waiting for unfinished jobs....
  CC nfp_nsp_cmds.o
  SYMLINK-FILE include/rte_eth_ring.h
  CC rte_eth_ring.o
  CC nfp_nsp_eth.o
--
  CC hunt_nic.o
  CC medford_nic.o
  CC medford2_nic.o
  AR librte_pmd_sfc_efx.a
  INSTALL-LIB librte_pmd_sfc_efx.a
make[4]: *** [/root/CENTOS80-64_K4.18.0_GCC8.2.1/x86_64-native-linuxapp-gcc/aa869313e13146b88b8c0b601e1a3d76/dpdk/mk/rte.subdir.mk:35: net] Error 2
make[3]: *** [/root/CENTOS80-64_K4.18.0_GCC8.2.1/x86_64-native-linuxapp-gcc/aa869313e13146b88b8c0b601e1a3d76/dpdk/mk/rte.sdkbuild.mk:46: drivers] Error 2
make[2]: *** [/root/CENTOS80-64_K4.18.0_GCC8.2.1/x86_64-native-linuxapp-gcc/aa869313e13146b88b8c0b601e1a3d76/dpdk/mk/rte.sdkroot.mk:99: all] Error 2
make[1]: *** [/root/CENTOS80-64_K4.18.0_GCC8.2.1/x86_64-native-linuxapp-gcc/aa869313e13146b88b8c0b601e1a3d76/dpdk/mk/rte.sdkinstall.mk:61: pre_install] Error 2
make: *** [/root/CENTOS80-64_K4.18.0_GCC8.2.1/x86_64-native-linuxapp-gcc/aa869313e13146b88b8c0b601e1a3d76/dpdk/mk/rte.sdkroot.mk:77: install] Error 2


*Make Build Failed #10:
OS: CENTOS77-64
Target: x86_64-native-linuxapp-clang
                                ^     ~~~~~~~~~~~~~~~~~~~~~~~~~~~~~~~~
/root/CENTOS77-64_K3.10.0_Clang3.4.2/x86_64-native-linuxapp-clang/aa869313e13146b88b8c0b601e1a3d76/dpdk/drivers/net/i40e/i40e_fdir.c:1134:9: note: forward declaration of 'struct rte_flow_item_l2tpv3oip'
        struct rte_flow_item_l2tpv3oip *l2tpv3oip;
               ^
3 errors generated.
make[6]: *** [i40e_fdir.o] Error 1
make[5]: *** [i40e] Error 2
make[5]: *** Waiting for unfinished jobs....
  CC bnxt_rxr.o
  PMDINFO sfc_ethdev.o.pmd.c
  CC bnxt_stats.o
  CC sfc_ethdev.o.pmd.o
--
  INSTALL-LIB librte_pmd_qede.a
  CC medford_nic.o
  CC medford2_nic.o
  AR librte_pmd_sfc_efx.a
  INSTALL-LIB librte_pmd_sfc_efx.a
make[4]: *** [net] Error 2
make[3]: *** [drivers] Error 2
make[2]: *** [all] Error 2
make[1]: *** [pre_install] Error 2
make: *** [install] Error 2


*Make Build Failed #11:
OS: CENTOS77-64
Target: x86_64-native-linuxapp-icc
/root/CENTOS77-64_K3.10.0_ICC19.0.0/x86_64-native-linuxapp-icc/aa869313e13146b88b8c0b601e1a3d76/dpdk/drivers/net/i40e/i40e_fdir.c(1317): error: incomplete type is not allowed
  				sizeof(struct rte_flow_item_l2tpv3oip);
  				       ^

compilation aborted for /root/CENTOS77-64_K3.10.0_ICC19.0.0/x86_64-native-linuxapp-icc/aa869313e13146b88b8c0b601e1a3d76/dpdk/drivers/net/i40e/i40e_fdir.c (code 2)
make[6]: *** [i40e_fdir.o] Error 2
make[6]: *** Waiting for unfinished jobs....
  CC bnxt_flow.o
  CC ixgbe_ethdev.o
== Build drivers/net/qede
  CC nfp_nffw.o
--
  CC i40e_ethdev_vf.o.pmd.o
  CC nfp_hwinfo.o
  CC octeontx_pkovf.o
  CC bnxt_hwrm.o
  LD i40e_ethdev_vf.o
make[5]: *** [i40e] Error 2
make[5]: *** Waiting for unfinished jobs....
  CC nfp_rtsym.o
  PMDINFO octeontx_pkovf.o.pmd.c
  CC octeontx_pkovf.o.pmd.o
  CC octeontx_pkivf.o
--
  LD qede_ethdev.o
  AR librte_pmd_qede.a
  INSTALL-LIB librte_pmd_qede.a
  AR librte_pmd_octeontx2.a
  INSTALL-LIB librte_pmd_octeontx2.a
make[4]: *** [net] Error 2
make[3]: *** [drivers] Error 2
make[2]: *** [all] Error 2
make[1]: *** [pre_install] Error 2
make: *** [install] Error 2


*Make Build Failed #12:
OS: FC31-64
Target: x86_64-native-linuxapp-gcc
      |              ^~
/root/FC31-64_K5.3.14_GCC9.2.1/x86_64-native-linuxapp-gcc/aa869313e13146b88b8c0b601e1a3d76/dpdk/drivers/net/i40e/i40e_fdir.c:1317:12: error: invalid application of ‘sizeof’ to incomplete type ‘struct rte_flow_item_l2tpv3oip’
 1317 |     sizeof(struct rte_flow_item_l2tpv3oip);
      |            ^~~~~~
  CC ice_dcb.o
make[6]: *** [/root/FC31-64_K5.3.14_GCC9.2.1/x86_64-native-linuxapp-gcc/aa869313e13146b88b8c0b601e1a3d76/dpdk/mk/internal/rte.compile-pre.mk:116: i40e_fdir.o] Error 1
make[6]: *** Waiting for unfinished jobs....
  CC ixgbe_flow.o
  CC otx2_tm.o
  CC hns3_mp.o
  CC otx2_rss.o
make[5]: *** [/root/FC31-64_K5.3.14_GCC9.2.1/x86_64-native-linuxapp-gcc/aa869313e13146b88b8c0b601e1a3d76/dpdk/mk/rte.subdir.mk:35: i40e] Error 2
make[5]: *** Waiting for unfinished jobs....
  CC ice_fdir.o
  AR librte_pmd_hns3.a
  INSTALL-LIB librte_pmd_hns3.a
  CC ice_ethdev.o
--
  INSTALL-LIB librte_pmd_octeontx2.a
  AR librte_pmd_bnxt.a
  INSTALL-LIB librte_pmd_bnxt.a
  AR librte_pmd_ice.a
  INSTALL-LIB librte_pmd_ice.a
make[4]: *** [/root/FC31-64_K5.3.14_GCC9.2.1/x86_64-native-linuxapp-gcc/aa869313e13146b88b8c0b601e1a3d76/dpdk/mk/rte.subdir.mk:35: net] Error 2
make[3]: *** [/root/FC31-64_K5.3.14_GCC9.2.1/x86_64-native-linuxapp-gcc/aa869313e13146b88b8c0b601e1a3d76/dpdk/mk/rte.sdkbuild.mk:46: drivers] Error 2
make[2]: *** [/root/FC31-64_K5.3.14_GCC9.2.1/x86_64-native-linuxapp-gcc/aa869313e13146b88b8c0b601e1a3d76/dpdk/mk/rte.sdkroot.mk:99: all] Error 2
make[1]: *** [/root/FC31-64_K5.3.14_GCC9.2.1/x86_64-native-linuxapp-gcc/aa869313e13146b88b8c0b601e1a3d76/dpdk/mk/rte.sdkinstall.mk:61: pre_install] Error 2
make: *** [/root/FC31-64_K5.3.14_GCC9.2.1/x86_64-native-linuxapp-gcc/aa869313e13146b88b8c0b601e1a3d76/dpdk/mk/rte.sdkroot.mk:77: install] Error 2


*Make Build Failed #13:
OS: SUSE15-64
Target: x86_64-native-linuxapp-gcc
/root/SUSE15-64_K4.12.14_GCC7.3.1/x86_64-native-linuxapp-gcc/aa869313e13146b88b8c0b601e1a3d76/dpdk/drivers/net/i40e/i40e_fdir.c:1317:12: error: invalid application of ‘sizeof’ to incomplete type ‘struct rte_flow_item_l2tpv3oip’
     sizeof(struct rte_flow_item_l2tpv3oip);
            ^~~~~~
/root/SUSE15-64_K4.12.14_GCC7.3.1/x86_64-native-linuxapp-gcc/aa869313e13146b88b8c0b601e1a3d76/dpdk/drivers/net/i40e/i40e_fdir.c: At top level:
cc1: warning: unrecognized command line option ‘-Wno-address-of-packed-member’
make[6]: *** [/root/SUSE15-64_K4.12.14_GCC7.3.1/x86_64-native-linuxapp-gcc/aa869313e13146b88b8c0b601e1a3d76/dpdk/mk/internal/rte.compile-pre.mk:116: i40e_fdir.o] Error 1
make[6]: *** Waiting for unfinished jobs....
== Build drivers/net/bnxt
  CC ixgbe_api.o
  CC nfp_rtsym.o
  CC ixgbe_vf.o
  PMDINFO em_ethdev.o.pmd.c
  CC em_ethdev.o.pmd.o
  LD em_ethdev.o
make[5]: *** [/root/SUSE15-64_K4.12.14_GCC7.3.1/x86_64-native-linuxapp-gcc/aa869313e13146b88b8c0b601e1a3d76/dpdk/mk/rte.subdir.mk:37: i40e] Error 2
make[5]: *** Waiting for unfinished jobs....
== Build drivers/crypto/dpaa_sec
  CC ice_rxtx_vec_sse.o
  PMDINFO ice_ethdev.o.pmd.c
  CC ice_ethdev.o.pmd.o
--
  INSTALL-LIB librte_pmd_ixgbe.a
  AR librte_pmd_nitrox.a
  INSTALL-LIB librte_pmd_nitrox.a
  AR librte_pmd_bnxt.a
  INSTALL-LIB librte_pmd_bnxt.a
make[4]: *** [/root/SUSE15-64_K4.12.14_GCC7.3.1/x86_64-native-linuxapp-gcc/aa869313e13146b88b8c0b601e1a3d76/dpdk/mk/rte.subdir.mk:35: net] Error 2
make[3]: *** [/root/SUSE15-64_K4.12.14_GCC7.3.1/x86_64-native-linuxapp-gcc/aa869313e13146b88b8c0b601e1a3d76/dpdk/mk/rte.sdkbuild.mk:46: drivers] Error 2
make[2]: *** [/root/SUSE15-64_K4.12.14_GCC7.3.1/x86_64-native-linuxapp-gcc/aa869313e13146b88b8c0b601e1a3d76/dpdk/mk/rte.sdkroot.mk:99: all] Error 2
make[1]: *** [/root/SUSE15-64_K4.12.14_GCC7.3.1/x86_64-native-linuxapp-gcc/aa869313e13146b88b8c0b601e1a3d76/dpdk/mk/rte.sdkinstall.mk:61: pre_install] Error 2
make: *** [/root/SUSE15-64_K4.12.14_GCC7.3.1/x86_64-native-linuxapp-gcc/aa869313e13146b88b8c0b601e1a3d76/dpdk/mk/rte.sdkroot.mk:77: install] Error 2


*Make Build Failed #14:
OS: RHEL80-64
Target: x86_64-native-linuxapp-gcc
/root/RHEL80-64_K3.10.0_GCC8.2.1/x86_64-native-linuxapp-gcc/aa869313e13146b88b8c0b601e1a3d76/dpdk/drivers/net/i40e/i40e_fdir.c:1317:12: error: invalid application of ‘sizeof’ to incomplete type ‘struct rte_flow_item_l2tpv3oip’
     sizeof(struct rte_flow_item_l2tpv3oip);
            ^~~~~~
/root/RHEL80-64_K3.10.0_GCC8.2.1/x86_64-native-linuxapp-gcc/aa869313e13146b88b8c0b601e1a3d76/dpdk/drivers/net/i40e/i40e_fdir.c: At top level:
cc1: warning: unrecognized command line option ‘-Wno-address-of-packed-member’
make[6]: *** [/root/RHEL80-64_K3.10.0_GCC8.2.1/x86_64-native-linuxapp-gcc/aa869313e13146b88b8c0b601e1a3d76/dpdk/mk/internal/rte.compile-pre.mk:116: i40e_fdir.o] Error 1
make[6]: *** Waiting for unfinished jobs....
== Build drivers/net/bnxt
make[5]: *** [/root/RHEL80-64_K3.10.0_GCC8.2.1/x86_64-native-linuxapp-gcc/aa869313e13146b88b8c0b601e1a3d76/dpdk/mk/rte.subdir.mk:37: i40e] Error 2
make[5]: *** Waiting for unfinished jobs....
  CC ice_sched.o
  AR librte_pmd_iavf.a
  INSTALL-LIB librte_pmd_iavf.a
  CC lio_ethdev.o
--
  LD nfp_net.o
  AR librte_pmd_nfp.a
  INSTALL-LIB librte_pmd_nfp.a
  AR librte_pmd_bnxt.a
  INSTALL-LIB librte_pmd_bnxt.a
make[4]: *** [/root/RHEL80-64_K3.10.0_GCC8.2.1/x86_64-native-linuxapp-gcc/aa869313e13146b88b8c0b601e1a3d76/dpdk/mk/rte.subdir.mk:35: net] Error 2
make[3]: *** [/root/RHEL80-64_K3.10.0_GCC8.2.1/x86_64-native-linuxapp-gcc/aa869313e13146b88b8c0b601e1a3d76/dpdk/mk/rte.sdkbuild.mk:46: drivers] Error 2
make[2]: *** [/root/RHEL80-64_K3.10.0_GCC8.2.1/x86_64-native-linuxapp-gcc/aa869313e13146b88b8c0b601e1a3d76/dpdk/mk/rte.sdkroot.mk:99: all] Error 2
make[1]: *** [/root/RHEL80-64_K3.10.0_GCC8.2.1/x86_64-native-linuxapp-gcc/aa869313e13146b88b8c0b601e1a3d76/dpdk/mk/rte.sdkinstall.mk:61: pre_install] Error 2
make: *** [/root/RHEL80-64_K3.10.0_GCC8.2.1/x86_64-native-linuxapp-gcc/aa869313e13146b88b8c0b601e1a3d76/dpdk/mk/rte.sdkroot.mk:77: install] Error 2


*Make Build Failed #15:
OS: RHEL77-64
Target: x86_64-native-linuxapp-gcc
/root/RHEL77-64_K3.10.0_GCC4.8.5/x86_64-native-linuxapp-gcc/aa869313e13146b88b8c0b601e1a3d76/dpdk/drivers/net/i40e/i40e_fdir.c:1317:12: error: invalid application of ‘sizeof’ to incomplete type ‘struct rte_flow_item_l2tpv3oip’
     sizeof(struct rte_flow_item_l2tpv3oip);
            ^
/root/RHEL77-64_K3.10.0_GCC4.8.5/x86_64-native-linuxapp-gcc/aa869313e13146b88b8c0b601e1a3d76/dpdk/drivers/net/i40e/i40e_fdir.c: At top level:
cc1: warning: unrecognized command line option "-Wno-address-of-packed-member" [enabled by default]
make[6]: *** [i40e_fdir.o] Error 1
make[5]: *** [i40e] Error 2
make[5]: *** Waiting for unfinished jobs....
  SYMLINK-FILE include/rte_pmd_bnxt.h
  CC ice_nvm.o
  CC bnxt_cpr.o
  CC memif_socket.o
--
  LD ixgbe_ethdev.o
  AR librte_pmd_ixgbe.a
  INSTALL-LIB librte_pmd_ixgbe.a
  AR librte_pmd_ice.a
  INSTALL-LIB librte_pmd_ice.a
make[4]: *** [net] Error 2
make[3]: *** [drivers] Error 2
make[2]: *** [all] Error 2
make[1]: *** [pre_install] Error 2
make: *** [install] Error 2


*Make Build Failed #16:
OS: FC31-64
Target: x86_64-native-linuxapp-clang
                                ^     ~~~~~~~~~~~~~~~~~~~~~~~~~~~~~~~~
/root/FC31-64_K5.3.14_Clang9.0.0/x86_64-native-linuxapp-clang/aa869313e13146b88b8c0b601e1a3d76/dpdk/drivers/net/i40e/i40e_fdir.c:1134:9: note: forward declaration of 'struct rte_flow_item_l2tpv3oip'
        struct rte_flow_item_l2tpv3oip *l2tpv3oip;
               ^
3 errors generated.
make[6]: *** [/root/FC31-64_K5.3.14_Clang9.0.0/x86_64-native-linuxapp-clang/aa869313e13146b88b8c0b601e1a3d76/dpdk/mk/internal/rte.compile-pre.mk:116: i40e_fdir.o] Error 1
make[6]: *** Waiting for unfinished jobs....
/root/FC31-64_K5.3.14_Clang9.0.0/x86_64-native-linuxapp-clang/aa869313e13146b88b8c0b601e1a3d76/dpdk/drivers/net/i40e/i40e_flow.c:3042:8: error: use of undeclared identifier 'RTE_FLOW_ITEM_TYPE_L2TPV3OIP'; did you mean 'RTE_FLOW_ITEM_TYPE_VOID'?
                case RTE_FLOW_ITEM_TYPE_L2TPV3OIP:
                     ^~~~~~~~~~~~~~~~~~~~~~~~~~~~
                     RTE_FLOW_ITEM_TYPE_VOID
--
        const struct rte_flow_item_l2tpv3oip *l2tpv3oip_spec, *l2tpv3oip_mask;
                     ^
  CC ice_rxtx_vec_sse.o
  CC ixgbe_phy.o
7 errors generated.
make[6]: *** [/root/FC31-64_K5.3.14_Clang9.0.0/x86_64-native-linuxapp-clang/aa869313e13146b88b8c0b601e1a3d76/dpdk/mk/internal/rte.compile-pre.mk:116: i40e_flow.o] Error 1
  CC ice_switch_filter.o
  CC ice_fdir_filter.o
  CC ixgbe_api.o
  CC ixgbe_vf.o
  CC ice_hash.o
--
  LD ice_ethdev.o
== Build drivers/net/memif
  CC ice_generic_flow.o
  CC ixgbe_hv_vf.o
== Build drivers/net/netvsc
make[5]: *** [/root/FC31-64_K5.3.14_Clang9.0.0/x86_64-native-linuxapp-clang/aa869313e13146b88b8c0b601e1a3d76/dpdk/mk/rte.subdir.mk:37: i40e] Error 2
make[5]: *** Waiting for unfinished jobs....
  CC ixgbe_dcb.o
  CC ixgbe_dcb_82599.o
  CC rte_eth_memif.o
  CC ixgbe_dcb_82598.o
--
  PMDINFO ixgbe_ethdev.o.pmd.c
  CC ixgbe_ethdev.o.pmd.o
  LD ixgbe_ethdev.o
  AR librte_pmd_ixgbe.a
  INSTALL-LIB librte_pmd_ixgbe.a
make[4]: *** [/root/FC31-64_K5.3.14_Clang9.0.0/x86_64-native-linuxapp-clang/aa869313e13146b88b8c0b601e1a3d76/dpdk/mk/rte.subdir.mk:35: net] Error 2
make[3]: *** [/root/FC31-64_K5.3.14_Clang9.0.0/x86_64-native-linuxapp-clang/aa869313e13146b88b8c0b601e1a3d76/dpdk/mk/rte.sdkbuild.mk:46: drivers] Error 2
make[2]: *** [/root/FC31-64_K5.3.14_Clang9.0.0/x86_64-native-linuxapp-clang/aa869313e13146b88b8c0b601e1a3d76/dpdk/mk/rte.sdkroot.mk:99: all] Error 2
make[1]: *** [/root/FC31-64_K5.3.14_Clang9.0.0/x86_64-native-linuxapp-clang/aa869313e13146b88b8c0b601e1a3d76/dpdk/mk/rte.sdkinstall.mk:61: pre_install] Error 2
make: *** [/root/FC31-64_K5.3.14_Clang9.0.0/x86_64-native-linuxapp-clang/aa869313e13146b88b8c0b601e1a3d76/dpdk/mk/rte.sdkroot.mk:77: install] Error 2


*Make Build Failed #17:
OS: SUSE15-64
Target: x86_64-native-linuxapp-clang
/root/SUSE15-64_K4.12.14_Clang5.0.1/x86_64-native-linuxapp-clang/aa869313e13146b88b8c0b601e1a3d76/dpdk/drivers/net/i40e/i40e_fdir.c:1134:9: note: forward declaration of 'struct rte_flow_item_l2tpv3oip'
        struct rte_flow_item_l2tpv3oip *l2tpv3oip;
               ^
3 errors generated.
  CC ice_switch_filter.o
make[6]: *** [/root/SUSE15-64_K4.12.14_Clang5.0.1/x86_64-native-linuxapp-clang/aa869313e13146b88b8c0b601e1a3d76/dpdk/mk/internal/rte.compile-pre.mk:114: i40e_fdir.o] Error 1
make[6]: *** Waiting for unfinished jobs....
  CC i40e_flow.o
  CC ixgbe_rxtx_vec_sse.o
  CC ixgbe_ipsec.o
  CC nfp_crc.o
--
                                          ~~~~~~~~~~~~~~^
/root/SUSE15-64_K4.12.14_Clang5.0.1/x86_64-native-linuxapp-clang/aa869313e13146b88b8c0b601e1a3d76/dpdk/drivers/net/i40e/i40e_flow.c:2490:15: note: forward declaration of 'struct rte_flow_item_l2tpv3oip'
        const struct rte_flow_item_l2tpv3oip *l2tpv3oip_spec, *l2tpv3oip_mask;
                     ^
7 errors generated.
make[6]: *** [/root/SUSE15-64_K4.12.14_Clang5.0.1/x86_64-native-linuxapp-clang/aa869313e13146b88b8c0b601e1a3d76/dpdk/mk/internal/rte.compile-pre.mk:116: i40e_flow.o] Error 1
  CC hn_vf.o
  SYMLINK-FILE include/rte_pmd_bnxt.h
  CC bnxt_cpr.o
  CC nfp_nffw.o
  CC nfp_hwinfo.o
--
  CC bnxt_ring.o
  CC nfp_nsp_eth.o
  CC nfp_net.o
  AR librte_pmd_ice.a
  INSTALL-LIB librte_pmd_ice.a
make[5]: *** [/root/SUSE15-64_K4.12.14_Clang5.0.1/x86_64-native-linuxapp-clang/aa869313e13146b88b8c0b601e1a3d76/dpdk/mk/rte.subdir.mk:37: i40e] Error 2
make[5]: *** Waiting for unfinished jobs....
== Build drivers/net/null
  CC bnxt_rxq.o
  CC bnxt_rxr.o
  CC bnxt_stats.o
--
  LD rte_eth_null.o
  AR librte_pmd_null.a
  INSTALL-LIB librte_pmd_null.a
  AR librte_pmd_bnxt.a
  INSTALL-LIB librte_pmd_bnxt.a
make[4]: *** [/root/SUSE15-64_K4.12.14_Clang5.0.1/x86_64-native-linuxapp-clang/aa869313e13146b88b8c0b601e1a3d76/dpdk/mk/rte.subdir.mk:35: net] Error 2
make[3]: *** [/root/SUSE15-64_K4.12.14_Clang5.0.1/x86_64-native-linuxapp-clang/aa869313e13146b88b8c0b601e1a3d76/dpdk/mk/rte.sdkbuild.mk:46: drivers] Error 2
make[2]: *** [/root/SUSE15-64_K4.12.14_Clang5.0.1/x86_64-native-linuxapp-clang/aa869313e13146b88b8c0b601e1a3d76/dpdk/mk/rte.sdkroot.mk:99: all] Error 2
make[1]: *** [/root/SUSE15-64_K4.12.14_Clang5.0.1/x86_64-native-linuxapp-clang/aa869313e13146b88b8c0b601e1a3d76/dpdk/mk/rte.sdkinstall.mk:61: pre_install] Error 2
make: *** [/root/SUSE15-64_K4.12.14_Clang5.0.1/x86_64-native-linuxapp-clang/aa869313e13146b88b8c0b601e1a3d76/dpdk/mk/rte.sdkroot.mk:77: install] Error 2


*Make Build Failed #18:
OS: UB1604-64
Target: x86_64-native-linuxapp-gcc
/root/UB1604-64_K4.4.0_GCC5.4.0/x86_64-native-linuxapp-gcc/aa869313e13146b88b8c0b601e1a3d76/dpdk/drivers/net/i40e/i40e_fdir.c:1317:12: error: invalid application of ‘sizeof’ to incomplete type ‘struct rte_flow_item_l2tpv3oip’
     sizeof(struct rte_flow_item_l2tpv3oip);
            ^
/root/UB1604-64_K4.4.0_GCC5.4.0/x86_64-native-linuxapp-gcc/aa869313e13146b88b8c0b601e1a3d76/dpdk/drivers/net/i40e/i40e_fdir.c: At top level:
cc1: warning: unrecognized command line option ‘-Wno-address-of-packed-member’
/root/UB1604-64_K4.4.0_GCC5.4.0/x86_64-native-linuxapp-gcc/aa869313e13146b88b8c0b601e1a3d76/dpdk/mk/internal/rte.compile-pre.mk:114: recipe for target 'i40e_fdir.o' failed
make[6]: *** [i40e_fdir.o] Error 1
make[6]: *** Waiting for unfinished jobs....
  CC ixgbe_dcb_82599.o
  CC ixgbe_dcb_82598.o
  CC ixgbe_mbx.o
  CC nfp_mutex.o
--
  PMDINFO i40e_ethdev_vf.o.pmd.c
  CC i40e_ethdev_vf.o.pmd.o
  CC ixgbe_ethdev.o
  LD i40e_ethdev_vf.o
  CC ixgbe_fdir.o
/root/UB1604-64_K4.4.0_GCC5.4.0/x86_64-native-linuxapp-gcc/aa869313e13146b88b8c0b601e1a3d76/dpdk/mk/rte.subdir.mk:35: recipe for target 'i40e' failed
make[5]: *** [i40e] Error 2
make[5]: *** Waiting for unfinished jobs....
  CC ixgbe_pf.o
  CC ice_rxtx.o
  CC nfp_mip.o
  CC nfp_nffw.o
--
  AR librte_pmd_nfp.a
  INSTALL-LIB librte_pmd_nfp.a
  AR librte_pmd_bnxt.a
  INSTALL-LIB librte_pmd_bnxt.a
make[6]: warning:  Clock skew detected.  Your build may be incomplete.
/root/UB1604-64_K4.4.0_GCC5.4.0/x86_64-native-linuxapp-gcc/aa869313e13146b88b8c0b601e1a3d76/dpdk/mk/rte.subdir.mk:35: recipe for target 'net' failed
make[4]: *** [net] Error 2
/root/UB1604-64_K4.4.0_GCC5.4.0/x86_64-native-linuxapp-gcc/aa869313e13146b88b8c0b601e1a3d76/dpdk/mk/rte.sdkbuild.mk:46: recipe for target 'drivers' failed
make[3]: *** [drivers] Error 2
/root/UB1604-64_K4.4.0_GCC5.4.0/x86_64-native-linuxapp-gcc/aa869313e13146b88b8c0b601e1a3d76/dpdk/mk/rte.sdkroot.mk:98: recipe for target 'all' failed
make[2]: *** [all] Error 2
/root/UB1604-64_K4.4.0_GCC5.4.0/x86_64-native-linuxapp-gcc/aa869313e13146b88b8c0b601e1a3d76/dpdk/mk/rte.sdkinstall.mk:60: recipe for target 'pre_install' failed
make[1]: *** [pre_install] Error 2
/root/UB1604-64_K4.4.0_GCC5.4.0/x86_64-native-linuxapp-gcc/aa869313e13146b88b8c0b601e1a3d76/dpdk/mk/rte.sdkroot.mk:77: recipe for target 'install' failed
make: *** [install] Error 2


*Make Build Failed #19:
OS: UB1804-64
Target: x86_64-native-linuxapp-gcc
/root/UB1804-64_K4.15.0_GCC7.3.0/x86_64-native-linuxapp-gcc/aa869313e13146b88b8c0b601e1a3d76/dpdk/drivers/net/i40e/i40e_fdir.c:1317:12: error: invalid application of ‘sizeof’ to incomplete type ‘struct rte_flow_item_l2tpv3oip’
     sizeof(struct rte_flow_item_l2tpv3oip);
            ^~~~~~
/root/UB1804-64_K4.15.0_GCC7.3.0/x86_64-native-linuxapp-gcc/aa869313e13146b88b8c0b601e1a3d76/dpdk/drivers/net/i40e/i40e_fdir.c: At top level:
cc1: warning: unrecognized command line option ‘-Wno-address-of-packed-member’
/root/UB1804-64_K4.15.0_GCC7.3.0/x86_64-native-linuxapp-gcc/aa869313e13146b88b8c0b601e1a3d76/dpdk/mk/internal/rte.compile-pre.mk:114: recipe for target 'i40e_fdir.o' failed
make[6]: *** [i40e_fdir.o] Error 1
make[6]: *** Waiting for unfinished jobs....
  CC bnxt_flow.o
  AR librte_pmd_lio.a
  INSTALL-LIB librte_pmd_lio.a
  CC bnxt_hwrm.o
--
  AR librte_pmd_ice.a
  INSTALL-LIB librte_pmd_ice.a
  CC nfp_resource.o
/root/UB1804-64_K4.15.0_GCC7.3.0/x86_64-native-linuxapp-gcc/aa869313e13146b88b8c0b601e1a3d76/dpdk/drivers/net/i40e/i40e_flow.c: At top level:
cc1: warning: unrecognized command line option ‘-Wno-address-of-packed-member’
/root/UB1804-64_K4.15.0_GCC7.3.0/x86_64-native-linuxapp-gcc/aa869313e13146b88b8c0b601e1a3d76/dpdk/mk/internal/rte.compile-pre.mk:114: recipe for target 'i40e_flow.o' failed
make[6]: *** [i40e_flow.o] Error 1
  CC nfp_crc.o
  CC nfp_mip.o
  CC bnxt_rxq.o
  CC ixgbe_vf.o
  CC ixgbe_hv_vf.o
--
  PMDINFO octeontx_pkivf.o.pmd.c
  CC octeontx_pkivf.o.pmd.o
  LD octeontx_pkivf.o
  CC ixgbe_pf.o
  CC nfp_rtsym.o
/root/UB1804-64_K4.15.0_GCC7.3.0/x86_64-native-linuxapp-gcc/aa869313e13146b88b8c0b601e1a3d76/dpdk/mk/rte.subdir.mk:35: recipe for target 'i40e' failed
make[5]: *** [i40e] Error 2
make[5]: *** Waiting for unfinished jobs....
  CC nfp_nsp.o
  CC octeontx_bgx.o
  CC octeontx_ethdev.o
  CC ixgbe_flow.o
--
  CC ixgbe_ethdev.o.pmd.o
  INSTALL-LIB librte_pmd_nfp.a
  LD ixgbe_ethdev.o
  AR librte_pmd_ixgbe.a
  INSTALL-LIB librte_pmd_ixgbe.a
/root/UB1804-64_K4.15.0_GCC7.3.0/x86_64-native-linuxapp-gcc/aa869313e13146b88b8c0b601e1a3d76/dpdk/mk/rte.subdir.mk:35: recipe for target 'net' failed
make[4]: *** [net] Error 2
/root/UB1804-64_K4.15.0_GCC7.3.0/x86_64-native-linuxapp-gcc/aa869313e13146b88b8c0b601e1a3d76/dpdk/mk/rte.sdkbuild.mk:46: recipe for target 'drivers' failed
make[3]: *** [drivers] Error 2
/root/UB1804-64_K4.15.0_GCC7.3.0/x86_64-native-linuxapp-gcc/aa869313e13146b88b8c0b601e1a3d76/dpdk/mk/rte.sdkroot.mk:98: recipe for target 'all' failed
make[2]: *** [all] Error 2
/root/UB1804-64_K4.15.0_GCC7.3.0/x86_64-native-linuxapp-gcc/aa869313e13146b88b8c0b601e1a3d76/dpdk/mk/rte.sdkinstall.mk:60: recipe for target 'pre_install' failed
make[1]: *** [pre_install] Error 2
/root/UB1804-64_K4.15.0_GCC7.3.0/x86_64-native-linuxapp-gcc/aa869313e13146b88b8c0b601e1a3d76/dpdk/mk/rte.sdkroot.mk:77: recipe for target 'install' failed
make: *** [install] Error 2


*Make Build Failed #20:
OS: FreeBSD1201-64
Target: x86_64-native-bsdapp-gcc+shared
/root/FreeBSD1201-64_K12.1_GCC7.3.0/x86_64-native-bsdapp-gcc+shared/aa869313e13146b88b8c0b601e1a3d76/dpdk/drivers/net/i40e/i40e_fdir.c:1317:12: error: invalid application of 'sizeof' to incomplete type 'struct rte_flow_item_l2tpv3oip'
 1317 |     sizeof(struct rte_flow_item_l2tpv3oip);
      |            ^~~~~~
  CC ice_dcb.o
  CC octeontx_rxtx.o
gmake[6]: *** [/root/FreeBSD1201-64_K12.1_GCC7.3.0/x86_64-native-bsdapp-gcc+shared/aa869313e13146b88b8c0b601e1a3d76/dpdk/mk/internal/rte.compile-pre.mk:116: i40e_fdir.o] Error 1
gmake[6]: *** Waiting for unfinished jobs....
  CC bnxt_hwrm.o
/root/FreeBSD1201-64_K12.1_GCC7.3.0/x86_64-native-bsdapp-gcc+shared/aa869313e13146b88b8c0b601e1a3d76/dpdk/drivers/net/i40e/i40e_flow.c:1621:2: error: 'RTE_FLOW_ITEM_TYPE_L2TPV3OIP' undeclared here (not in a function); did you mean 'RTE_FLOW_ITEM_TYPE_VOID'?
 1621 |  RTE_FLOW_ITEM_TYPE_L2TPV3OIP,
      |  ^~~~~~~~~~~~~~~~~~~~~~~~~~~~
--
 3064 |      = l2tpv3oip_spec->session_id;
      |                      ^~
/root/FreeBSD1201-64_K12.1_GCC7.3.0/x86_64-native-bsdapp-gcc+shared/aa869313e13146b88b8c0b601e1a3d76/dpdk/drivers/net/i40e/i40e_flow.c:3064:6: warning: assignment to 'uint32_t' {aka 'unsigned int'} from 'enum rte_flow_item_type *' makes integer from pointer without a cast [-Wint-conversion]
 3064 |      = l2tpv3oip_spec->session_id;
      |      ^
gmake[6]: *** [/root/FreeBSD1201-64_K12.1_GCC7.3.0/x86_64-native-bsdapp-gcc+shared/aa869313e13146b88b8c0b601e1a3d76/dpdk/mk/internal/rte.compile-pre.mk:116: i40e_flow.o] Error 1
gmake[5]: *** [/root/FreeBSD1201-64_K12.1_GCC7.3.0/x86_64-native-bsdapp-gcc+shared/aa869313e13146b88b8c0b601e1a3d76/dpdk/mk/rte.subdir.mk:37: i40e] Error 2
gmake[5]: *** Waiting for unfinished jobs....
  CC ixgbe_dcb.o
  LD librte_pmd_null.so.20.0.1
  INSTALL-LIB librte_pmd_null.so.20.0.1
  CC ice_fdir.o
--
  PMDINFO otx2_ethdev.o.pmd.c
  CC otx2_ethdev.o.pmd.o
  LD otx2_ethdev.o
  LD librte_pmd_octeontx2.so.20.0.1
  INSTALL-LIB librte_pmd_octeontx2.so.20.0.1
gmake[4]: *** [/root/FreeBSD1201-64_K12.1_GCC7.3.0/x86_64-native-bsdapp-gcc+shared/aa869313e13146b88b8c0b601e1a3d76/dpdk/mk/rte.subdir.mk:35: net] Error 2
gmake[3]: *** [/root/FreeBSD1201-64_K12.1_GCC7.3.0/x86_64-native-bsdapp-gcc+shared/aa869313e13146b88b8c0b601e1a3d76/dpdk/mk/rte.sdkbuild.mk:46: drivers] Error 2
gmake[2]: *** [/root/FreeBSD1201-64_K12.1_GCC7.3.0/x86_64-native-bsdapp-gcc+shared/aa869313e13146b88b8c0b601e1a3d76/dpdk/mk/rte.sdkroot.mk:99: all] Error 2
gmake[1]: *** [/root/FreeBSD1201-64_K12.1_GCC7.3.0/x86_64-native-bsdapp-gcc+shared/aa869313e13146b88b8c0b601e1a3d76/dpdk/mk/rte.sdkinstall.mk:61: pre_install] Error 2
gmake: *** [/root/FreeBSD1201-64_K12.1_GCC7.3.0/x86_64-native-bsdapp-gcc+shared/aa869313e13146b88b8c0b601e1a3d76/dpdk/mk/rte.sdkroot.mk:77: install] Error 2


*Make Build Failed #21:
OS: FreeBSD1201-64
Target: x86_64-native-bsdapp-gcc+debug
 1311 |     l2tpv3oip->session_id =
      |              ^~
/root/FreeBSD1201-64_K12.1_GCC7.3.0/x86_64-native-bsdapp-gcc+debug/aa869313e13146b88b8c0b601e1a3d76/dpdk/drivers/net/i40e/i40e_fdir.c:1317:12: error: invalid application of 'sizeof' to incomplete type 'struct rte_flow_item_l2tpv3oip'
 1317 |     sizeof(struct rte_flow_item_l2tpv3oip);
      |            ^~~~~~
gmake[6]: *** [/root/FreeBSD1201-64_K12.1_GCC7.3.0/x86_64-native-bsdapp-gcc+debug/aa869313e13146b88b8c0b601e1a3d76/dpdk/mk/internal/rte.compile-pre.mk:116: i40e_fdir.o] Error 1
gmake[6]: *** Waiting for unfinished jobs....
  PMDINFO rte_eth_null.o.pmd.c
== Build drivers/net/qede
  CC rte_eth_null.o.pmd.o
  LD rte_eth_null.o
  CC bnxt_filter.o
gmake[5]: *** [/root/FreeBSD1201-64_K12.1_GCC7.3.0/x86_64-native-bsdapp-gcc+debug/aa869313e13146b88b8c0b601e1a3d76/dpdk/mk/rte.subdir.mk:37: i40e] Error 2
gmake[5]: *** Waiting for unfinished jobs....
  CC ice_ethdev.o
  CC ixgbe_dcb_82598.o
  AR librte_pmd_null.a
  INSTALL-LIB librte_pmd_null.a
--
  PMDINFO qede_ethdev.o.pmd.c
  CC qede_ethdev.o.pmd.o
  LD qede_ethdev.o
  AR librte_pmd_qede.a
  INSTALL-LIB librte_pmd_qede.a
gmake[4]: *** [/root/FreeBSD1201-64_K12.1_GCC7.3.0/x86_64-native-bsdapp-gcc+debug/aa869313e13146b88b8c0b601e1a3d76/dpdk/mk/rte.subdir.mk:35: net] Error 2
gmake[3]: *** [/root/FreeBSD1201-64_K12.1_GCC7.3.0/x86_64-native-bsdapp-gcc+debug/aa869313e13146b88b8c0b601e1a3d76/dpdk/mk/rte.sdkbuild.mk:46: drivers] Error 2
gmake[2]: *** [/root/FreeBSD1201-64_K12.1_GCC7.3.0/x86_64-native-bsdapp-gcc+debug/aa869313e13146b88b8c0b601e1a3d76/dpdk/mk/rte.sdkroot.mk:99: all] Error 2
gmake[1]: *** [/root/FreeBSD1201-64_K12.1_GCC7.3.0/x86_64-native-bsdapp-gcc+debug/aa869313e13146b88b8c0b601e1a3d76/dpdk/mk/rte.sdkinstall.mk:61: pre_install] Error 2
gmake: *** [/root/FreeBSD1201-64_K12.1_GCC7.3.0/x86_64-native-bsdapp-gcc+debug/aa869313e13146b88b8c0b601e1a3d76/dpdk/mk/rte.sdkroot.mk:77: install] Error 2


*Make Build Failed #22:
OS: FreeBSD1201-64
Target: x86_64-native-bsdapp-clang
                                ^     ~~~~~~~~~~~~~~~~~~~~~~~~~~~~~~~~
/root/FreeBSD1201-64_K12.1_Clang8.0.1/x86_64-native-bsdapp-clang/aa869313e13146b88b8c0b601e1a3d76/dpdk/drivers/net/i40e/i40e_fdir.c:1134:9: note: forward declaration of 'struct rte_flow_item_l2tpv3oip'
        struct rte_flow_item_l2tpv3oip *l2tpv3oip;
               ^
3 errors generated.
gmake[6]: *** [/root/FreeBSD1201-64_K12.1_Clang8.0.1/x86_64-native-bsdapp-clang/aa869313e13146b88b8c0b601e1a3d76/dpdk/mk/internal/rte.compile-pre.mk:116: i40e_fdir.o] Error 1
gmake[6]: *** Waiting for unfinished jobs....
  CC bnxt_vnic.o
  CC otx2_mac.o
  CC ecore_hw.o
/root/FreeBSD1201-64_K12.1_Clang8.0.1/x86_64-native-bsdapp-clang/aa869313e13146b88b8c0b601e1a3d76/dpdk/drivers/net/i40e/i40e_flow.c:1621:2: error: use of undeclared identifier 'RTE_FLOW_ITEM_TYPE_L2TPV3OIP'; did you mean 'RTE_FLOW_ITEM_TYPE_VOID'?
--
                                          ~~~~~~~~~~~~~~^
/root/FreeBSD1201-64_K12.1_Clang8.0.1/x86_64-native-bsdapp-clang/aa869313e13146b88b8c0b601e1a3d76/dpdk/drivers/net/i40e/i40e_flow.c:2490:15: note: forward declaration of 'struct rte_flow_item_l2tpv3oip'
        const struct rte_flow_item_l2tpv3oip *l2tpv3oip_spec, *l2tpv3oip_mask;
                     ^
7 errors generated.
gmake[6]: *** [/root/FreeBSD1201-64_K12.1_Clang8.0.1/x86_64-native-bsdapp-clang/aa869313e13146b88b8c0b601e1a3d76/dpdk/mk/internal/rte.compile-pre.mk:116: i40e_flow.o] Error 1
gmake[5]: *** [/root/FreeBSD1201-64_K12.1_Clang8.0.1/x86_64-native-bsdapp-clang/aa869313e13146b88b8c0b601e1a3d76/dpdk/mk/rte.subdir.mk:37: i40e] Error 2
gmake[5]: *** Waiting for unfinished jobs....
  CC ixgbe_rxtx_vec_sse.o
  LD rte_eth_ring.o
  CC bnxt_irq.o
  AR librte_pmd_ring.a
--
  PMDINFO qede_ethdev.o.pmd.c
  CC qede_ethdev.o.pmd.o
  LD qede_ethdev.o
  AR librte_pmd_qede.a
  INSTALL-LIB librte_pmd_qede.a
gmake[4]: *** [/root/FreeBSD1201-64_K12.1_Clang8.0.1/x86_64-native-bsdapp-clang/aa869313e13146b88b8c0b601e1a3d76/dpdk/mk/rte.subdir.mk:35: net] Error 2
gmake[3]: *** [/root/FreeBSD1201-64_K12.1_Clang8.0.1/x86_64-native-bsdapp-clang/aa869313e13146b88b8c0b601e1a3d76/dpdk/mk/rte.sdkbuild.mk:46: drivers] Error 2
gmake[2]: *** [/root/FreeBSD1201-64_K12.1_Clang8.0.1/x86_64-native-bsdapp-clang/aa869313e13146b88b8c0b601e1a3d76/dpdk/mk/rte.sdkroot.mk:99: all] Error 2
gmake[1]: *** [/root/FreeBSD1201-64_K12.1_Clang8.0.1/x86_64-native-bsdapp-clang/aa869313e13146b88b8c0b601e1a3d76/dpdk/mk/rte.sdkinstall.mk:61: pre_install] Error 2
gmake: *** [/root/FreeBSD1201-64_K12.1_Clang8.0.1/x86_64-native-bsdapp-clang/aa869313e13146b88b8c0b601e1a3d76/dpdk/mk/rte.sdkroot.mk:77: install] Error 2


*Make Build Failed #23:
OS: FreeBSD1201-64
Target: x86_64-native-bsdapp-gcc
 1317 |     sizeof(struct rte_flow_item_l2tpv3oip);
      |            ^~~~~~
  AR librte_pmd_iavf.a
  CC bnxt_rxq.o
  INSTALL-LIB librte_pmd_iavf.a
gmake[6]: *** [/root/FreeBSD1201-64_K12.1_GCC9.2.0/x86_64-native-bsdapp-gcc/aa869313e13146b88b8c0b601e1a3d76/dpdk/mk/internal/rte.compile-pre.mk:114: i40e_fdir.o] Error 1
gmake[6]: *** Waiting for unfinished jobs....
  CC i40e_flow.o
== Build drivers/net/qede
  CC ice_flex_pipe.o
  CC ixgbe_hv_vf.o
--
 3064 |      = l2tpv3oip_spec->session_id;
      |                      ^~
/root/FreeBSD1201-64_K12.1_GCC9.2.0/x86_64-native-bsdapp-gcc/aa869313e13146b88b8c0b601e1a3d76/dpdk/drivers/net/i40e/i40e_flow.c:3064:6: warning: assignment to 'uint32_t' {aka 'unsigned int'} from 'enum rte_flow_item_type *' makes integer from pointer without a cast [-Wint-conversion]
 3064 |      = l2tpv3oip_spec->session_id;
      |      ^
gmake[6]: *** [/root/FreeBSD1201-64_K12.1_GCC9.2.0/x86_64-native-bsdapp-gcc/aa869313e13146b88b8c0b601e1a3d76/dpdk/mk/internal/rte.compile-pre.mk:114: i40e_flow.o] Error 1
gmake[5]: *** [/root/FreeBSD1201-64_K12.1_GCC9.2.0/x86_64-native-bsdapp-gcc/aa869313e13146b88b8c0b601e1a3d76/dpdk/mk/rte.subdir.mk:37: i40e] Error 2
gmake[5]: *** Waiting for unfinished jobs....
  CC ice_flow.o
  CC ixgbe_dcb.o
  CC otx2_rx.o
  CC ixgbe_dcb_82599.o
--
  LD qede_ethdev.o
  AR librte_pmd_octeontx2.a
  INSTALL-LIB librte_pmd_octeontx2.a
  AR librte_pmd_qede.a
  INSTALL-LIB librte_pmd_qede.a
gmake[4]: *** [/root/FreeBSD1201-64_K12.1_GCC9.2.0/x86_64-native-bsdapp-gcc/aa869313e13146b88b8c0b601e1a3d76/dpdk/mk/rte.subdir.mk:35: net] Error 2
gmake[3]: *** [/root/FreeBSD1201-64_K12.1_GCC9.2.0/x86_64-native-bsdapp-gcc/aa869313e13146b88b8c0b601e1a3d76/dpdk/mk/rte.sdkbuild.mk:46: drivers] Error 2
gmake[2]: *** [/root/FreeBSD1201-64_K12.1_GCC9.2.0/x86_64-native-bsdapp-gcc/aa869313e13146b88b8c0b601e1a3d76/dpdk/mk/rte.sdkroot.mk:99: all] Error 2
gmake[1]: *** [/root/FreeBSD1201-64_K12.1_GCC9.2.0/x86_64-native-bsdapp-gcc/aa869313e13146b88b8c0b601e1a3d76/dpdk/mk/rte.sdkinstall.mk:61: pre_install] Error 2
gmake: *** [/root/FreeBSD1201-64_K12.1_GCC9.2.0/x86_64-native-bsdapp-gcc/aa869313e13146b88b8c0b601e1a3d76/dpdk/mk/rte.sdkroot.mk:77: install] Error 2

*Meson Build Failed #1:
OS: UB1604-32
Target:./build-gcc-static
FAILED: drivers/a715181@@tmp_rte_pmd_i40e at sta/net_i40e_i40e_fdir.c.o 
gcc -Idrivers/a715181@@tmp_rte_pmd_i40e at sta -Idrivers -I../drivers -Idrivers/net/i40e -I../drivers/net/i40e -Idrivers/net/i40e/base -I../drivers/net/i40e/base -Ilib/librte_ethdev -I../lib/librte_ethdev -I. -I../ -Iconfig -I../config -Ilib/librte_eal/common/include -I../lib/librte_eal/common/include -I../lib/librte_eal/linux/eal/include -Ilib/librte_eal/common -I../lib/librte_eal/common -Ilib/librte_eal/common/include/arch/x86 -I../lib/librte_eal/common/include/arch/x86 -Ilib/librte_eal -I../lib/librte_eal -Ilib/librte_kvargs -I../lib/librte_kvargs -Ilib/librte_net -I../lib/librte_net -Ilib/librte_mbuf -I../lib/librte_mbuf -Ilib/librte_mempool -I../lib/librte_mempool -Ilib/librte_ring -I../lib/librte_ring -Ilib/librte_meter -I../lib/librte_meter -Idrivers/bus/pci -I../drivers/bus/pci -I../drivers/bus/pci/linux -Ilib/librte_pci -I../lib/librte_pci -Idrivers/bus/vdev -I../drivers/bus/vdev -Ilib/librte_hash -I../lib/librte_hash -fdiagnostics-color=always -pipe -D_FILE_OFFSET_BITS=64 -Wall -Winvalid-pch -Werror -O3 -include rte_config.h -Wextra -Wcast-qual -Wdeprecated -Wformat-nonliteral -Wformat-security -Wmissing-declarations -Wmissing-prototypes -Wnested-externs -Wold-style-definition -Wpointer-arith -Wsign-compare -Wstrict-prototypes -Wundef -Wwrite-strings -Wno-missing-field-initializers -Wno-pointer-to-int-cast -D_GNU_SOURCE -fPIC -march=native -DPF_DRIVER -DVF_DRIVER -DINTEGRATED_VF -DX722_A0_SUPPORT -DALLOW_EXPERIMENTAL_API -DCC_AVX2_SUPPORT -MD -MQ 'drivers/a715181@@tmp_rte_pmd_i40e at sta/net_i40e_i40e_fdir.c.o' -MF 'drivers/a715181@@tmp_rte_pmd_i40e at sta/net_i40e_i40e_fdir.c.o.d' -o 'drivers/a715181@@tmp_rte_pmd_i40e at sta/net_i40e_i40e_fdir.c.o' -c ../drivers/net/i40e/i40e_fdir.c
../drivers/net/i40e/i40e_fdir.c: In function ‘i40e_flow_fdir_construct_pkt’:
../drivers/net/i40e/i40e_fdir.c:1311:14: error: dereferencing pointer to incomplete type ‘struct rte_flow_item_l2tpv3oip’
     l2tpv3oip->session_id =
              ^
../drivers/net/i40e/i40e_fdir.c:1317:12: error: invalid application of ‘sizeof’ to incomplete type ‘struct rte_flow_item_l2tpv3oip’
     sizeof(struct rte_flow_item_l2tpv3oip);
            ^
[915/1949] Compiling C object 'drivers/a715181@@tmp_rte_pmd_i40e at sta/net_i40e_i40e_pf.c.o'.
[916/1949] Compiling C object 'drivers/a715181@@tmp_rte_pmd_i40e at sta/net_i40e_i40e_ethdev_vf.c.o'.
[917/1949] Compiling C object 'drivers/a715181@@tmp_rte_pmd_i40e at sta/net_i40e_i40e_flow.c.o'.
FAILED: drivers/a715181@@tmp_rte_pmd_i40e at sta/net_i40e_i40e_flow.c.o 
gcc -Idrivers/a715181@@tmp_rte_pmd_i40e at sta -Idrivers -I../drivers -Idrivers/net/i40e -I../drivers/net/i40e -Idrivers/net/i40e/base -I../drivers/net/i40e/base -Ilib/librte_ethdev -I../lib/librte_ethdev -I. -I../ -Iconfig -I../config -Ilib/librte_eal/common/include -I../lib/librte_eal/common/include -I../lib/librte_eal/linux/eal/include -Ilib/librte_eal/common -I../lib/librte_eal/common -Ilib/librte_eal/common/include/arch/x86 -I../lib/librte_eal/common/include/arch/x86 -Ilib/librte_eal -I../lib/librte_eal -Ilib/librte_kvargs -I../lib/librte_kvargs -Ilib/librte_net -I../lib/librte_net -Ilib/librte_mbuf -I../lib/librte_mbuf -Ilib/librte_mempool -I../lib/librte_mempool -Ilib/librte_ring -I../lib/librte_ring -Ilib/librte_meter -I../lib/librte_meter -Idrivers/bus/pci -I../drivers/bus/pci -I../drivers/bus/pci/linux -Ilib/librte_pci -I../lib/librte_pci -Idrivers/bus/vdev -I../drivers/bus/vdev -Ilib/librte_hash -I../lib/librte_hash -fdiagnostics-color=always -pipe -D_FILE_OFFSET_BITS=64 -Wall -Winvalid-pch -Werror -O3 -include rte_config.h -Wextra -Wcast-qual -Wdeprecated -Wformat-nonliteral -Wformat-security -Wmissing-declarations -Wmissing-prototypes -Wnested-externs -Wold-style-definition -Wpointer-arith -Wsign-compare -Wstrict-prototypes -Wundef -Wwrite-strings -Wno-missing-field-initializers -Wno-pointer-to-int-cast -D_GNU_SOURCE -fPIC -march=native -DPF_DRIVER -DVF_DRIVER -DINTEGRATED_VF -DX722_A0_SUPPORT -DALLOW_EXPERIMENTAL_API -DCC_AVX2_SUPPORT -MD -MQ 'drivers/a715181@@tmp_rte_pmd_i40e at sta/net_i40e_i40e_flow.c.o' -MF 'drivers/a715181@@tmp_rte_pmd_i40e at sta/net_i40e_i40e_flow.c.o.d' -o 'drivers/a715181@@tmp_rte_pmd_i40e at sta/net_i40e_i40e_flow.c.o' -c ../drivers/net/i40e/i40e_flow.c
../drivers/net/i40e/i40e_flow.c:1621:2: error: ‘RTE_FLOW_ITEM_TYPE_L2TPV3OIP’ undeclared here (not in a function)
  RTE_FLOW_ITEM_TYPE_L2TPV3OIP,
  ^
../drivers/net/i40e/i40e_flow.c:1628:2: error: initializer element is not constant
  RTE_FLOW_ITEM_TYPE_L2TPV3OIP,
  ^
../drivers/net/i40e/i40e_flow.c:1628:2: note: (near initialization for ‘pattern_fdir_ipv6_l2tpv3oip[2]’)
../drivers/net/i40e/i40e_flow.c: In function ‘i40e_flow_parse_fdir_pattern’:
../drivers/net/i40e/i40e_flow.c:3049:22: error: dereferencing pointer to incomplete type ‘const struct rte_flow_item_l2tpv3oip’
    if (l2tpv3oip_mask->session_id != UINT32_MAX) {
                      ^
../drivers/net/i40e/i40e_flow.c:3049:22: error: request for member ‘session_id’ in something not a structure or union
../drivers/net/i40e/i40e_flow.c:3049:35: error: comparison between pointer and integer [-Werror]
    if (l2tpv3oip_mask->session_id != UINT32_MAX) {
                                   ^
../drivers/net/i40e/i40e_flow.c:3059:22: error: request for member ‘session_id’ in something not a structure or union
      = l2tpv3oip_spec->session_id;
                      ^
../drivers/net/i40e/i40e_flow.c:3059:6: error: assignment makes integer from pointer without a cast [-Werror=int-conversion]
      = l2tpv3oip_spec->session_id;
      ^
../drivers/net/i40e/i40e_flow.c:3064:22: error: request for member ‘session_id’ in something not a structure or union
      = l2tpv3oip_spec->session_id;
                      ^
../drivers/net/i40e/i40e_flow.c:3064:6: error: assignment makes integer from pointer without a cast [-Werror=int-conversion]
      = l2tpv3oip_spec->session_id;
      ^
cc1: all warnings being treated as errors
[918/1949] Compiling C object 'drivers/a715181@@tmp_rte_pmd_i40e at sta/net_i40e_i40e_rxtx.c.o'.
[919/1949] Compiling C object 'drivers/a715181@@tmp_rte_pmd_i40e at sta/net_i40e_i40e_ethdev.c.o'.
ninja: build stopped: subcommand failed




*Meson Build Failed #2:
OS: SUSE15-64
Target:./build-gcc-static
FAILED: drivers/a715181@@tmp_rte_pmd_i40e at sta/net_i40e_i40e_fdir.c.o 
gcc -Idrivers/a715181@@tmp_rte_pmd_i40e at sta -Idrivers -I../drivers -Idrivers/net/i40e -I../drivers/net/i40e -Idrivers/net/i40e/base -I../drivers/net/i40e/base -Ilib/librte_ethdev -I../lib/librte_ethdev -I. -I../ -Iconfig -I../config -Ilib/librte_eal/common/include -I../lib/librte_eal/common/include -I../lib/librte_eal/linux/eal/include -Ilib/librte_eal/common -I../lib/librte_eal/common -Ilib/librte_eal/common/include/arch/x86 -I../lib/librte_eal/common/include/arch/x86 -Ilib/librte_eal -I../lib/librte_eal -Ilib/librte_kvargs -I../lib/librte_kvargs -Ilib/librte_net -I../lib/librte_net -Ilib/librte_mbuf -I../lib/librte_mbuf -Ilib/librte_mempool -I../lib/librte_mempool -Ilib/librte_ring -I../lib/librte_ring -Ilib/librte_meter -I../lib/librte_meter -Idrivers/bus/pci -I../drivers/bus/pci -I../drivers/bus/pci/linux -Ilib/librte_pci -I../lib/librte_pci -Idrivers/bus/vdev -I../drivers/bus/vdev -Ilib/librte_hash -I../lib/librte_hash -fdiagnostics-color=always -pipe -D_FILE_OFFSET_BITS=64 -Wall -Winvalid-pch -Werror -O3 -include rte_config.h -Wextra -Wcast-qual -Wdeprecated -Wformat-nonliteral -Wformat-security -Wmissing-declarations -Wmissing-prototypes -Wnested-externs -Wold-style-definition -Wpointer-arith -Wsign-compare -Wstrict-prototypes -Wundef -Wwrite-strings -Wno-missing-field-initializers -D_GNU_SOURCE -fPIC -march=native -Wno-format-truncation -DPF_DRIVER -DVF_DRIVER -DINTEGRATED_VF -DX722_A0_SUPPORT -DALLOW_EXPERIMENTAL_API -DCC_AVX2_SUPPORT -MD -MQ 'drivers/a715181@@tmp_rte_pmd_i40e at sta/net_i40e_i40e_fdir.c.o' -MF 'drivers/a715181@@tmp_rte_pmd_i40e at sta/net_i40e_i40e_fdir.c.o.d' -o 'drivers/a715181@@tmp_rte_pmd_i40e at sta/net_i40e_i40e_fdir.c.o' -c ../drivers/net/i40e/i40e_fdir.c
../drivers/net/i40e/i40e_fdir.c: In function ‘i40e_flow_fdir_construct_pkt’:
../drivers/net/i40e/i40e_fdir.c:1311:14: error: dereferencing pointer to incomplete type ‘struct rte_flow_item_l2tpv3oip’
     l2tpv3oip->session_id =
              ^~
../drivers/net/i40e/i40e_fdir.c:1317:12: error: invalid application of ‘sizeof’ to incomplete type ‘struct rte_flow_item_l2tpv3oip’
     sizeof(struct rte_flow_item_l2tpv3oip);
            ^~~~~~
[930/2185] Compiling C object 'drivers/a715181@@tmp_rte_pmd_i40e at sta/net_i40e_i40e_pf.c.o'.
[931/2185] Linking target drivers/librte_pmd_failsafe.so.20.0.1.
[932/2185] Compiling C object 'drivers/a715181@@tmp_rte_pmd_i40e at sta/net_i40e_i40e_flow.c.o'.
FAILED: drivers/a715181@@tmp_rte_pmd_i40e at sta/net_i40e_i40e_flow.c.o 
gcc -Idrivers/a715181@@tmp_rte_pmd_i40e at sta -Idrivers -I../drivers -Idrivers/net/i40e -I../drivers/net/i40e -Idrivers/net/i40e/base -I../drivers/net/i40e/base -Ilib/librte_ethdev -I../lib/librte_ethdev -I. -I../ -Iconfig -I../config -Ilib/librte_eal/common/include -I../lib/librte_eal/common/include -I../lib/librte_eal/linux/eal/include -Ilib/librte_eal/common -I../lib/librte_eal/common -Ilib/librte_eal/common/include/arch/x86 -I../lib/librte_eal/common/include/arch/x86 -Ilib/librte_eal -I../lib/librte_eal -Ilib/librte_kvargs -I../lib/librte_kvargs -Ilib/librte_net -I../lib/librte_net -Ilib/librte_mbuf -I../lib/librte_mbuf -Ilib/librte_mempool -I../lib/librte_mempool -Ilib/librte_ring -I../lib/librte_ring -Ilib/librte_meter -I../lib/librte_meter -Idrivers/bus/pci -I../drivers/bus/pci -I../drivers/bus/pci/linux -Ilib/librte_pci -I../lib/librte_pci -Idrivers/bus/vdev -I../drivers/bus/vdev -Ilib/librte_hash -I../lib/librte_hash -fdiagnostics-color=always -pipe -D_FILE_OFFSET_BITS=64 -Wall -Winvalid-pch -Werror -O3 -include rte_config.h -Wextra -Wcast-qual -Wdeprecated -Wformat-nonliteral -Wformat-security -Wmissing-declarations -Wmissing-prototypes -Wnested-externs -Wold-style-definition -Wpointer-arith -Wsign-compare -Wstrict-prototypes -Wundef -Wwrite-strings -Wno-missing-field-initializers -D_GNU_SOURCE -fPIC -march=native -Wno-format-truncation -DPF_DRIVER -DVF_DRIVER -DINTEGRATED_VF -DX722_A0_SUPPORT -DALLOW_EXPERIMENTAL_API -DCC_AVX2_SUPPORT -MD -MQ 'drivers/a715181@@tmp_rte_pmd_i40e at sta/net_i40e_i40e_flow.c.o' -MF 'drivers/a715181@@tmp_rte_pmd_i40e at sta/net_i40e_i40e_flow.c.o.d' -o 'drivers/a715181@@tmp_rte_pmd_i40e at sta/net_i40e_i40e_flow.c.o' -c ../drivers/net/i40e/i40e_flow.c
../drivers/net/i40e/i40e_flow.c:1621:2: error: ‘RTE_FLOW_ITEM_TYPE_L2TPV3OIP’ undeclared here (not in a function); did you mean ‘RTE_FLOW_ITEM_TYPE_VOID’?
  RTE_FLOW_ITEM_TYPE_L2TPV3OIP,
  ^~~~~~~~~~~~~~~~~~~~~~~~~~~~
  RTE_FLOW_ITEM_TYPE_VOID
../drivers/net/i40e/i40e_flow.c:1628:2: error: incompatible types when initializing type ‘enum rte_flow_item_type’ using type ‘enum rte_flow_item_type *’
  RTE_FLOW_ITEM_TYPE_L2TPV3OIP,
  ^~~~~~~~~~~~~~~~~~~~~~~~~~~~
../drivers/net/i40e/i40e_flow.c: In function ‘i40e_flow_parse_fdir_pattern’:
../drivers/net/i40e/i40e_flow.c:3049:22: error: dereferencing pointer to incomplete type ‘const struct rte_flow_item_l2tpv3oip’
    if (l2tpv3oip_mask->session_id != UINT32_MAX) {
                      ^~
../drivers/net/i40e/i40e_flow.c:3049:22: error: request for member ‘session_id’ in something not a structure or union
../drivers/net/i40e/i40e_flow.c:3049:35: error: comparison between pointer and integer [-Werror]
    if (l2tpv3oip_mask->session_id != UINT32_MAX) {
                                   ^~
../drivers/net/i40e/i40e_flow.c:3059:22: error: request for member ‘session_id’ in something not a structure or union
      = l2tpv3oip_spec->session_id;
                      ^~
../drivers/net/i40e/i40e_flow.c:3059:6: error: assignment makes integer from pointer without a cast [-Werror=int-conversion]
      = l2tpv3oip_spec->session_id;
      ^
../drivers/net/i40e/i40e_flow.c:3064:22: error: request for member ‘session_id’ in something not a structure or union
      = l2tpv3oip_spec->session_id;
                      ^~
../drivers/net/i40e/i40e_flow.c:3064:6: error: assignment makes integer from pointer without a cast [-Werror=int-conversion]
      = l2tpv3oip_spec->session_id;
      ^
cc1: all warnings being treated as errors
[933/2185] Generating rte_pmd_fm10k.exp_chk with a meson_exe.py custom command.
[934/2185] Compiling C object 'drivers/a715181@@tmp_rte_pmd_i40e at sta/net_i40e_i40e_ethdev_vf.c.o'.
[935/2185] Compiling C object 'drivers/a715181@@tmp_rte_pmd_i40e at sta/net_i40e_i40e_rxtx.c.o'.
[936/2185] Compiling C object 'drivers/a715181@@tmp_rte_pmd_i40e at sta/net_i40e_i40e_ethdev.c.o'.
ninja: build stopped: subcommand failed




*Meson Build Failed #3:
OS: FC31-64
Target:./build-gcc-static
FAILED: drivers/a715181@@tmp_rte_pmd_i40e at sta/net_i40e_i40e_fdir.c.o 
gcc -Idrivers/a715181@@tmp_rte_pmd_i40e at sta -Idrivers -I../drivers -Idrivers/net/i40e -I../drivers/net/i40e -Idrivers/net/i40e/base -I../drivers/net/i40e/base -Ilib/librte_ethdev -I../lib/librte_ethdev -I. -I../ -Iconfig -I../config -Ilib/librte_eal/common/include -I../lib/librte_eal/common/include -I../lib/librte_eal/linux/eal/include -Ilib/librte_eal/common -I../lib/librte_eal/common -Ilib/librte_eal/common/include/arch/x86 -I../lib/librte_eal/common/include/arch/x86 -Ilib/librte_eal -I../lib/librte_eal -Ilib/librte_kvargs -I../lib/librte_kvargs -Ilib/librte_net -I../lib/librte_net -Ilib/librte_mbuf -I../lib/librte_mbuf -Ilib/librte_mempool -I../lib/librte_mempool -Ilib/librte_ring -I../lib/librte_ring -Ilib/librte_meter -I../lib/librte_meter -Idrivers/bus/pci -I../drivers/bus/pci -I../drivers/bus/pci/linux -Ilib/librte_pci -I../lib/librte_pci -Idrivers/bus/vdev -I../drivers/bus/vdev -Ilib/librte_hash -I../lib/librte_hash -fdiagnostics-color=always -pipe -D_FILE_OFFSET_BITS=64 -Wall -Winvalid-pch -Werror -O3 -include rte_config.h -Wextra -Wcast-qual -Wdeprecated -Wformat-nonliteral -Wformat-security -Wmissing-declarations -Wmissing-prototypes -Wnested-externs -Wold-style-definition -Wpointer-arith -Wsign-compare -Wstrict-prototypes -Wundef -Wwrite-strings -Wno-address-of-packed-member -Wno-packed-not-aligned -Wno-missing-field-initializers -D_GNU_SOURCE -fPIC -march=native -Wno-format-truncation -DPF_DRIVER -DVF_DRIVER -DINTEGRATED_VF -DX722_A0_SUPPORT -DALLOW_EXPERIMENTAL_API -DCC_AVX2_SUPPORT -MD -MQ 'drivers/a715181@@tmp_rte_pmd_i40e at sta/net_i40e_i40e_fdir.c.o' -MF 'drivers/a715181@@tmp_rte_pmd_i40e at sta/net_i40e_i40e_fdir.c.o.d' -o 'drivers/a715181@@tmp_rte_pmd_i40e at sta/net_i40e_i40e_fdir.c.o' -c ../drivers/net/i40e/i40e_fdir.c
../drivers/net/i40e/i40e_fdir.c: In function ‘i40e_flow_fdir_construct_pkt’:
../drivers/net/i40e/i40e_fdir.c:1311:14: error: dereferencing pointer to incomplete type ‘struct rte_flow_item_l2tpv3oip’
 1311 |     l2tpv3oip->session_id =
      |              ^~
../drivers/net/i40e/i40e_fdir.c:1317:12: error: invalid application of ‘sizeof’ to incomplete type ‘struct rte_flow_item_l2tpv3oip’
 1317 |     sizeof(struct rte_flow_item_l2tpv3oip);
      |            ^~~~~~
[934/2198] Generating rte_pmd_fm10k.exp_chk with a meson_exe.py custom command.
[935/2198] Compiling C object 'drivers/a715181@@tmp_rte_pmd_i40e at sta/net_i40e_i40e_flow.c.o'.
FAILED: drivers/a715181@@tmp_rte_pmd_i40e at sta/net_i40e_i40e_flow.c.o 
gcc -Idrivers/a715181@@tmp_rte_pmd_i40e at sta -Idrivers -I../drivers -Idrivers/net/i40e -I../drivers/net/i40e -Idrivers/net/i40e/base -I../drivers/net/i40e/base -Ilib/librte_ethdev -I../lib/librte_ethdev -I. -I../ -Iconfig -I../config -Ilib/librte_eal/common/include -I../lib/librte_eal/common/include -I../lib/librte_eal/linux/eal/include -Ilib/librte_eal/common -I../lib/librte_eal/common -Ilib/librte_eal/common/include/arch/x86 -I../lib/librte_eal/common/include/arch/x86 -Ilib/librte_eal -I../lib/librte_eal -Ilib/librte_kvargs -I../lib/librte_kvargs -Ilib/librte_net -I../lib/librte_net -Ilib/librte_mbuf -I../lib/librte_mbuf -Ilib/librte_mempool -I../lib/librte_mempool -Ilib/librte_ring -I../lib/librte_ring -Ilib/librte_meter -I../lib/librte_meter -Idrivers/bus/pci -I../drivers/bus/pci -I../drivers/bus/pci/linux -Ilib/librte_pci -I../lib/librte_pci -Idrivers/bus/vdev -I../drivers/bus/vdev -Ilib/librte_hash -I../lib/librte_hash -fdiagnostics-color=always -pipe -D_FILE_OFFSET_BITS=64 -Wall -Winvalid-pch -Werror -O3 -include rte_config.h -Wextra -Wcast-qual -Wdeprecated -Wformat-nonliteral -Wformat-security -Wmissing-declarations -Wmissing-prototypes -Wnested-externs -Wold-style-definition -Wpointer-arith -Wsign-compare -Wstrict-prototypes -Wundef -Wwrite-strings -Wno-address-of-packed-member -Wno-packed-not-aligned -Wno-missing-field-initializers -D_GNU_SOURCE -fPIC -march=native -Wno-format-truncation -DPF_DRIVER -DVF_DRIVER -DINTEGRATED_VF -DX722_A0_SUPPORT -DALLOW_EXPERIMENTAL_API -DCC_AVX2_SUPPORT -MD -MQ 'drivers/a715181@@tmp_rte_pmd_i40e at sta/net_i40e_i40e_flow.c.o' -MF 'drivers/a715181@@tmp_rte_pmd_i40e at sta/net_i40e_i40e_flow.c.o.d' -o 'drivers/a715181@@tmp_rte_pmd_i40e at sta/net_i40e_i40e_flow.c.o' -c ../drivers/net/i40e/i40e_flow.c
../drivers/net/i40e/i40e_flow.c:1621:2: error: ‘RTE_FLOW_ITEM_TYPE_L2TPV3OIP’ undeclared here (not in a function); did you mean ‘RTE_FLOW_ITEM_TYPE_VOID’?
 1621 |  RTE_FLOW_ITEM_TYPE_L2TPV3OIP,
      |  ^~~~~~~~~~~~~~~~~~~~~~~~~~~~
      |  RTE_FLOW_ITEM_TYPE_VOID
../drivers/net/i40e/i40e_flow.c:1628:2: error: incompatible types when initializing type ‘enum rte_flow_item_type’ using type ‘enum rte_flow_item_type *’
 1628 |  RTE_FLOW_ITEM_TYPE_L2TPV3OIP,
      |  ^~~~~~~~~~~~~~~~~~~~~~~~~~~~
../drivers/net/i40e/i40e_flow.c: In function ‘i40e_flow_parse_fdir_pattern’:
../drivers/net/i40e/i40e_flow.c:3049:22: error: dereferencing pointer to incomplete type ‘const struct rte_flow_item_l2tpv3oip’
 3049 |    if (l2tpv3oip_mask->session_id != UINT32_MAX) {
      |                      ^~
../drivers/net/i40e/i40e_flow.c:3049:22: error: request for member ‘session_id’ in something not a structure or union
../drivers/net/i40e/i40e_flow.c:3049:35: error: comparison between pointer and integer [-Werror]
 3049 |    if (l2tpv3oip_mask->session_id != UINT32_MAX) {
      |                                   ^~
../drivers/net/i40e/i40e_flow.c:3059:22: error: request for member ‘session_id’ in something not a structure or union
 3059 |      = l2tpv3oip_spec->session_id;
      |                      ^~
../drivers/net/i40e/i40e_flow.c:3059:6: error: assignment to ‘uint32_t’ {aka ‘unsigned int’} from ‘enum rte_flow_item_type *’ makes integer from pointer without a cast [-Werror=int-conversion]
 3059 |      = l2tpv3oip_spec->session_id;
      |      ^
../drivers/net/i40e/i40e_flow.c:3064:22: error: request for member ‘session_id’ in something not a structure or union
 3064 |      = l2tpv3oip_spec->session_id;
      |                      ^~
../drivers/net/i40e/i40e_flow.c:3064:6: error: assignment to ‘uint32_t’ {aka ‘unsigned int’} from ‘enum rte_flow_item_type *’ makes integer from pointer without a cast [-Werror=int-conversion]
 3064 |      = l2tpv3oip_spec->session_id;
      |      ^
cc1: all warnings being treated as errors
[936/2198] Compiling C object 'drivers/a715181@@tmp_rte_pmd_i40e at sta/net_i40e_i40e_tm.c.o'.
[937/2198] Compiling C object 'drivers/a715181@@tmp_rte_pmd_i40e at sta/net_i40e_i40e_ethdev_vf.c.o'.
[938/2198] Compiling C object 'drivers/a715181@@tmp_rte_pmd_i40e at sta/net_i40e_i40e_rxtx.c.o'.
[939/2198] Compiling C object 'drivers/a715181@@tmp_rte_pmd_i40e at sta/net_i40e_rte_pmd_i40e.c.o'.
[940/2198] Compiling C object 'drivers/a715181@@tmp_rte_pmd_i40e at sta/net_i40e_i40e_ethdev.c.o'.
ninja: build stopped: subcommand failed




*Meson Build Failed #4:
OS: CENTOS77-64
Target:./build-gcc-static
FAILED: drivers/a715181@@tmp_rte_pmd_i40e at sta/net_i40e_i40e_fdir.c.o 
gcc -Idrivers/a715181@@tmp_rte_pmd_i40e at sta -Idrivers -I../drivers -Idrivers/net/i40e -I../drivers/net/i40e -Idrivers/net/i40e/base -I../drivers/net/i40e/base -Ilib/librte_ethdev -I../lib/librte_ethdev -I. -I../ -Iconfig -I../config -Ilib/librte_eal/common/include -I../lib/librte_eal/common/include -I../lib/librte_eal/linux/eal/include -Ilib/librte_eal/common -I../lib/librte_eal/common -Ilib/librte_eal/common/include/arch/x86 -I../lib/librte_eal/common/include/arch/x86 -Ilib/librte_eal -I../lib/librte_eal -Ilib/librte_kvargs -I../lib/librte_kvargs -Ilib/librte_net -I../lib/librte_net -Ilib/librte_mbuf -I../lib/librte_mbuf -Ilib/librte_mempool -I../lib/librte_mempool -Ilib/librte_ring -I../lib/librte_ring -Ilib/librte_meter -I../lib/librte_meter -Idrivers/bus/pci -I../drivers/bus/pci -I../drivers/bus/pci/linux -Ilib/librte_pci -I../lib/librte_pci -Idrivers/bus/vdev -I../drivers/bus/vdev -Ilib/librte_hash -I../lib/librte_hash -pipe -D_FILE_OFFSET_BITS=64 -Wall -Winvalid-pch -Werror -O3 -include rte_config.h -Wextra -Wcast-qual -Wdeprecated -Wformat-nonliteral -Wformat-security -Wmissing-declarations -Wmissing-prototypes -Wnested-externs -Wold-style-definition -Wpointer-arith -Wsign-compare -Wstrict-prototypes -Wundef -Wwrite-strings -Wno-missing-field-initializers -D_GNU_SOURCE -fPIC -march=native -DPF_DRIVER -DVF_DRIVER -DINTEGRATED_VF -DX722_A0_SUPPORT -DALLOW_EXPERIMENTAL_API -DCC_AVX2_SUPPORT -MD -MQ 'drivers/a715181@@tmp_rte_pmd_i40e at sta/net_i40e_i40e_fdir.c.o' -MF 'drivers/a715181@@tmp_rte_pmd_i40e at sta/net_i40e_i40e_fdir.c.o.d' -o 'drivers/a715181@@tmp_rte_pmd_i40e at sta/net_i40e_i40e_fdir.c.o' -c ../drivers/net/i40e/i40e_fdir.c
../drivers/net/i40e/i40e_fdir.c: In function ‘i40e_flow_fdir_construct_pkt’:
../drivers/net/i40e/i40e_fdir.c:1311:14: error: dereferencing pointer to incomplete type
     l2tpv3oip->session_id =
              ^
../drivers/net/i40e/i40e_fdir.c:1314:14: error: dereferencing pointer to incomplete type
     l2tpv3oip->session_id =
              ^
../drivers/net/i40e/i40e_fdir.c:1317:12: error: invalid application of ‘sizeof’ to incomplete type ‘struct rte_flow_item_l2tpv3oip’
     sizeof(struct rte_flow_item_l2tpv3oip);
            ^
[941/2195] Linking target drivers/librte_pmd_fm10k.so.20.0.1.
[942/2195] Compiling C object 'drivers/a715181@@tmp_rte_pmd_i40e at sta/net_i40e_i40e_flow.c.o'.
FAILED: drivers/a715181@@tmp_rte_pmd_i40e at sta/net_i40e_i40e_flow.c.o 
gcc -Idrivers/a715181@@tmp_rte_pmd_i40e at sta -Idrivers -I../drivers -Idrivers/net/i40e -I../drivers/net/i40e -Idrivers/net/i40e/base -I../drivers/net/i40e/base -Ilib/librte_ethdev -I../lib/librte_ethdev -I. -I../ -Iconfig -I../config -Ilib/librte_eal/common/include -I../lib/librte_eal/common/include -I../lib/librte_eal/linux/eal/include -Ilib/librte_eal/common -I../lib/librte_eal/common -Ilib/librte_eal/common/include/arch/x86 -I../lib/librte_eal/common/include/arch/x86 -Ilib/librte_eal -I../lib/librte_eal -Ilib/librte_kvargs -I../lib/librte_kvargs -Ilib/librte_net -I../lib/librte_net -Ilib/librte_mbuf -I../lib/librte_mbuf -Ilib/librte_mempool -I../lib/librte_mempool -Ilib/librte_ring -I../lib/librte_ring -Ilib/librte_meter -I../lib/librte_meter -Idrivers/bus/pci -I../drivers/bus/pci -I../drivers/bus/pci/linux -Ilib/librte_pci -I../lib/librte_pci -Idrivers/bus/vdev -I../drivers/bus/vdev -Ilib/librte_hash -I../lib/librte_hash -pipe -D_FILE_OFFSET_BITS=64 -Wall -Winvalid-pch -Werror -O3 -include rte_config.h -Wextra -Wcast-qual -Wdeprecated -Wformat-nonliteral -Wformat-security -Wmissing-declarations -Wmissing-prototypes -Wnested-externs -Wold-style-definition -Wpointer-arith -Wsign-compare -Wstrict-prototypes -Wundef -Wwrite-strings -Wno-missing-field-initializers -D_GNU_SOURCE -fPIC -march=native -DPF_DRIVER -DVF_DRIVER -DINTEGRATED_VF -DX722_A0_SUPPORT -DALLOW_EXPERIMENTAL_API -DCC_AVX2_SUPPORT -MD -MQ 'drivers/a715181@@tmp_rte_pmd_i40e at sta/net_i40e_i40e_flow.c.o' -MF 'drivers/a715181@@tmp_rte_pmd_i40e at sta/net_i40e_i40e_flow.c.o.d' -o 'drivers/a715181@@tmp_rte_pmd_i40e at sta/net_i40e_i40e_flow.c.o' -c ../drivers/net/i40e/i40e_flow.c
../drivers/net/i40e/i40e_flow.c:1621:2: error: ‘RTE_FLOW_ITEM_TYPE_L2TPV3OIP’ undeclared here (not in a function)
  RTE_FLOW_ITEM_TYPE_L2TPV3OIP,
  ^
../drivers/net/i40e/i40e_flow.c:1628:2: error: initializer element is not constant
  RTE_FLOW_ITEM_TYPE_L2TPV3OIP,
  ^
../drivers/net/i40e/i40e_flow.c:1628:2: error: (near initialization for ‘pattern_fdir_ipv6_l2tpv3oip[2]’)
../drivers/net/i40e/i40e_flow.c: In function ‘i40e_flow_parse_fdir_pattern’:
../drivers/net/i40e/i40e_flow.c:3049:22: error: dereferencing pointer to incomplete type
    if (l2tpv3oip_mask->session_id != UINT32_MAX) {
                      ^
../drivers/net/i40e/i40e_flow.c:3049:22: error: request for member ‘session_id’ in something not a structure or union
../drivers/net/i40e/i40e_flow.c:3049:35: error: comparison between pointer and integer [-Werror]
    if (l2tpv3oip_mask->session_id != UINT32_MAX) {
                                   ^
../drivers/net/i40e/i40e_flow.c:3059:22: error: dereferencing pointer to incomplete type
      = l2tpv3oip_spec->session_id;
                      ^
../drivers/net/i40e/i40e_flow.c:3059:22: error: request for member ‘session_id’ in something not a structure or union
../drivers/net/i40e/i40e_flow.c:3059:6: error: assignment makes integer from pointer without a cast [-Werror]
      = l2tpv3oip_spec->session_id;
      ^
../drivers/net/i40e/i40e_flow.c:3064:22: error: dereferencing pointer to incomplete type
      = l2tpv3oip_spec->session_id;
                      ^
../drivers/net/i40e/i40e_flow.c:3064:22: error: request for member ‘session_id’ in something not a structure or union
../drivers/net/i40e/i40e_flow.c:3064:6: error: assignment makes integer from pointer without a cast [-Werror]
      = l2tpv3oip_spec->session_id;
      ^
cc1: all warnings being treated as errors
[943/2195] Compiling C object 'drivers/a715181@@tmp_rte_pmd_i40e at sta/net_i40e_i40e_ethdev_vf.c.o'.
[944/2195] Compiling C object 'drivers/a715181@@tmp_rte_pmd_i40e at sta/net_i40e_i40e_rxtx.c.o'.
[945/2195] Compiling C object 'drivers/a715181@@tmp_rte_pmd_i40e at sta/net_i40e_i40e_ethdev.c.o'.
ninja: build stopped: subcommand failed




*Meson Build Failed #5:
OS: UB1804-64
Target:./build-gcc-static
FAILED: drivers/a715181@@tmp_rte_pmd_i40e at sta/net_i40e_i40e_fdir.c.o 
gcc -Idrivers/a715181@@tmp_rte_pmd_i40e at sta -Idrivers -I../drivers -Idrivers/net/i40e -I../drivers/net/i40e -Idrivers/net/i40e/base -I../drivers/net/i40e/base -Ilib/librte_ethdev -I../lib/librte_ethdev -I. -I../ -Iconfig -I../config -Ilib/librte_eal/common/include -I../lib/librte_eal/common/include -I../lib/librte_eal/linux/eal/include -Ilib/librte_eal/common -I../lib/librte_eal/common -Ilib/librte_eal/common/include/arch/x86 -I../lib/librte_eal/common/include/arch/x86 -Ilib/librte_eal -I../lib/librte_eal -Ilib/librte_kvargs -I../lib/librte_kvargs -Ilib/librte_net -I../lib/librte_net -Ilib/librte_mbuf -I../lib/librte_mbuf -Ilib/librte_mempool -I../lib/librte_mempool -Ilib/librte_ring -I../lib/librte_ring -Ilib/librte_meter -I../lib/librte_meter -Idrivers/bus/pci -I../drivers/bus/pci -I../drivers/bus/pci/linux -Ilib/librte_pci -I../lib/librte_pci -Idrivers/bus/vdev -I../drivers/bus/vdev -Ilib/librte_hash -I../lib/librte_hash -fdiagnostics-color=always -pipe -D_FILE_OFFSET_BITS=64 -Wall -Winvalid-pch -Werror -O3 -include rte_config.h -Wextra -Wcast-qual -Wdeprecated -Wformat-nonliteral -Wformat-security -Wmissing-declarations -Wmissing-prototypes -Wnested-externs -Wold-style-definition -Wpointer-arith -Wsign-compare -Wstrict-prototypes -Wundef -Wwrite-strings -Wno-missing-field-initializers -D_GNU_SOURCE -fPIC -march=native -mno-avx512f -Wno-format-truncation -DPF_DRIVER -DVF_DRIVER -DINTEGRATED_VF -DX722_A0_SUPPORT -DALLOW_EXPERIMENTAL_API -DCC_AVX2_SUPPORT -MD -MQ 'drivers/a715181@@tmp_rte_pmd_i40e at sta/net_i40e_i40e_fdir.c.o' -MF 'drivers/a715181@@tmp_rte_pmd_i40e at sta/net_i40e_i40e_fdir.c.o.d' -o 'drivers/a715181@@tmp_rte_pmd_i40e at sta/net_i40e_i40e_fdir.c.o' -c ../drivers/net/i40e/i40e_fdir.c
../drivers/net/i40e/i40e_fdir.c: In function ‘i40e_flow_fdir_construct_pkt’:
../drivers/net/i40e/i40e_fdir.c:1311:14: error: dereferencing pointer to incomplete type ‘struct rte_flow_item_l2tpv3oip’
     l2tpv3oip->session_id =
              ^~
../drivers/net/i40e/i40e_fdir.c:1317:12: error: invalid application of ‘sizeof’ to incomplete type ‘struct rte_flow_item_l2tpv3oip’
     sizeof(struct rte_flow_item_l2tpv3oip);
            ^~~~~~
[938/2137] Compiling C object 'drivers/a715181@@tmp_rte_pmd_i40e at sta/net_i40e_i40e_flow.c.o'.
FAILED: drivers/a715181@@tmp_rte_pmd_i40e at sta/net_i40e_i40e_flow.c.o 
gcc -Idrivers/a715181@@tmp_rte_pmd_i40e at sta -Idrivers -I../drivers -Idrivers/net/i40e -I../drivers/net/i40e -Idrivers/net/i40e/base -I../drivers/net/i40e/base -Ilib/librte_ethdev -I../lib/librte_ethdev -I. -I../ -Iconfig -I../config -Ilib/librte_eal/common/include -I../lib/librte_eal/common/include -I../lib/librte_eal/linux/eal/include -Ilib/librte_eal/common -I../lib/librte_eal/common -Ilib/librte_eal/common/include/arch/x86 -I../lib/librte_eal/common/include/arch/x86 -Ilib/librte_eal -I../lib/librte_eal -Ilib/librte_kvargs -I../lib/librte_kvargs -Ilib/librte_net -I../lib/librte_net -Ilib/librte_mbuf -I../lib/librte_mbuf -Ilib/librte_mempool -I../lib/librte_mempool -Ilib/librte_ring -I../lib/librte_ring -Ilib/librte_meter -I../lib/librte_meter -Idrivers/bus/pci -I../drivers/bus/pci -I../drivers/bus/pci/linux -Ilib/librte_pci -I../lib/librte_pci -Idrivers/bus/vdev -I../drivers/bus/vdev -Ilib/librte_hash -I../lib/librte_hash -fdiagnostics-color=always -pipe -D_FILE_OFFSET_BITS=64 -Wall -Winvalid-pch -Werror -O3 -include rte_config.h -Wextra -Wcast-qual -Wdeprecated -Wformat-nonliteral -Wformat-security -Wmissing-declarations -Wmissing-prototypes -Wnested-externs -Wold-style-definition -Wpointer-arith -Wsign-compare -Wstrict-prototypes -Wundef -Wwrite-strings -Wno-missing-field-initializers -D_GNU_SOURCE -fPIC -march=native -mno-avx512f -Wno-format-truncation -DPF_DRIVER -DVF_DRIVER -DINTEGRATED_VF -DX722_A0_SUPPORT -DALLOW_EXPERIMENTAL_API -DCC_AVX2_SUPPORT -MD -MQ 'drivers/a715181@@tmp_rte_pmd_i40e at sta/net_i40e_i40e_flow.c.o' -MF 'drivers/a715181@@tmp_rte_pmd_i40e at sta/net_i40e_i40e_flow.c.o.d' -o 'drivers/a715181@@tmp_rte_pmd_i40e at sta/net_i40e_i40e_flow.c.o' -c ../drivers/net/i40e/i40e_flow.c
../drivers/net/i40e/i40e_flow.c:1621:2: error: ‘RTE_FLOW_ITEM_TYPE_L2TPV3OIP’ undeclared here (not in a function); did you mean ‘RTE_FLOW_ITEM_TYPE_VOID’?
  RTE_FLOW_ITEM_TYPE_L2TPV3OIP,
  ^~~~~~~~~~~~~~~~~~~~~~~~~~~~
  RTE_FLOW_ITEM_TYPE_VOID
../drivers/net/i40e/i40e_flow.c:1628:2: error: incompatible types when initializing type ‘enum rte_flow_item_type’ using type ‘enum rte_flow_item_type *’
  RTE_FLOW_ITEM_TYPE_L2TPV3OIP,
  ^~~~~~~~~~~~~~~~~~~~~~~~~~~~
../drivers/net/i40e/i40e_flow.c: In function ‘i40e_flow_parse_fdir_pattern’:
../drivers/net/i40e/i40e_flow.c:3049:22: error: dereferencing pointer to incomplete type ‘const struct rte_flow_item_l2tpv3oip’
    if (l2tpv3oip_mask->session_id != UINT32_MAX) {
                      ^~
../drivers/net/i40e/i40e_flow.c:3049:22: error: request for member ‘session_id’ in something not a structure or union
../drivers/net/i40e/i40e_flow.c:3049:35: error: comparison between pointer and integer [-Werror]
    if (l2tpv3oip_mask->session_id != UINT32_MAX) {
                                   ^~
../drivers/net/i40e/i40e_flow.c:3059:22: error: request for member ‘session_id’ in something not a structure or union
      = l2tpv3oip_spec->session_id;
                      ^~
../drivers/net/i40e/i40e_flow.c:3059:6: error: assignment makes integer from pointer without a cast [-Werror=int-conversion]
      = l2tpv3oip_spec->session_id;
      ^
../drivers/net/i40e/i40e_flow.c:3064:22: error: request for member ‘session_id’ in something not a structure or union
      = l2tpv3oip_spec->session_id;
                      ^~
../drivers/net/i40e/i40e_flow.c:3064:6: error: assignment makes integer from pointer without a cast [-Werror=int-conversion]
      = l2tpv3oip_spec->session_id;
      ^
cc1: all warnings being treated as errors
[939/2137] Compiling C object 'drivers/a715181@@tmp_rte_pmd_i40e at sta/net_i40e_i40e_ethdev_vf.c.o'.
[940/2137] Compiling C object 'drivers/a715181@@tmp_rte_pmd_i40e at sta/net_i40e_i40e_tm.c.o'.
[941/2137] Compiling C object 'drivers/a715181@@tmp_rte_pmd_i40e at sta/net_i40e_i40e_rxtx.c.o'.
[942/2137] Compiling C object 'drivers/a715181@@tmp_rte_pmd_i40e at sta/net_i40e_i40e_ethdev.c.o'.
ninja: build stopped: subcommand failed




*Meson Build Failed #6:
OS: FreeBSD1201-64
Target:./build-gcc-static
FAILED: drivers/a715181@@tmp_rte_pmd_i40e at sta/net_i40e_i40e_fdir.c.o 
gcc -Idrivers/a715181@@tmp_rte_pmd_i40e at sta -Idrivers -I../drivers -Idrivers/net/i40e -I../drivers/net/i40e -Idrivers/net/i40e/base -I../drivers/net/i40e/base -Ilib/librte_ethdev -I../lib/librte_ethdev -I. -I../ -Iconfig -I../config -Ilib/librte_eal/common/include -I../lib/librte_eal/common/include -I../lib/librte_eal/freebsd/eal/include -Ilib/librte_eal/common -I../lib/librte_eal/common -Ilib/librte_eal/common/include/arch/x86 -I../lib/librte_eal/common/include/arch/x86 -Ilib/librte_eal -I../lib/librte_eal -Ilib/librte_kvargs -I../lib/librte_kvargs -Ilib/librte_net -I../lib/librte_net -Ilib/librte_mbuf -I../lib/librte_mbuf -Ilib/librte_mempool -I../lib/librte_mempool -Ilib/librte_ring -I../lib/librte_ring -Ilib/librte_meter -I../lib/librte_meter -Idrivers/bus/pci -I../drivers/bus/pci -I../drivers/bus/pci/bsd -Ilib/librte_pci -I../lib/librte_pci -Idrivers/bus/vdev -I../drivers/bus/vdev -Ilib/librte_hash -I../lib/librte_hash -fdiagnostics-color=always -pipe -D_FILE_OFFSET_BITS=64 -Wall -Winvalid-pch -Werror -O3 -include rte_config.h -Wextra -Wcast-qual -Wdeprecated -Wformat-nonliteral -Wformat-security -Wmissing-declarations -Wmissing-prototypes -Wnested-externs -Wold-style-definition -Wpointer-arith -Wsign-compare -Wstrict-prototypes -Wundef -Wwrite-strings -Wno-address-of-packed-member -Wno-packed-not-aligned -Wno-missing-field-initializers -D_GNU_SOURCE -D__BSD_VISIBLE -fPIC -march=native -Wno-format-truncation -DPF_DRIVER -DVF_DRIVER -DINTEGRATED_VF -DX722_A0_SUPPORT -DALLOW_EXPERIMENTAL_API -DCC_AVX2_SUPPORT -MD -MQ 'drivers/a715181@@tmp_rte_pmd_i40e at sta/net_i40e_i40e_fdir.c.o' -MF 'drivers/a715181@@tmp_rte_pmd_i40e at sta/net_i40e_i40e_fdir.c.o.d' -o 'drivers/a715181@@tmp_rte_pmd_i40e at sta/net_i40e_i40e_fdir.c.o' -c ../drivers/net/i40e/i40e_fdir.c
../drivers/net/i40e/i40e_fdir.c: In function 'i40e_flow_fdir_construct_pkt':
../drivers/net/i40e/i40e_fdir.c:1311:14: error: dereferencing pointer to incomplete type 'struct rte_flow_item_l2tpv3oip'
 1311 |     l2tpv3oip->session_id =
      |              ^~
../drivers/net/i40e/i40e_fdir.c:1317:12: error: invalid application of 'sizeof' to incomplete type 'struct rte_flow_item_l2tpv3oip'
 1317 |     sizeof(struct rte_flow_item_l2tpv3oip);
      |            ^~~~~~
[716/1614] Compiling C object 'drivers/a715181@@tmp_rte_pmd_i40e at sta/net_i40e_i40e_flow.c.o'.
FAILED: drivers/a715181@@tmp_rte_pmd_i40e at sta/net_i40e_i40e_flow.c.o 
gcc -Idrivers/a715181@@tmp_rte_pmd_i40e at sta -Idrivers -I../drivers -Idrivers/net/i40e -I../drivers/net/i40e -Idrivers/net/i40e/base -I../drivers/net/i40e/base -Ilib/librte_ethdev -I../lib/librte_ethdev -I. -I../ -Iconfig -I../config -Ilib/librte_eal/common/include -I../lib/librte_eal/common/include -I../lib/librte_eal/freebsd/eal/include -Ilib/librte_eal/common -I../lib/librte_eal/common -Ilib/librte_eal/common/include/arch/x86 -I../lib/librte_eal/common/include/arch/x86 -Ilib/librte_eal -I../lib/librte_eal -Ilib/librte_kvargs -I../lib/librte_kvargs -Ilib/librte_net -I../lib/librte_net -Ilib/librte_mbuf -I../lib/librte_mbuf -Ilib/librte_mempool -I../lib/librte_mempool -Ilib/librte_ring -I../lib/librte_ring -Ilib/librte_meter -I../lib/librte_meter -Idrivers/bus/pci -I../drivers/bus/pci -I../drivers/bus/pci/bsd -Ilib/librte_pci -I../lib/librte_pci -Idrivers/bus/vdev -I../drivers/bus/vdev -Ilib/librte_hash -I../lib/librte_hash -fdiagnostics-color=always -pipe -D_FILE_OFFSET_BITS=64 -Wall -Winvalid-pch -Werror -O3 -include rte_config.h -Wextra -Wcast-qual -Wdeprecated -Wformat-nonliteral -Wformat-security -Wmissing-declarations -Wmissing-prototypes -Wnested-externs -Wold-style-definition -Wpointer-arith -Wsign-compare -Wstrict-prototypes -Wundef -Wwrite-strings -Wno-address-of-packed-member -Wno-packed-not-aligned -Wno-missing-field-initializers -D_GNU_SOURCE -D__BSD_VISIBLE -fPIC -march=native -Wno-format-truncation -DPF_DRIVER -DVF_DRIVER -DINTEGRATED_VF -DX722_A0_SUPPORT -DALLOW_EXPERIMENTAL_API -DCC_AVX2_SUPPORT -MD -MQ 'drivers/a715181@@tmp_rte_pmd_i40e at sta/net_i40e_i40e_flow.c.o' -MF 'drivers/a715181@@tmp_rte_pmd_i40e at sta/net_i40e_i40e_flow.c.o.d' -o 'drivers/a715181@@tmp_rte_pmd_i40e at sta/net_i40e_i40e_flow.c.o' -c ../drivers/net/i40e/i40e_flow.c
../drivers/net/i40e/i40e_flow.c:1621:2: error: 'RTE_FLOW_ITEM_TYPE_L2TPV3OIP' undeclared here (not in a function); did you mean 'RTE_FLOW_ITEM_TYPE_VOID'?
 1621 |  RTE_FLOW_ITEM_TYPE_L2TPV3OIP,
      |  ^~~~~~~~~~~~~~~~~~~~~~~~~~~~
      |  RTE_FLOW_ITEM_TYPE_VOID
../drivers/net/i40e/i40e_flow.c:1628:2: error: incompatible types when initializing type 'enum rte_flow_item_type' using type 'enum rte_flow_item_type *'
 1628 |  RTE_FLOW_ITEM_TYPE_L2TPV3OIP,
      |  ^~~~~~~~~~~~~~~~~~~~~~~~~~~~
../drivers/net/i40e/i40e_flow.c: In function 'i40e_flow_parse_fdir_pattern':
../drivers/net/i40e/i40e_flow.c:3049:22: error: dereferencing pointer to incomplete type 'const struct rte_flow_item_l2tpv3oip'
 3049 |    if (l2tpv3oip_mask->session_id != UINT32_MAX) {
      |                      ^~
../drivers/net/i40e/i40e_flow.c:3049:22: error: request for member 'session_id' in something not a structure or union
../drivers/net/i40e/i40e_flow.c:3049:35: error: comparison between pointer and integer [-Werror]
 3049 |    if (l2tpv3oip_mask->session_id != UINT32_MAX) {
      |                                   ^~
../drivers/net/i40e/i40e_flow.c:3059:22: error: request for member 'session_id' in something not a structure or union
 3059 |      = l2tpv3oip_spec->session_id;
      |                      ^~
../drivers/net/i40e/i40e_flow.c:3059:6: error: assignment to 'uint32_t' {aka 'unsigned int'} from 'enum rte_flow_item_type *' makes integer from pointer without a cast [-Werror=int-conversion]
 3059 |      = l2tpv3oip_spec->session_id;
      |      ^
../drivers/net/i40e/i40e_flow.c:3064:22: error: request for member 'session_id' in something not a structure or union
 3064 |      = l2tpv3oip_spec->session_id;
      |                      ^~
../drivers/net/i40e/i40e_flow.c:3064:6: error: assignment to 'uint32_t' {aka 'unsigned int'} from 'enum rte_flow_item_type *' makes integer from pointer without a cast [-Werror=int-conversion]
 3064 |      = l2tpv3oip_spec->session_id;
      |      ^
cc1: all warnings being treated as errors
[717/1614] Compiling C object 'drivers/a715181@@tmp_rte_pmd_i40e at sta/net_i40e_i40e_tm.c.o'.
[718/1614] Compiling C object 'drivers/a715181@@tmp_rte_pmd_i40e at sta/net_i40e_i40e_vf_representor.c.o'.
[719/1614] Compiling C object 'drivers/a715181@@tmp_rte_pmd_i40e at sta/net_i40e_i40e_rxtx.c.o'.
[720/1614] Compiling C object 'drivers/a715181@@tmp_rte_pmd_i40e at sta/net_i40e_i40e_ethdev.c.o'.
ninja: build stopped: subcommand failed



DPDK STV team


More information about the test-report mailing list