[dpdk-test-report] |FAILURE| pw64876[v10, 5/6] lib/hash: use ring with 32b element size to save memory

sys_stv at intel.com sys_stv at intel.com
Mon Jan 20 05:39:45 CET 2020


Test-Label: Intel-compilation
Test-Status: FAILURE
http://dpdk.org/patch/64876

_Compilation issues_

Submitter: Honnappa Nagarahalli <honnappa.nagarahalli at arm.com>
Date: 2020-01-18 19:32:46
Reply_mail: 20200118193247.43831-6-honnappa.nagarahalli at arm.com
DPDK git baseline: Repo:dpdk-next-eventdev, CommitID: 0b6ee9a9a5e13866cd603cd116d25914af966e2a

Makefile build Summary: 25 Builds Done, 23 Successful, 2 Failures

Meson build Summary: 8 Builds Done, 8 Successful, 0 Failures

               +==============================================+===========+==========+
               |                   Makefile                   |   Meson   | Document |
+----------------+------+-------+------+------------+-----------+-----------+----------+
| os             | gcc  | clang | icc  | gcc+shared | gcc+debug | gcc/clang | pdf/html |
+----------------+------+-------+------+------------+-----------+-----------+----------+
| RHEL80-64      | pass |       |      |            |           |           |          |
| UB1804-64      | pass | pass  | pass |            |           | pass      | pass     |
| UB1804-64K     | FAIL |       |      | FAIL       |           |           |          |
| UB1604-32      | pass |       |      |            |           | pass      |          |
| CENTOS77-64    | pass | pass  | pass | pass       | pass      | pass      |          |
| UB1604-64      | pass | pass  |      |            |           |           |          |
| WIN10-64       |      |       |      |            |           | pass      |          |
| UB1910-64      | pass |       |      |            |           |           |          |
| FC31-64        | pass | pass  |      |            |           | pass      |          |
| CENTOS80-64    | pass |       |      |            |           |           |          |
| FreeBSD1201-64 | pass | pass  |      | pass       | pass      | pass      |          |
| RHEL77-64      | pass |       |      |            |           |           |          |
| SUSE15-64      | pass | pass  |      |            |           | pass      |          |
+----------------+------+-------+------+------------+-----------+-----------+----------+

Test environment and configuration as below:

** Makefile build **


OS: UB1804-64
	Kernel Version: 4.15.0-20-generic
	CPU info: Intel(R) Xeon(R) CPU E5-2699 v3 @ 2.30GHz
	GCC Version: gcc (Ubuntu 7.3.0-16ubuntu3) 7.3.0
	Clang Version: 6.0.0-1ubuntu2 (tags/RELEASE_600/final)
	x86_64-native-linuxapp-clang
	x86_64-native-linuxapp-icc
	x86_64-native-linuxapp-gcc


OS: UB1804-64K
	Kernel Version: 5.4.0-050400-generic
	CPU info: Intel(R) Xeon(R) CPU E5-2699 v3 @ 2.30GHz
	GCC Version: gcc (Ubuntu 7.4.0-1ubuntu1~18.04.1) 7.4.0
	Clang Version: 6.0.0-1ubuntu2 (tags/RELEASE_600/final)
	x86_64-native-linuxapp-gcc
	x86_64-native-linuxapp-gcc+shared


OS: UB1604-32
	Kernel Version: 4.4.0-131-generic
	CPU info: Intel(R) Xeon(R) CPU E5-2699 v3 @ 2.30GHz
	GCC Version: gcc (Ubuntu 5.4.0-6ubuntu1~16.04.11) 5.4.0 20160609
	Clang Version: 3.8.0-2ubuntu4 (tags/RELEASE_380/final)
	i686-native-linuxapp-gcc


OS: CENTOS77-64
	Kernel Version: 3.10.0-1062.9.1.el7.x86_64
	CPU info: Intel(R) Xeon(R) CPU E5-2699 v4 @ 2.20GHz
	GCC Version: gcc (GCC) 4.8.5 20150623 (Red Hat 4.8.5-39)
	Clang Version: 3.4.2 (tags/RELEASE_34/dot2-final)
	x86_64-native-linuxapp-gcc+debug
	x86_64-native-linuxapp-gcc+shared
	x86_64-native-linuxapp-gcc
	x86_64-native-linuxapp-clang
	x86_64-native-linuxapp-icc


OS: UB1910-64
	Kernel Version: 5.3.0-18-generic
	CPU info: Intel(R) Xeon(R) CPU E5-2699 v3 @ 2.30GHz
	GCC Version: gcc (Ubuntu 9.2.1-9ubuntu2) 9.2.1 20191008
	Clang Version: 9.0.0-2 (tags/RELEASE_900/final)
	x86_64-native-linuxapp-gcc


OS: CENTOS80-64
	Kernel Version: 4.18.0-80.11.2.el8_0.x86_64
	CPU info: Intel(R) Xeon(R) CPU E5-2699 v4 @ 2.20GHz
	GCC Version: gcc (GCC) 8.2.1 20180905 (Red Hat 8.2.1-3)
	Clang Version: 7.0.1 (tags/RELEASE_701/final)
	x86_64-native-linuxapp-gcc


OS: UB1604-64
	Kernel Version: 4.4.0-170-generic
	CPU info: Intel(R) Xeon(R) CPU E5-2699 v3 @ 2.30GHz
	GCC Version: gcc (Ubuntu 5.4.0-6ubuntu1~16.04.12) 5.4.0 20160609
	Clang Version: 3.8.0-2ubuntu4 (tags/RELEASE_380/final)
	x86_64-native-linuxapp-clang
	x86_64-native-linuxapp-gcc


OS: FC31-64
	Kernel Version: 5.3.15-300.fc31.x86_64
	CPU info: Intel(R) Xeon(R) CPU E5-2699 v4 @ 2.20GHz
	GCC Version: gcc (GCC) 9.2.1 20190827 (Red Hat 9.2.1-1)
	Clang Version: 9.0.0 (Fedora 9.0.0-1.fc31)
	x86_64-native-linuxapp-gcc
	x86_64-native-linuxapp-clang


OS: RHEL80-64
	Kernel Version: 4.18.0-80.el8.x86_64
	CPU info: Intel(R) Xeon(R) CPU E5-2699 v4 @ 2.20GHz
	GCC Version: gcc (GCC) 8.2.1 20180905 (Red Hat 8.2.1-3)
	Clang Version: 6.0.1 (tags/RELEASE_601/final)
	x86_64-native-linuxapp-gcc


OS: FreeBSD1201-64
	Kernel Version: 12.1-RELEASE
	CPU info: Intel(R) Xeon(R) CPU E5-2699 v4 @ 2.20GHz (2194.98-MHz K8-class CPU)
	GCC Version: gcc (FreeBSD Ports Collection) 9.2.0
	Clang Version: 8.0.1 (tags/RELEASE_801/final 366581) (based on LLVM 8.0.1)
	x86_64-native-bsdapp-gcc+debug
	x86_64-native-bsdapp-gcc+shared
	x86_64-native-bsdapp-gcc
	x86_64-native-bsdapp-clang


OS: RHEL77-64
	Kernel Version: 3.10.0-1062.9.1.el7.x86_64
	CPU info: Intel(R) Xeon(R) CPU E5-2699 v4 @ 2.20GHz
	GCC Version: gcc (GCC) 4.8.5 20150623 (Red Hat 4.8.5-39)
	Clang Version: 3.4.2 (tags/RELEASE_34/dot2-final)
	x86_64-native-linuxapp-gcc


OS: SUSE15-64
	Kernel Version: 4.12.14-lp150.11-default
	CPU info: Intel(R) Xeon(R) CPU E5-2699 v4 @ 2.20GHz
	GCC Version: gcc (SUSE Linux) 7.3.1 20180323 [gcc-7-branch revision 258812]
	Clang Version: 5.0.1 (tags/RELEASE_501/final 312548)
	x86_64-native-linuxapp-gcc
	x86_64-native-linuxapp-clang


** Meson build **


OS: UB1804-64
	Kernel Version: 4.15.0-20-generic
	CPU info: Intel(R) Xeon(R) CPU E5-2699 v4 @ 2.20GHz
	GCC Version: gcc (Ubuntu 7.3.0-27ubuntu1~18.04) 7.3.0
	Clang Version: 6.0.0-1ubuntu2 (tags/RELEASE_600/final)
	x86_64-native-linuxapp-doc
	./build-gcc-static
	./build-gcc-shared
	./build-clang-static
	./build-clang-shared
	./build-x86-default


OS: UB1604-32
	Kernel Version: 4.4.0-131-generic
	CPU info: Intel(R) Xeon(R) CPU E5-2699 v4 @ 2.20GHz
	GCC Version: gcc (Ubuntu 5.4.0-6ubuntu1~16.04.11) 5.4.0 20160609
	Clang Version: 3.8.0-2ubuntu4 (tags/RELEASE_380/final)
	./build-gcc-static
	./build-gcc-shared
	./build-clang-static
	./build-clang-shared
	./build-x86-default


OS: CENTOS77-64
	Kernel Version: 3.10.0-1062.9.1.el7.x86_64
	CPU info: Intel(R) Xeon(R) CPU E5-2699 v4 @ 2.20GHz
	GCC Version: gcc (GCC) 4.8.5 20150623 (Red Hat 4.8.5-39)
	Clang Version: 3.4.2 (tags/RELEASE_34/dot2-final)
	./build-gcc-static
	./build-gcc-shared
	./build-clang-static
	./build-clang-shared
	./build-x86-default


OS: WIN10-64
	Kernel Version: N/A
	CPU info: N/A
	GCC Version: N/A
	Clang Version: Clang 8.0.0
	x86_64-windows-clang


OS: FC31-64
	Kernel Version: 5.3.14-300.fc31.x86_64
	CPU info: Intel(R) Xeon(R) CPU E5-2699 v4 @ 2.20GHz
	GCC Version: gcc (GCC) 9.2.1 20190827 (Red Hat 9.2.1-1)
	Clang Version: 9.0.0 (Fedora 9.0.0-1.fc31)
	./build-gcc-static
	./build-gcc-shared
	./build-clang-static
	./build-clang-shared
	./build-x86-default


OS: FreeBSD1201-64
	Kernel Version: 12.1-RELEASE
	CPU info: Intel(R) Xeon(R) CPU E5-2699 v4 @ 2.20GHz (2194.97-MHz K8-class CPU)
	GCC Version: gcc (FreeBSD Ports Collection) 9.2.0
	Clang Version: 8.0.1 (tags/RELEASE_801/final 366581) (based on LLVM 8.0.1)
	./build-gcc-static
	./build-gcc-shared
	./build-clang-static
	./build-clang-shared
	./build-x86-default


OS: SUSE15-64
	Kernel Version: 4.12.14-lp150.11-default
	CPU info: Intel(R) Xeon(R) CPU E5-2699 v4 @ 2.20GHz
	GCC Version: gcc (SUSE Linux) 7.3.1 20180323 [gcc-7-branch revision 258812]
	Clang Version: 5.0.1 (tags/RELEASE_501/final 312548)
	./build-gcc-static
	./build-gcc-shared
	./build-clang-static
	./build-clang-shared
	./build-x86-default


*Make Build Failed #1:
OS: UB1804-64K
Target: x86_64-native-linuxapp-gcc
 #define BUG_ON(condition) do { if (unlikely(condition)) BUG(); } while (0)
                                                         ^~~
./include/linux/dma-mapping.h:413:2: note: in expansion of macro ‘BUG_ON’
  BUG_ON(!valid_dma_direction(dir));
  ^~~~~~
scripts/Makefile.build:265: recipe for target '/root/UB1804-64K_K5.4.0_GCC7.4.0/x86_64-native-linuxapp-gcc/73fcc6bfd17c4d04b04b88abbd5e50bf/dpdk/x86_64-native-linuxapp-gcc/build/kernel/linux/igb_uio/igb_uio.o' failed
make[8]: *** [/root/UB1804-64K_K5.4.0_GCC7.4.0/x86_64-native-linuxapp-gcc/73fcc6bfd17c4d04b04b88abbd5e50bf/dpdk/x86_64-native-linuxapp-gcc/build/kernel/linux/igb_uio/igb_uio.o] Error 1
In file included from ./include/linux/bug.h:5:0,
                 from ./include/linux/thread_info.h:12,
                 from ./arch/x86/include/asm/preempt.h:7,
                 from ./include/linux/preempt.h:78,
                 from ./include/linux/spinlock.h:51,
--
 #define BUG_ON(condition) do { if (unlikely(condition)) BUG(); } while (0)
                                                         ^~~
./include/linux/dma-mapping.h:427:2: note: in expansion of macro ‘BUG_ON’
  BUG_ON(!valid_dma_direction(dir));
  ^~~~~~
Makefile:1652: recipe for target '/root/UB1804-64K_K5.4.0_GCC7.4.0/x86_64-native-linuxapp-gcc/73fcc6bfd17c4d04b04b88abbd5e50bf/dpdk/x86_64-native-linuxapp-gcc/build/kernel/linux/igb_uio' failed
make[7]: *** [/root/UB1804-64K_K5.4.0_GCC7.4.0/x86_64-native-linuxapp-gcc/73fcc6bfd17c4d04b04b88abbd5e50bf/dpdk/x86_64-native-linuxapp-gcc/build/kernel/linux/igb_uio] Error 2
In file included from ./include/linux/bug.h:5:0,
                 from ./include/linux/thread_info.h:12,
                 from ./arch/x86/include/asm/preempt.h:7,
                 from ./include/linux/preempt.h:78,
                 from ./include/linux/spinlock.h:51,
--
 #define BUG_ON(condition) do { if (unlikely(condition)) BUG(); } while (0)
                                                         ^~~
./include/linux/dma-mapping.h:427:2: note: in expansion of macro ‘BUG_ON’
  BUG_ON(!valid_dma_direction(dir));
  ^~~~~~
/root/UB1804-64K_K5.4.0_GCC7.4.0/x86_64-native-linuxapp-gcc/73fcc6bfd17c4d04b04b88abbd5e50bf/dpdk/mk/rte.module.mk:50: recipe for target 'igb_uio.ko' failed
make[6]: *** [igb_uio.ko] Error 2
/root/UB1804-64K_K5.4.0_GCC7.4.0/x86_64-native-linuxapp-gcc/73fcc6bfd17c4d04b04b88abbd5e50bf/dpdk/mk/rte.subdir.mk:35: recipe for target 'igb_uio' failed
make[5]: *** [igb_uio] Error 2
make[5]: *** Waiting for unfinished jobs....
./include/linux/skbuff.h: In function ‘skb_dst’:
././include/linux/compiler_types.h:210:24: error: expected ‘(’ before ‘__inline’
 #define asm_inline asm __inline
                        ^
--
  SYMLINK-FILE include/rte_bus_pci.h
  CC qbman/qbman_portal.o
  SYMLINK-FILE include/rte_bus_vmbus.h
  SYMLINK-FILE include/rte_bus_vdev.h
cc1: all warnings being treated as errors
scripts/Makefile.build:265: recipe for target '/root/UB1804-64K_K5.4.0_GCC7.4.0/x86_64-native-linuxapp-gcc/73fcc6bfd17c4d04b04b88abbd5e50bf/dpdk/x86_64-native-linuxapp-gcc/build/kernel/linux/kni/kni_net.o' failed
make[8]: *** [/root/UB1804-64K_K5.4.0_GCC7.4.0/x86_64-native-linuxapp-gcc/73fcc6bfd17c4d04b04b88abbd5e50bf/dpdk/x86_64-native-linuxapp-gcc/build/kernel/linux/kni/kni_net.o] Error 1
make[8]: *** Waiting for unfinished jobs....
scripts/Makefile.build:265: recipe for target '/root/UB1804-64K_K5.4.0_GCC7.4.0/x86_64-native-linuxapp-gcc/73fcc6bfd17c4d04b04b88abbd5e50bf/dpdk/x86_64-native-linuxapp-gcc/build/kernel/linux/kni/kni_misc.o' failed
make[8]: *** [/root/UB1804-64K_K5.4.0_GCC7.4.0/x86_64-native-linuxapp-gcc/73fcc6bfd17c4d04b04b88abbd5e50bf/dpdk/x86_64-native-linuxapp-gcc/build/kernel/linux/kni/kni_misc.o] Error 1
Makefile:1652: recipe for target '/root/UB1804-64K_K5.4.0_GCC7.4.0/x86_64-native-linuxapp-gcc/73fcc6bfd17c4d04b04b88abbd5e50bf/dpdk/x86_64-native-linuxapp-gcc/build/kernel/linux/kni' failed
make[7]: *** [/root/UB1804-64K_K5.4.0_GCC7.4.0/x86_64-native-linuxapp-gcc/73fcc6bfd17c4d04b04b88abbd5e50bf/dpdk/x86_64-native-linuxapp-gcc/build/kernel/linux/kni] Error 2
/root/UB1804-64K_K5.4.0_GCC7.4.0/x86_64-native-linuxapp-gcc/73fcc6bfd17c4d04b04b88abbd5e50bf/dpdk/mk/rte.module.mk:50: recipe for target 'rte_kni.ko' failed
make[6]: *** [rte_kni.ko] Error 2
/root/UB1804-64K_K5.4.0_GCC7.4.0/x86_64-native-linuxapp-gcc/73fcc6bfd17c4d04b04b88abbd5e50bf/dpdk/mk/rte.subdir.mk:35: recipe for target 'kni' failed
make[5]: *** [kni] Error 2
/root/UB1804-64K_K5.4.0_GCC7.4.0/x86_64-native-linuxapp-gcc/73fcc6bfd17c4d04b04b88abbd5e50bf/dpdk/mk/rte.subdir.mk:35: recipe for target 'linux' failed
make[4]: *** [linux] Error 2
/root/UB1804-64K_K5.4.0_GCC7.4.0/x86_64-native-linuxapp-gcc/73fcc6bfd17c4d04b04b88abbd5e50bf/dpdk/mk/rte.sdkbuild.mk:46: recipe for target 'kernel' failed
make[3]: *** [kernel] Error 2
make[3]: *** Waiting for unfinished jobs....
  CC qbman/qbman_debug.o
  CC ifpga_bus.o
  CC mc/dpmng.o
  SYMLINK-FILE include/rte_vmbus_reg.h
--
  PMDINFO dpaa2_qdma.o.pmd.c
  CC dpaa2_qdma.o.pmd.o
  LD dpaa2_qdma.o
  AR librte_rawdev_dpaa2_qdma.a
  INSTALL-LIB librte_rawdev_dpaa2_qdma.a
/root/UB1804-64K_K5.4.0_GCC7.4.0/x86_64-native-linuxapp-gcc/73fcc6bfd17c4d04b04b88abbd5e50bf/dpdk/mk/rte.sdkroot.mk:98: recipe for target 'all' failed
make[2]: *** [all] Error 2
/root/UB1804-64K_K5.4.0_GCC7.4.0/x86_64-native-linuxapp-gcc/73fcc6bfd17c4d04b04b88abbd5e50bf/dpdk/mk/rte.sdkinstall.mk:60: recipe for target 'pre_install' failed
make[1]: *** [pre_install] Error 2
/root/UB1804-64K_K5.4.0_GCC7.4.0/x86_64-native-linuxapp-gcc/73fcc6bfd17c4d04b04b88abbd5e50bf/dpdk/mk/rte.sdkroot.mk:77: recipe for target 'install' failed
make: *** [install] Error 2


*Make Build Failed #2:
OS: UB1804-64K
Target: x86_64-native-linuxapp-gcc+shared
   WARN(1, format);    \
   ^~~~
./include/linux/netdevice.h:4700:2: note: in expansion of macro ‘WARN_ONCE’
  WARN_ONCE(1, "%s: unknown reg_state %d\n", dev->name, dev->reg_state);
  ^~~~~~~~~
scripts/Makefile.build:265: recipe for target '/root/UB1804-64K_K5.4.0_GCC7.4.0/x86_64-native-linuxapp-gcc+shared/73fcc6bfd17c4d04b04b88abbd5e50bf/dpdk/x86_64-native-linuxapp-gcc/build/kernel/linux/igb_uio/igb_uio.o' failed
make[8]: *** [/root/UB1804-64K_K5.4.0_GCC7.4.0/x86_64-native-linuxapp-gcc+shared/73fcc6bfd17c4d04b04b88abbd5e50bf/dpdk/x86_64-native-linuxapp-gcc/build/kernel/linux/igb_uio/igb_uio.o] Error 1
Makefile:1652: recipe for target '/root/UB1804-64K_K5.4.0_GCC7.4.0/x86_64-native-linuxapp-gcc+shared/73fcc6bfd17c4d04b04b88abbd5e50bf/dpdk/x86_64-native-linuxapp-gcc/build/kernel/linux/igb_uio' failed
make[7]: *** [/root/UB1804-64K_K5.4.0_GCC7.4.0/x86_64-native-linuxapp-gcc+shared/73fcc6bfd17c4d04b04b88abbd5e50bf/dpdk/x86_64-native-linuxapp-gcc/build/kernel/linux/igb_uio] Error 2
/root/UB1804-64K_K5.4.0_GCC7.4.0/x86_64-native-linuxapp-gcc+shared/73fcc6bfd17c4d04b04b88abbd5e50bf/dpdk/mk/rte.module.mk:50: recipe for target 'igb_uio.ko' failed
make[6]: *** [igb_uio.ko] Error 2
/root/UB1804-64K_K5.4.0_GCC7.4.0/x86_64-native-linuxapp-gcc+shared/73fcc6bfd17c4d04b04b88abbd5e50bf/dpdk/mk/rte.subdir.mk:35: recipe for target 'igb_uio' failed
make[5]: *** [igb_uio] Error 2
make[5]: *** Waiting for unfinished jobs....
cc1: all warnings being treated as errors
scripts/Makefile.build:265: recipe for target '/root/UB1804-64K_K5.4.0_GCC7.4.0/x86_64-native-linuxapp-gcc+shared/73fcc6bfd17c4d04b04b88abbd5e50bf/dpdk/x86_64-native-linuxapp-gcc/build/kernel/linux/kni/kni_net.o' failed
make[8]: *** [/root/UB1804-64K_K5.4.0_GCC7.4.0/x86_64-native-linuxapp-gcc+shared/73fcc6bfd17c4d04b04b88abbd5e50bf/dpdk/x86_64-native-linuxapp-gcc/build/kernel/linux/kni/kni_net.o] Error 1
make[8]: *** Waiting for unfinished jobs....
cc1: all warnings being treated as errors
scripts/Makefile.build:265: recipe for target '/root/UB1804-64K_K5.4.0_GCC7.4.0/x86_64-native-linuxapp-gcc+shared/73fcc6bfd17c4d04b04b88abbd5e50bf/dpdk/x86_64-native-linuxapp-gcc/build/kernel/linux/kni/kni_misc.o' failed
make[8]: *** [/root/UB1804-64K_K5.4.0_GCC7.4.0/x86_64-native-linuxapp-gcc+shared/73fcc6bfd17c4d04b04b88abbd5e50bf/dpdk/x86_64-native-linuxapp-gcc/build/kernel/linux/kni/kni_misc.o] Error 1
Makefile:1652: recipe for target '/root/UB1804-64K_K5.4.0_GCC7.4.0/x86_64-native-linuxapp-gcc+shared/73fcc6bfd17c4d04b04b88abbd5e50bf/dpdk/x86_64-native-linuxapp-gcc/build/kernel/linux/kni' failed
make[7]: *** [/root/UB1804-64K_K5.4.0_GCC7.4.0/x86_64-native-linuxapp-gcc+shared/73fcc6bfd17c4d04b04b88abbd5e50bf/dpdk/x86_64-native-linuxapp-gcc/build/kernel/linux/kni] Error 2
/root/UB1804-64K_K5.4.0_GCC7.4.0/x86_64-native-linuxapp-gcc+shared/73fcc6bfd17c4d04b04b88abbd5e50bf/dpdk/mk/rte.module.mk:50: recipe for target 'rte_kni.ko' failed
make[6]: *** [rte_kni.ko] Error 2
/root/UB1804-64K_K5.4.0_GCC7.4.0/x86_64-native-linuxapp-gcc+shared/73fcc6bfd17c4d04b04b88abbd5e50bf/dpdk/mk/rte.subdir.mk:35: recipe for target 'kni' failed
make[5]: *** [kni] Error 2
/root/UB1804-64K_K5.4.0_GCC7.4.0/x86_64-native-linuxapp-gcc+shared/73fcc6bfd17c4d04b04b88abbd5e50bf/dpdk/mk/rte.subdir.mk:35: recipe for target 'linux' failed
make[4]: *** [linux] Error 2
/root/UB1804-64K_K5.4.0_GCC7.4.0/x86_64-native-linuxapp-gcc+shared/73fcc6bfd17c4d04b04b88abbd5e50bf/dpdk/mk/rte.sdkbuild.mk:46: recipe for target 'kernel' failed
make[3]: *** [kernel] Error 2
make[3]: *** Waiting for unfinished jobs....
  SYMLINK-FILE include/rte_bus_vdev.h
  SYMLINK-FILE include/rte_vmbus_reg.h
  SYMLINK-FILE include/rte_bus_vmbus.h
  CC vdev_params.o
--
  PMDINFO ntb.o.pmd.c
  CC ntb.o.pmd.o
  LD ntb.o
  LD librte_rawdev_ntb.so.20.0.1
  INSTALL-LIB librte_rawdev_ntb.so.20.0.1
/root/UB1804-64K_K5.4.0_GCC7.4.0/x86_64-native-linuxapp-gcc+shared/73fcc6bfd17c4d04b04b88abbd5e50bf/dpdk/mk/rte.sdkroot.mk:98: recipe for target 'all' failed
make[2]: *** [all] Error 2
/root/UB1804-64K_K5.4.0_GCC7.4.0/x86_64-native-linuxapp-gcc+shared/73fcc6bfd17c4d04b04b88abbd5e50bf/dpdk/mk/rte.sdkinstall.mk:60: recipe for target 'pre_install' failed
make[1]: *** [pre_install] Error 2
/root/UB1804-64K_K5.4.0_GCC7.4.0/x86_64-native-linuxapp-gcc+shared/73fcc6bfd17c4d04b04b88abbd5e50bf/dpdk/mk/rte.sdkroot.mk:77: recipe for target 'install' failed
make: *** [install] Error 2

DPDK STV team


More information about the test-report mailing list