[dpdk-test-report] |FAILURE| pw(73483) [v3, 3/4] doc/linux_gsg: require pyelftools for pmdinfogen

sys_stv at intel.com sys_stv at intel.com
Wed Jul 8 20:30:46 CEST 2020


Test-Label: Intel-compilation
Test-Status: FAILURE
http://dpdk.org/patch/73483

_Compilation issues_

Submitter: Dmitry Kozlyuk <dmitry.kozliuk at gmail.com>
Date: 2020-07-08 00:53:54
Reply_mail: 20200708005355.7102-4-dmitry.kozliuk at gmail.com

DPDK git baseline: Repo:dpdk, CommitID: 048db4b6dcccaee9277ce5b4fbb2fe684b212e22


Meson build Summary: 8 Builds Done, 2 Successful, 6 Failures, 0 Blocked

Makefile build Summary: 20 Builds Done, 0 Successful, 20 Failures, 0 Blocked

                +==============================================+===========+==========+
                |                   Makefile                   |   Meson   | Document |
+----------------+------+-------+------+------------+-----------+-----------+----------+
| os             | gcc  | clang | icc  | gcc+shared | gcc+debug | gcc/clang | pdf/html |
+----------------+------+-------+------+------------+-----------+-----------+----------+
| CENTOS82-64    | FAIL | FAIL  | FAIL | FAIL       | FAIL      | FAIL      |          |
| RHEL82-64      | FAIL |       |      |            |           |           |          |
| UB1804-64      | FAIL |       |      |            |           |           |          |
| FC32-64        | FAIL | FAIL  |      |            |           | FAIL      |          |
| CENTOS77-64    | FAIL |       |      |            |           |           |          |
| UB2004-64      | FAIL | FAIL  | FAIL |            |           | FAIL      | pass     |
| WIN10-64       |      |       |      |            |           | pass      |          |
| UB2004-32      | FAIL |       |      |            |           |           |          |
| UB1804-32      |      |       |      |            |           | FAIL      |          |
| FreeBSD1201-64 | FAIL | FAIL  |      | FAIL       | FAIL      | FAIL      |          |
| SUSE15-64      | FAIL | FAIL  |      |            |           | FAIL      |          |
+----------------+------+-------+------+------------+-----------+-----------+----------+
Test environment and configuration as below:

** Makefile build **


OS: CENTOS82-64
	Kernel Version: 4.18.0-193.el8.x86_64
	CPU info: Intel(R) Xeon(R) Platinum 8280M CPU @ 2.70GHz
	GCC Version: gcc (GCC) 8.3.1 20191121 (Red Hat 8.3.1-5)
	Clang Version: 9.0.1 (Red Hat 9.0.1-2.module_el8.2.0+309+0c7b6b03)
	x86_64-native-linuxapp-gcc
	x86_64-native-linuxapp-clang
	x86_64-native-linuxapp-icc
	x86_64-native-linuxapp-gcc+shared
	x86_64-native-linuxapp-gcc+debug


OS: RHEL82-64
	Kernel Version: 4.18.0-193.el8.x86_64
	CPU info: Intel(R) Xeon(R) Platinum 8280M CPU @ 2.70GHz
	GCC Version: gcc (GCC) 8.3.1 20191121 (Red Hat 8.3.1-5)
	Clang Version: 8.0.1 (Red Hat 8.0.1-1.module_el8.1.0+215+a01033fb)
	x86_64-native-linuxapp-gcc


OS: UB1804-64
	Kernel Version: 4.15.0-29-generic
	CPU info: Intel(R) Xeon(R) Platinum 8180 CPU @ 2.50GHz
	GCC Version: gcc (Ubuntu 7.5.0-3ubuntu1~18.04) 7.5.0
	Clang Version: 6.0.0-1ubuntu2 (tags/RELEASE_600/final)
	x86_64-native-linuxapp-gcc


OS: FC32-64
	Kernel Version: 5.6.0-0.rc7.git0.2.fc32.x86_64
	CPU info: Intel(R) Xeon(R) Platinum 8280M CPU @ 2.70GHz
	GCC Version: gcc (GCC) 10.0.1 20200311 (Red Hat 10.0.1-0.9)
	Clang Version: 10.0.0 (Fedora 10.0.0-0.3.rc4.fc32)
	x86_64-native-linuxapp-gcc
	x86_64-native-linuxapp-clang


OS: CENTOS77-64
	Kernel Version: 3.10.0-1062.9.1.el7.x86_64
	CPU info: Intel(R) Xeon(R) Platinum 8280M CPU @ 2.70GHz
	GCC Version: gcc (GCC) 4.8.5 20150623 (Red Hat 4.8.5-39)
	Clang Version: 3.4.2 (tags/RELEASE_34/dot2-final)
	x86_64-native-linuxapp-gcc


OS: UB2004-64
	Kernel Version: 5.4.0-26-generic
	CPU info: Intel(R) Xeon(R) Platinum 8180 CPU @ 2.50GHz
	GCC Version: gcc (Ubuntu 10-20200416-0ubuntu1) 10.0.1 20200416 (experimental) [master revision 3c3f12e2a76:dcee354ce56:44b326839d864fc10c459916abcc97f35a9ac3de]
	Clang Version: 10.0.0-4ubuntu1
	x86_64-native-linuxapp-clang
	x86_64-native-linuxapp-gcc
	x86_64-native-linuxapp-icc


OS: UB2004-32
	Kernel Version: 5.4.0-26-generic
	CPU info: Intel(R) Xeon(R) Platinum 8180 CPU @ 2.50GHz
	GCC Version: gcc (Ubuntu 9.3.0-10ubuntu2) 9.3.0
	Clang Version: 10.0.0-4ubuntu1
	i686-native-linuxapp-gcc


OS: FreeBSD1201-64
	Kernel Version: 12.1-RELEASE
	CPU info: Intel(R) Xeon(R) CPU E5-2699 v3 @ 2.30GHz (2294.74-MHz K8-class CPU)
	GCC Version: gcc (FreeBSD Ports Collection) 9.2.0
	Clang Version: 8.0.1 (tags/RELEASE_801/final 366581) (based on LLVM 8.0.1)
	x86_64-native-bsdapp-gcc
	x86_64-native-bsdapp-clang
	x86_64-native-bsdapp-gcc+shared
	x86_64-native-bsdapp-gcc+debug


OS: SUSE15-64
	Kernel Version: 4.12.14-lp150.11-default
	CPU info: Intel(R) Xeon(R) CPU E5-2699 v4 @ 2.20GHz
	GCC Version: gcc (SUSE Linux) 7.3.1 20180323 [gcc-7-branch revision 258812]
	Clang Version: 5.0.1 (tags/RELEASE_501/final 312548)
	x86_64-native-linuxapp-clang
	x86_64-native-linuxapp-gcc

** Meson build **


OS: CENTOS82-64
	Kernel Version: 4.18.0-193.el8.x86_64
	CPU info: Intel(R) Xeon(R) CPU E5-2699 v4 @ 2.20GHz
	GCC Version: gcc (GCC) 8.3.1 20191121 (Red Hat 8.3.1-5)
	Clang Version: 9.0.1 (Red Hat 9.0.1-2.module_el8.2.0+309+0c7b6b03)
	./build-gcc-static
	./build-gcc-shared
	./build-clang-static
	./build-clang-shared
	./build-x86-default


OS: UB2004-64
	Kernel Version: 5.4.0-26-generic
	CPU info: Intel(R) Xeon(R) Platinum 8180 CPU @ 2.50GHz
	GCC Version: gcc (Ubuntu 9.3.0-10ubuntu2) 9.3.0
	Clang Version: 10.0.0-4ubuntu1
	x86_64-native-linuxapp-doc
	./build-gcc-static
	./build-gcc-shared
	./build-clang-static
	./build-clang-shared
	./build-x86-default


OS: FC32-64
	Kernel Version: 5.6.0-0.rc7.git0.2.fc32.x86_64
	CPU info: Intel(R) Xeon(R) CPU E5-2699 v4 @ 2.20GHz
	GCC Version: gcc (GCC) 10.0.1 20200311 (Red Hat 10.0.1-0.9)
	Clang Version: 10.0.0 (Fedora 10.0.0-0.3.rc4.fc32)
	./build-gcc-static
	./build-gcc-shared
	./build-clang-static
	./build-clang-shared
	./build-x86-default


OS: WIN10-64
	Kernel Version: N/A
	CPU info: N/A
	GCC Version: N/A
	Clang Version: Clang 8.0.0
	x86_64-windows-clang


OS: UB1804-32
	Kernel Version: 4.15.0-20-generic
	CPU info: Intel(R) Xeon(R) CPU E5-2699 v4 @ 2.20GHz
	GCC Version: gcc (Ubuntu 7.5.0-3ubuntu1~18.04) 7.5.0
	Clang Version: 6.0.0-1ubuntu2 (tags/RELEASE_600/final)
	./build-gcc-static
	./build-gcc-shared
	./build-clang-static
	./build-clang-shared
	./build-x86-default


OS: FreeBSD1201-64
	Kernel Version: 12.1-RELEASE
	CPU info: Intel(R) Xeon(R) CPU E5-2699 v4 @ 2.20GHz (2194.97-MHz K8-class CPU)
	GCC Version: gcc (FreeBSD Ports Collection) 9.2.0
	Clang Version: 8.0.1 (tags/RELEASE_801/final 366581) (based on LLVM 8.0.1)
	./build-gcc-static
	./build-gcc-shared
	./build-clang-static
	./build-clang-shared
	./build-x86-default


OS: SUSE15-64
	Kernel Version: 4.12.14-lp150.12.82-default
	CPU info: Intel(R) Xeon(R) CPU E5-2699 v4 @ 2.20GHz
	GCC Version: gcc (SUSE Linux) 7.4.1 20190905 [gcc-7-branch revision 275407]
	Clang Version: 5.0.1 (tags/RELEASE_501/final 312548)
	./build-gcc-static
	./build-gcc-shared
	./build-clang-static
	./build-clang-shared
	./build-x86-default



*Meson Build Failed #1:
OS: CENTOS82-64
Target:./build-gcc-static
FAILED: drivers/rte_common_cpt.pmd.c 
/root/CENTOS82-64_K4.18.0_GCC8.3.1/x86_64-native-linuxapp-gcc/84729f7edd0e404b9e08ff68c2644613/dpdk/buildtools/gen-pmdinfo-cfile.sh /root/CENTOS82-64_K4.18.0_GCC8.3.1/x86_64-native-linuxapp-gcc/84729f7edd0e404b9e08ff68c2644613/dpdk/build-gcc-static/drivers/libtmp_rte_common_cpt.a drivers/rte_common_cpt.pmd.c /usr/bin/python3 ../buildtools/pmdinfogen.py
Traceback (most recent call last):
  File "../buildtools/pmdinfogen.py", line 12, in <module>
    from elftools.elf.elffile import ELFFile
ModuleNotFoundError: No module named 'elftools'
Traceback (most recent call last):
  File "../buildtools/pmdinfogen.py", line 12, in <module>
    from elftools.elf.elffile import ELFFile
ModuleNotFoundError: No module named 'elftools'
[544/2365] Generating rte_common_octeontx.pmd.c with a custom command.
FAILED: drivers/rte_common_octeontx.pmd.c 
/root/CENTOS82-64_K4.18.0_GCC8.3.1/x86_64-native-linuxapp-gcc/84729f7edd0e404b9e08ff68c2644613/dpdk/buildtools/gen-pmdinfo-cfile.sh /root/CENTOS82-64_K4.18.0_GCC8.3.1/x86_64-native-linuxapp-gcc/84729f7edd0e404b9e08ff68c2644613/dpdk/build-gcc-static/drivers/libtmp_rte_common_octeontx.a drivers/rte_common_octeontx.pmd.c /usr/bin/python3 ../buildtools/pmdinfogen.py
Traceback (most recent call last):
  File "../buildtools/pmdinfogen.py", line 12, in <module>
    from elftools.elf.elffile import ELFFile
ModuleNotFoundError: No module named 'elftools'
[545/2365] Compiling C object 'lib/76b5a35@@rte_node at sta/librte_node_ip4_rewrite.c.o'.
[546/2365] Generating rte_common_dpaax.pmd.c with a custom command.
FAILED: drivers/rte_common_dpaax.pmd.c 
/root/CENTOS82-64_K4.18.0_GCC8.3.1/x86_64-native-linuxapp-gcc/84729f7edd0e404b9e08ff68c2644613/dpdk/buildtools/gen-pmdinfo-cfile.sh /root/CENTOS82-64_K4.18.0_GCC8.3.1/x86_64-native-linuxapp-gcc/84729f7edd0e404b9e08ff68c2644613/dpdk/build-gcc-static/drivers/libtmp_rte_common_dpaax.a drivers/rte_common_dpaax.pmd.c /usr/bin/python3 ../buildtools/pmdinfogen.py
Traceback (most recent call last):
  File "../buildtools/pmdinfogen.py", line 12, in <module>
    from elftools.elf.elffile import ELFFile
ModuleNotFoundError: No module named 'elftools'
Traceback (most recent call last):
  File "../buildtools/pmdinfogen.py", line 12, in <module>
    from elftools.elf.elffile import ELFFile
ModuleNotFoundError: No module named 'elftools'
Traceback (most recent call last):
  File "../buildtools/pmdinfogen.py", line 12, in <module>
    from elftools.elf.elffile import ELFFile
ModuleNotFoundError: No module named 'elftools'
[547/2365] Compiling C object 'drivers/a715181@@tmp_rte_common_iavf at sta/common_iavf_iavf_impl.c.o'.
[548/2365] Compiling C object 'drivers/a715181@@tmp_rte_common_iavf at sta/common_iavf_iavf_common.c.o'.
[549/2365] Generating graph.sym_chk with a meson_exe.py custom command.
[550/2365] Compiling C object 'drivers/a715181@@tmp_rte_common_octeontx2 at sta/common_octeontx2_otx2_sec_idev.c.o'.
[551/2365] Compiling C object 'drivers/a715181@@tmp_rte_common_iavf at sta/common_iavf_iavf_adminq.c.o'.
[552/2365] Compiling C object 'drivers/a715181@@tmp_rte_common_octeontx2 at sta/common_octeontx2_otx2_dev.c.o'.
[553/2365] Generating vhost.sym_chk with a meson_exe.py custom command.
[554/2365] Compiling C object 'lib/76b5a35@@rte_pipeline at sta/librte_pipeline_rte_table_action.c.o'.
ninja: build stopped: subcommand failed




*Meson Build Failed #2:
OS: FC32-64
Target:./build-gcc-static
FAILED: drivers/rte_common_octeontx.pmd.c 
/root/FC32-64_K5.6.0_GCC10.0.1/x86_64-native-linuxapp-gcc/84729f7edd0e404b9e08ff68c2644613/dpdk/buildtools/gen-pmdinfo-cfile.sh /root/FC32-64_K5.6.0_GCC10.0.1/x86_64-native-linuxapp-gcc/84729f7edd0e404b9e08ff68c2644613/dpdk/build-gcc-static/drivers/libtmp_rte_common_octeontx.a drivers/rte_common_octeontx.pmd.c /usr/bin/python3 ../buildtools/pmdinfogen.py
Traceback (most recent call last):
  File "../buildtools/pmdinfogen.py", line 12, in <module>
    from elftools.elf.elffile import ELFFile
ModuleNotFoundError: No module named 'elftools'
[541/2366] Generating rte_common_cpt.pmd.c with a custom command.
FAILED: drivers/rte_common_cpt.pmd.c 
/root/FC32-64_K5.6.0_GCC10.0.1/x86_64-native-linuxapp-gcc/84729f7edd0e404b9e08ff68c2644613/dpdk/buildtools/gen-pmdinfo-cfile.sh /root/FC32-64_K5.6.0_GCC10.0.1/x86_64-native-linuxapp-gcc/84729f7edd0e404b9e08ff68c2644613/dpdk/build-gcc-static/drivers/libtmp_rte_common_cpt.a drivers/rte_common_cpt.pmd.c /usr/bin/python3 ../buildtools/pmdinfogen.py
Traceback (most recent call last):
  File "../buildtools/pmdinfogen.py", line 12, in <module>
    from elftools.elf.elffile import ELFFile
ModuleNotFoundError: No module named 'elftools'
Traceback (most recent call last):
  File "../buildtools/pmdinfogen.py", line 12, in <module>
    from elftools.elf.elffile import ELFFile
ModuleNotFoundError: No module named 'elftools'
[542/2366] Compiling C object 'drivers/a715181@@tmp_rte_common_iavf at sta/common_iavf_iavf_impl.c.o'.
[543/2366] Generating graph.sym_chk with a meson_exe.py custom command.
[544/2366] Generating rte_common_dpaax.pmd.c with a custom command.
FAILED: drivers/rte_common_dpaax.pmd.c 
/root/FC32-64_K5.6.0_GCC10.0.1/x86_64-native-linuxapp-gcc/84729f7edd0e404b9e08ff68c2644613/dpdk/buildtools/gen-pmdinfo-cfile.sh /root/FC32-64_K5.6.0_GCC10.0.1/x86_64-native-linuxapp-gcc/84729f7edd0e404b9e08ff68c2644613/dpdk/build-gcc-static/drivers/libtmp_rte_common_dpaax.a drivers/rte_common_dpaax.pmd.c /usr/bin/python3 ../buildtools/pmdinfogen.py
Traceback (most recent call last):
  File "../buildtools/pmdinfogen.py", line 12, in <module>
    from elftools.elf.elffile import ELFFile
ModuleNotFoundError: No module named 'elftools'
Traceback (most recent call last):
  File "../buildtools/pmdinfogen.py", line 12, in <module>
    from elftools.elf.elffile import ELFFile
ModuleNotFoundError: No module named 'elftools'
Traceback (most recent call last):
  File "../buildtools/pmdinfogen.py", line 12, in <module>
    from elftools.elf.elffile import ELFFile
ModuleNotFoundError: No module named 'elftools'
[545/2366] Compiling C object 'drivers/a715181@@tmp_rte_common_iavf at sta/common_iavf_iavf_common.c.o'.
[546/2366] Compiling C object 'lib/76b5a35@@rte_node at sta/librte_node_ip4_rewrite.c.o'.
[547/2366] Compiling C object 'drivers/a715181@@tmp_rte_common_octeontx2 at sta/common_octeontx2_otx2_sec_idev.c.o'.
[548/2366] Compiling C object 'drivers/a715181@@tmp_rte_common_iavf at sta/common_iavf_iavf_adminq.c.o'.
[549/2366] Generating vhost.sym_chk with a meson_exe.py custom command.
[550/2366] Compiling C object 'drivers/a715181@@tmp_rte_common_octeontx2 at sta/common_octeontx2_otx2_dev.c.o'.
[551/2366] Compiling C object 'lib/76b5a35@@rte_pipeline at sta/librte_pipeline_rte_table_action.c.o'.
ninja: build stopped: subcommand failed




*Meson Build Failed #3:
OS: FreeBSD1201-64
Target:./build-gcc-static
FAILED: drivers/rte_common_octeontx.pmd.c 
/root/FreeBSD1201-64_K12.1_GCC9.2.0/x86_64-native-bsdapp-gcc/84729f7edd0e404b9e08ff68c2644613/dpdk/buildtools/gen-pmdinfo-cfile.sh /root/FreeBSD1201-64_K12.1_GCC9.2.0/x86_64-native-bsdapp-gcc/84729f7edd0e404b9e08ff68c2644613/dpdk/build-gcc-static/drivers/libtmp_rte_common_octeontx.a drivers/rte_common_octeontx.pmd.c /usr/local/bin/python3 ../buildtools/pmdinfogen.py
Traceback (most recent call last):
  File "../buildtools/pmdinfogen.py", line 12, in <module>
    from elftools.elf.elffile import ELFFile
ModuleNotFoundError: No module named 'elftools'
[492/1752] Generating rte_common_cpt.pmd.c with a custom command
FAILED: drivers/rte_common_cpt.pmd.c 
/root/FreeBSD1201-64_K12.1_GCC9.2.0/x86_64-native-bsdapp-gcc/84729f7edd0e404b9e08ff68c2644613/dpdk/buildtools/gen-pmdinfo-cfile.sh /root/FreeBSD1201-64_K12.1_GCC9.2.0/x86_64-native-bsdapp-gcc/84729f7edd0e404b9e08ff68c2644613/dpdk/build-gcc-static/drivers/libtmp_rte_common_cpt.a drivers/rte_common_cpt.pmd.c /usr/local/bin/python3 ../buildtools/pmdinfogen.py
Traceback (most recent call last):
  File "../buildtools/pmdinfogen.py", line 12, in <module>
    from elftools.elf.elffile import ELFFile
ModuleNotFoundError: No module named 'elftools'
Traceback (most recent call last):
  File "../buildtools/pmdinfogen.py", line 12, in <module>
    from elftools.elf.elffile import ELFFile
ModuleNotFoundError: No module named 'elftools'
[493/1752] Compiling C object 'drivers/a715181@@tmp_rte_common_iavf at sta/common_iavf_iavf_impl.c.o'
[494/1752] Generating bpf.sym_chk with a meson_exe.py custom command
[495/1752] Compiling C object 'drivers/a715181@@tmp_rte_common_iavf at sta/common_iavf_iavf_common.c.o'
[496/1752] Compiling C object 'lib/76b5a35@@rte_node at sta/librte_node_ip4_rewrite.c.o'
[497/1752] Generating graph.sym_chk with a meson_exe.py custom command
[498/1752] Compiling C object 'drivers/a715181@@tmp_rte_common_iavf at sta/common_iavf_iavf_adminq.c.o'
[499/1752] Compiling C object 'drivers/a715181@@tmp_rte_common_octeontx2 at sta/common_octeontx2_otx2_dev.c.o'
[500/1752] Compiling C object 'lib/76b5a35@@rte_pipeline at sta/librte_pipeline_rte_table_action.c.o'
ninja: build stopped: subcommand failed




*Meson Build Failed #4:
OS: SUSE15-64
Target:./build-gcc-static
FAILED: drivers/rte_common_cpt.pmd.c 
/root/SUSE15-64_K4.12.14_GCC7.3.1/x86_64-native-linuxapp-gcc/84729f7edd0e404b9e08ff68c2644613/dpdk/buildtools/gen-pmdinfo-cfile.sh /root/SUSE15-64_K4.12.14_GCC7.3.1/x86_64-native-linuxapp-gcc/84729f7edd0e404b9e08ff68c2644613/dpdk/build-gcc-static/drivers/libtmp_rte_common_cpt.a drivers/rte_common_cpt.pmd.c /usr/bin/python3 ../buildtools/pmdinfogen.py
Traceback (most recent call last):
  File "../buildtools/pmdinfogen.py", line 12, in <module>
    from elftools.elf.elffile import ELFFile
ModuleNotFoundError: No module named 'elftools'
Traceback (most recent call last):
  File "../buildtools/pmdinfogen.py", line 12, in <module>
    from elftools.elf.elffile import ELFFile
ModuleNotFoundError: No module named 'elftools'
[547/2260] Compiling C object 'drivers/a715181@@tmp_rte_common_iavf at sta/common_iavf_iavf_impl.c.o'.
[548/2260] Generating rte_common_octeontx.pmd.c with a custom command.
FAILED: drivers/rte_common_octeontx.pmd.c 
/root/SUSE15-64_K4.12.14_GCC7.3.1/x86_64-native-linuxapp-gcc/84729f7edd0e404b9e08ff68c2644613/dpdk/buildtools/gen-pmdinfo-cfile.sh /root/SUSE15-64_K4.12.14_GCC7.3.1/x86_64-native-linuxapp-gcc/84729f7edd0e404b9e08ff68c2644613/dpdk/build-gcc-static/drivers/libtmp_rte_common_octeontx.a drivers/rte_common_octeontx.pmd.c /usr/bin/python3 ../buildtools/pmdinfogen.py
Traceback (most recent call last):
  File "../buildtools/pmdinfogen.py", line 12, in <module>
    from elftools.elf.elffile import ELFFile
ModuleNotFoundError: No module named 'elftools'
[549/2260] Compiling C object 'drivers/a715181@@tmp_rte_common_iavf at sta/common_iavf_iavf_common.c.o'.
[550/2260] Generating rte_common_dpaax.pmd.c with a custom command.
FAILED: drivers/rte_common_dpaax.pmd.c 
/root/SUSE15-64_K4.12.14_GCC7.3.1/x86_64-native-linuxapp-gcc/84729f7edd0e404b9e08ff68c2644613/dpdk/buildtools/gen-pmdinfo-cfile.sh /root/SUSE15-64_K4.12.14_GCC7.3.1/x86_64-native-linuxapp-gcc/84729f7edd0e404b9e08ff68c2644613/dpdk/build-gcc-static/drivers/libtmp_rte_common_dpaax.a drivers/rte_common_dpaax.pmd.c /usr/bin/python3 ../buildtools/pmdinfogen.py
Traceback (most recent call last):
  File "../buildtools/pmdinfogen.py", line 12, in <module>
    from elftools.elf.elffile import ELFFile
ModuleNotFoundError: No module named 'elftools'
Traceback (most recent call last):
  File "../buildtools/pmdinfogen.py", line 12, in <module>
    from elftools.elf.elffile import ELFFile
ModuleNotFoundError: No module named 'elftools'
Traceback (most recent call last):
  File "../buildtools/pmdinfogen.py", line 12, in <module>
    from elftools.elf.elffile import ELFFile
ModuleNotFoundError: No module named 'elftools'
[551/2260] Generating graph.sym_chk with a meson_exe.py custom command.
[552/2260] Compiling C object 'drivers/a715181@@tmp_rte_common_iavf at sta/common_iavf_iavf_adminq.c.o'.
[553/2260] Generating node.sym_chk with a meson_exe.py custom command.
[554/2260] Compiling C object 'drivers/a715181@@tmp_rte_common_octeontx2 at sta/common_octeontx2_otx2_dev.c.o'.
[555/2260] Compiling C object 'lib/76b5a35@@rte_pipeline at sta/librte_pipeline_rte_table_action.c.o'.
ninja: build stopped: subcommand failed




*Meson Build Failed #5:
OS: UB1804-32
Target:./build-gcc-static
FAILED: drivers/rte_pmd_enetc.pmd.c 
/root/UB1804-32_K4.15.0_GCC7.3.0/i686-native-linuxapp-gcc/84729f7edd0e404b9e08ff68c2644613/dpdk/buildtools/gen-pmdinfo-cfile.sh /root/UB1804-32_K4.15.0_GCC7.3.0/i686-native-linuxapp-gcc/84729f7edd0e404b9e08ff68c2644613/dpdk/build-gcc-static/drivers/libtmp_rte_pmd_enetc.a drivers/rte_pmd_enetc.pmd.c /usr/bin/python3 ../buildtools/pmdinfogen.py
Traceback (most recent call last):
  File "../buildtools/pmdinfogen.py", line 12, in <module>
    from elftools.elf.elffile import ELFFile
ModuleNotFoundError: No module named 'elftools'
Traceback (most recent call last):
  File "../buildtools/pmdinfogen.py", line 12, in <module>
    from elftools.elf.elffile import ELFFile
ModuleNotFoundError: No module named 'elftools'
[515/2106] Generating rte_common_cpt_def with a custom command.
[516/2106] Generating rte_common_cpt_mingw with a custom command.
[517/2106] Generating graph.sym_chk with a meson_exe.py custom command.
[518/2106] Compiling C object 'lib/76b5a35@@rte_node at sta/librte_node_ethdev_ctrl.c.o'.
[519/2106] Compiling C object 'drivers/a715181@@tmp_rte_common_dpaax at sta/common_dpaax_dpaa_of.c.o'.
[520/2106] Compiling C object 'drivers/a715181@@tmp_rte_common_cpt at sta/common_cpt_cpt_pmd_ops_helper.c.o'.
[521/2106] Generating vhost.sym_chk with a meson_exe.py custom command.
[522/2106] Compiling C object 'lib/76b5a35@@rte_node at sta/librte_node_ip4_lookup.c.o'.
[523/2106] Compiling C object 'drivers/a715181@@tmp_rte_common_cpt at sta/common_cpt_cpt_fpm_tables.c.o'.
[524/2106] Compiling C object 'lib/76b5a35@@rte_node at sta/librte_node_ip4_rewrite.c.o'.
[525/2106] Compiling C object 'lib/76b5a35@@rte_pipeline at sta/librte_pipeline_rte_table_action.c.o'.
ninja: build stopped: subcommand failed




*Meson Build Failed #6:
OS: UB2004-64
Target:./build-gcc-static
FAILED: drivers/rte_common_octeontx.pmd.c 
/root/UB2004-64_K5.4.0_GCC9.3.0/x86_64-native-linuxapp-gcc/84729f7edd0e404b9e08ff68c2644613/dpdk/buildtools/gen-pmdinfo-cfile.sh /root/UB2004-64_K5.4.0_GCC9.3.0/x86_64-native-linuxapp-gcc/84729f7edd0e404b9e08ff68c2644613/dpdk/build-gcc-static/drivers/libtmp_rte_common_octeontx.a drivers/rte_common_octeontx.pmd.c /usr/bin/python3 ../buildtools/pmdinfogen.py
Traceback (most recent call last):
  File "../buildtools/pmdinfogen.py", line 12, in <module>
    from elftools.elf.elffile import ELFFile
ModuleNotFoundError: No module named 'elftools'
[547/2356] Generating rte_common_cpt.pmd.c with a custom command.
FAILED: drivers/rte_common_cpt.pmd.c 
/root/UB2004-64_K5.4.0_GCC9.3.0/x86_64-native-linuxapp-gcc/84729f7edd0e404b9e08ff68c2644613/dpdk/buildtools/gen-pmdinfo-cfile.sh /root/UB2004-64_K5.4.0_GCC9.3.0/x86_64-native-linuxapp-gcc/84729f7edd0e404b9e08ff68c2644613/dpdk/build-gcc-static/drivers/libtmp_rte_common_cpt.a drivers/rte_common_cpt.pmd.c /usr/bin/python3 ../buildtools/pmdinfogen.py
Traceback (most recent call last):
  File "../buildtools/pmdinfogen.py", line 12, in <module>
    from elftools.elf.elffile import ELFFile
ModuleNotFoundError: No module named 'elftools'
Traceback (most recent call last):
  File "../buildtools/pmdinfogen.py", line 12, in <module>
    from elftools.elf.elffile import ELFFile
ModuleNotFoundError: No module named 'elftools'
[548/2356] Compiling C object 'drivers/a715181@@tmp_rte_common_iavf at sta/common_iavf_iavf_common.c.o'.
[549/2356] Compiling C object 'drivers/a715181@@tmp_rte_common_octeontx2 at sta/common_octeontx2_otx2_irq.c.o'.
[550/2356] Generating graph.sym_chk with a meson_exe.py custom command.
[551/2356] Generating symbol file 'lib/76b5a35@@rte_vhost at sha/librte_vhost.so.20.0.3.symbols'.
[552/2356] Compiling C object 'lib/76b5a35@@rte_node at sta/librte_node_ip4_rewrite.c.o'.
[553/2356] Generating rte_common_dpaax.pmd.c with a custom command.
FAILED: drivers/rte_common_dpaax.pmd.c 
/root/UB2004-64_K5.4.0_GCC9.3.0/x86_64-native-linuxapp-gcc/84729f7edd0e404b9e08ff68c2644613/dpdk/buildtools/gen-pmdinfo-cfile.sh /root/UB2004-64_K5.4.0_GCC9.3.0/x86_64-native-linuxapp-gcc/84729f7edd0e404b9e08ff68c2644613/dpdk/build-gcc-static/drivers/libtmp_rte_common_dpaax.a drivers/rte_common_dpaax.pmd.c /usr/bin/python3 ../buildtools/pmdinfogen.py
Traceback (most recent call last):
  File "../buildtools/pmdinfogen.py", line 12, in <module>
    from elftools.elf.elffile import ELFFile
ModuleNotFoundError: No module named 'elftools'
Traceback (most recent call last):
  File "../buildtools/pmdinfogen.py", line 12, in <module>
    from elftools.elf.elffile import ELFFile
ModuleNotFoundError: No module named 'elftools'
Traceback (most recent call last):
  File "../buildtools/pmdinfogen.py", line 12, in <module>
    from elftools.elf.elffile import ELFFile
ModuleNotFoundError: No module named 'elftools'
[554/2356] Compiling C object 'drivers/a715181@@tmp_rte_common_iavf at sta/common_iavf_iavf_adminq.c.o'.
[555/2356] Compiling C object 'drivers/a715181@@tmp_rte_common_octeontx2 at sta/common_octeontx2_otx2_sec_idev.c.o'.
[556/2356] Compiling C object 'drivers/a715181@@tmp_rte_common_octeontx2 at sta/common_octeontx2_otx2_dev.c.o'.
[557/2356] Compiling C object 'lib/76b5a35@@rte_pipeline at sta/librte_pipeline_rte_table_action.c.o'.
ninja: build stopped: subcommand failed



*Makefile Build Failed #1:
OS: CENTOS77-64
Target: x86_64-native-linuxapp-gcc
Traceback (most recent call last):
  File "/root/CENTOS77-64_K3.10.0_GCC4.8.5/x86_64-native-linuxapp-gcc/84729f7edd0e404b9e08ff68c2644613/dpdk/buildtools/pmdinfogen.py", line 12, in <module>
    from elftools.elf.elffile import ELFFile
ModuleNotFoundError: No module named 'elftools'
Traceback (most recent call last):
  File "/root/CENTOS77-64_K3.10.0_GCC4.8.5/x86_64-native-linuxapp-gcc/84729f7edd0e404b9e08ff68c2644613/dpdk/buildtools/pmdinfogen.py", line 12, in <module>
    from elftools.elf.elffile import ELFFile
ModuleNotFoundError: No module named 'elftools'
Traceback (most recent call last):
  File "/root/CENTOS77-64_K3.10.0_GCC4.8.5/x86_64-native-linuxapp-gcc/84729f7edd0e404b9e08ff68c2644613/dpdk/buildtools/pmdinfogen.py", line 12, in <module>
    from elftools.elf.elffile import ELFFile
ModuleNotFoundError: No module named 'elftools'
make[6]: *** [portal/dpaa2_hw_dpio.o] Error 1
make[6]: *** Waiting for unfinished jobs....
make[6]: *** [portal/dpaa2_hw_dpbp.o] Error 1
make[6]: *** [portal/dpaa2_hw_dpci.o] Error 1
make[5]: *** [fslmc] Error 2
make[4]: *** [bus] Error 2
make[3]: *** [drivers] Error 2
make[2]: *** [all] Error 2
make[1]: *** [pre_install] Error 2
make: *** [install] Error 2


*Makefile Build Failed #2:
OS: CENTOS82-64
Target: x86_64-native-linuxapp-gcc
Traceback (most recent call last):
  File "/root/CENTOS82-64_K4.18.0_GCC8.3.1/x86_64-native-linuxapp-gcc/84729f7edd0e404b9e08ff68c2644613/dpdk/buildtools/pmdinfogen.py", line 12, in <module>
    from elftools.elf.elffile import ELFFile
ModuleNotFoundError: No module named 'elftools'
make[6]: *** [/root/CENTOS82-64_K4.18.0_GCC8.3.1/x86_64-native-linuxapp-gcc/84729f7edd0e404b9e08ff68c2644613/dpdk/mk/internal/rte.compile-pre.mk:116: portal/dpaa2_hw_dpio.o] Error 1
make[6]: *** Waiting for unfinished jobs....
  CC base/qbman/qman_driver.o
Traceback (most recent call last):
  File "/root/CENTOS82-64_K4.18.0_GCC8.3.1/x86_64-native-linuxapp-gcc/84729f7edd0e404b9e08ff68c2644613/dpdk/buildtools/pmdinfogen.py", line 12, in <module>
    from elftools.elf.elffile import ELFFile
ModuleNotFoundError: No module named 'elftools'
make[6]: *** [/root/CENTOS82-64_K4.18.0_GCC8.3.1/x86_64-native-linuxapp-gcc/84729f7edd0e404b9e08ff68c2644613/dpdk/mk/internal/rte.compile-pre.mk:116: portal/dpaa2_hw_dpbp.o] Error 1
  CC base/qbman/dpaa_alloc.o
  PMDINFO portal/dpaa2_hw_dpci.o.pmd.c
  CC base/qbman/dpaa_sys.o
Traceback (most recent call last):
  File "/root/CENTOS82-64_K4.18.0_GCC8.3.1/x86_64-native-linuxapp-gcc/84729f7edd0e404b9e08ff68c2644613/dpdk/buildtools/pmdinfogen.py", line 12, in <module>
    from elftools.elf.elffile import ELFFile
ModuleNotFoundError: No module named 'elftools'
make[6]: *** [/root/CENTOS82-64_K4.18.0_GCC8.3.1/x86_64-native-linuxapp-gcc/84729f7edd0e404b9e08ff68c2644613/dpdk/mk/internal/rte.compile-pre.mk:114: portal/dpaa2_hw_dpci.o] Error 1
make[5]: *** [/root/CENTOS82-64_K4.18.0_GCC8.3.1/x86_64-native-linuxapp-gcc/84729f7edd0e404b9e08ff68c2644613/dpdk/mk/rte.subdir.mk:35: fslmc] Error 2
make[5]: *** Waiting for unfinished jobs....
  AR librte_bus_dpaa.a
  INSTALL-LIB librte_bus_dpaa.a
make[6]: warning:  Clock skew detected.  Your build may be incomplete.
make[4]: *** [/root/CENTOS82-64_K4.18.0_GCC8.3.1/x86_64-native-linuxapp-gcc/84729f7edd0e404b9e08ff68c2644613/dpdk/mk/rte.subdir.mk:37: bus] Error 2
make[3]: *** [/root/CENTOS82-64_K4.18.0_GCC8.3.1/x86_64-native-linuxapp-gcc/84729f7edd0e404b9e08ff68c2644613/dpdk/mk/rte.sdkbuild.mk:51: drivers] Error 2
make[2]: *** [/root/CENTOS82-64_K4.18.0_GCC8.3.1/x86_64-native-linuxapp-gcc/84729f7edd0e404b9e08ff68c2644613/dpdk/mk/rte.sdkroot.mk:115: all] Error 2
make[1]: *** [/root/CENTOS82-64_K4.18.0_GCC8.3.1/x86_64-native-linuxapp-gcc/84729f7edd0e404b9e08ff68c2644613/dpdk/mk/rte.sdkinstall.mk:61: pre_install] Error 2
make: *** [/root/CENTOS82-64_K4.18.0_GCC8.3.1/x86_64-native-linuxapp-gcc/84729f7edd0e404b9e08ff68c2644613/dpdk/mk/rte.sdkroot.mk:92: install] Error 2


*Makefile Build Failed #3:
OS: CENTOS82-64
Target: x86_64-native-linuxapp-clang
Traceback (most recent call last):
  File "/root/CENTOS82-64_K4.18.0_Clang7.0.1/x86_64-native-linuxapp-clang/84729f7edd0e404b9e08ff68c2644613/dpdk/buildtools/pmdinfogen.py", line 12, in <module>
    from elftools.elf.elffile import ELFFile
ModuleNotFoundError: No module named 'elftools'
make[6]: *** [/root/CENTOS82-64_K4.18.0_Clang7.0.1/x86_64-native-linuxapp-clang/84729f7edd0e404b9e08ff68c2644613/dpdk/mk/internal/rte.compile-pre.mk:114: portal/dpaa2_hw_dpbp.o] Error 1
make[6]: *** Waiting for unfinished jobs....
  CC base/qbman/bman_driver.o
  CC base/qbman/qman.o
Traceback (most recent call last):
  File "/root/CENTOS82-64_K4.18.0_Clang7.0.1/x86_64-native-linuxapp-clang/84729f7edd0e404b9e08ff68c2644613/dpdk/buildtools/pmdinfogen.py", line 12, in <module>
    from elftools.elf.elffile import ELFFile
ModuleNotFoundError: No module named 'elftools'
  PMDINFO portal/dpaa2_hw_dpci.o.pmd.c
make[6]: *** [/root/CENTOS82-64_K4.18.0_Clang7.0.1/x86_64-native-linuxapp-clang/84729f7edd0e404b9e08ff68c2644613/dpdk/mk/internal/rte.compile-pre.mk:114: portal/dpaa2_hw_dpio.o] Error 1
  CC base/qbman/qman_driver.o
  CC base/qbman/dpaa_alloc.o
Traceback (most recent call last):
  File "/root/CENTOS82-64_K4.18.0_Clang7.0.1/x86_64-native-linuxapp-clang/84729f7edd0e404b9e08ff68c2644613/dpdk/buildtools/pmdinfogen.py", line 12, in <module>
    from elftools.elf.elffile import ELFFile
ModuleNotFoundError: No module named 'elftools'
make[6]: *** [/root/CENTOS82-64_K4.18.0_Clang7.0.1/x86_64-native-linuxapp-clang/84729f7edd0e404b9e08ff68c2644613/dpdk/mk/internal/rte.compile-pre.mk:114: portal/dpaa2_hw_dpci.o] Error 1
  CC base/qbman/dpaa_sys.o
make[5]: *** [/root/CENTOS82-64_K4.18.0_Clang7.0.1/x86_64-native-linuxapp-clang/84729f7edd0e404b9e08ff68c2644613/dpdk/mk/rte.subdir.mk:35: fslmc] Error 2
make[5]: *** Waiting for unfinished jobs....
  AR librte_bus_dpaa.a
  INSTALL-LIB librte_bus_dpaa.a
make[6]: warning:  Clock skew detected.  Your build may be incomplete.
make[4]: *** [/root/CENTOS82-64_K4.18.0_Clang7.0.1/x86_64-native-linuxapp-clang/84729f7edd0e404b9e08ff68c2644613/dpdk/mk/rte.subdir.mk:37: bus] Error 2
make[3]: *** [/root/CENTOS82-64_K4.18.0_Clang7.0.1/x86_64-native-linuxapp-clang/84729f7edd0e404b9e08ff68c2644613/dpdk/mk/rte.sdkbuild.mk:51: drivers] Error 2
make[2]: *** [/root/CENTOS82-64_K4.18.0_Clang7.0.1/x86_64-native-linuxapp-clang/84729f7edd0e404b9e08ff68c2644613/dpdk/mk/rte.sdkroot.mk:115: all] Error 2
make[1]: *** [/root/CENTOS82-64_K4.18.0_Clang7.0.1/x86_64-native-linuxapp-clang/84729f7edd0e404b9e08ff68c2644613/dpdk/mk/rte.sdkinstall.mk:61: pre_install] Error 2
make: *** [/root/CENTOS82-64_K4.18.0_Clang7.0.1/x86_64-native-linuxapp-clang/84729f7edd0e404b9e08ff68c2644613/dpdk/mk/rte.sdkroot.mk:92: install] Error 2


*Makefile Build Failed #4:
OS: CENTOS82-64
Target: x86_64-native-linuxapp-icc
Traceback (most recent call last):
  File "/root/CENTOS82-64_K4.18.0_ICC19.1.1/x86_64-native-linuxapp-icc/84729f7edd0e404b9e08ff68c2644613/dpdk/buildtools/pmdinfogen.py", line 12, in <module>
    from elftools.elf.elffile import ELFFile
ModuleNotFoundError: No module named 'elftools'
make[6]: *** [/root/CENTOS82-64_K4.18.0_ICC19.1.1/x86_64-native-linuxapp-icc/84729f7edd0e404b9e08ff68c2644613/dpdk/mk/internal/rte.compile-pre.mk:114: portal/dpaa2_hw_dpio.o] Error 1
make[6]: *** Waiting for unfinished jobs....
Traceback (most recent call last):
  File "/root/CENTOS82-64_K4.18.0_ICC19.1.1/x86_64-native-linuxapp-icc/84729f7edd0e404b9e08ff68c2644613/dpdk/buildtools/pmdinfogen.py", line 12, in <module>
    from elftools.elf.elffile import ELFFile
ModuleNotFoundError: No module named 'elftools'
make[6]: *** [/root/CENTOS82-64_K4.18.0_ICC19.1.1/x86_64-native-linuxapp-icc/84729f7edd0e404b9e08ff68c2644613/dpdk/mk/internal/rte.compile-pre.mk:114: portal/dpaa2_hw_dpbp.o] Error 1
Traceback (most recent call last):
  File "/root/CENTOS82-64_K4.18.0_ICC19.1.1/x86_64-native-linuxapp-icc/84729f7edd0e404b9e08ff68c2644613/dpdk/buildtools/pmdinfogen.py", line 12, in <module>
    from elftools.elf.elffile import ELFFile
ModuleNotFoundError: No module named 'elftools'
make[6]: *** [/root/CENTOS82-64_K4.18.0_ICC19.1.1/x86_64-native-linuxapp-icc/84729f7edd0e404b9e08ff68c2644613/dpdk/mk/internal/rte.compile-pre.mk:114: portal/dpaa2_hw_dpci.o] Error 1
  AR librte_bus_dpaa.a
  INSTALL-LIB librte_bus_dpaa.a
make[6]: warning:  Clock skew detected.  Your build may be incomplete.
make[5]: *** [/root/CENTOS82-64_K4.18.0_ICC19.1.1/x86_64-native-linuxapp-icc/84729f7edd0e404b9e08ff68c2644613/dpdk/mk/rte.subdir.mk:35: fslmc] Error 2
make[4]: *** [/root/CENTOS82-64_K4.18.0_ICC19.1.1/x86_64-native-linuxapp-icc/84729f7edd0e404b9e08ff68c2644613/dpdk/mk/rte.subdir.mk:37: bus] Error 2
make[3]: *** [/root/CENTOS82-64_K4.18.0_ICC19.1.1/x86_64-native-linuxapp-icc/84729f7edd0e404b9e08ff68c2644613/dpdk/mk/rte.sdkbuild.mk:51: drivers] Error 2
make[2]: *** [/root/CENTOS82-64_K4.18.0_ICC19.1.1/x86_64-native-linuxapp-icc/84729f7edd0e404b9e08ff68c2644613/dpdk/mk/rte.sdkroot.mk:115: all] Error 2
make[1]: *** [/root/CENTOS82-64_K4.18.0_ICC19.1.1/x86_64-native-linuxapp-icc/84729f7edd0e404b9e08ff68c2644613/dpdk/mk/rte.sdkinstall.mk:61: pre_install] Error 2
make: *** [/root/CENTOS82-64_K4.18.0_ICC19.1.1/x86_64-native-linuxapp-icc/84729f7edd0e404b9e08ff68c2644613/dpdk/mk/rte.sdkroot.mk:92: install] Error 2


*Makefile Build Failed #5:
OS: CENTOS82-64
Target: x86_64-native-linuxapp-gcc+shared
Traceback (most recent call last):
  File "/root/CENTOS82-64_K4.18.0_GCC8.3.1/x86_64-native-linuxapp-gcc+shared/84729f7edd0e404b9e08ff68c2644613/dpdk/buildtools/pmdinfogen.py", line 12, in <module>
    from elftools.elf.elffile import ELFFile
ModuleNotFoundError: No module named 'elftools'
Traceback (most recent call last):
  File "/root/CENTOS82-64_K4.18.0_GCC8.3.1/x86_64-native-linuxapp-gcc+shared/84729f7edd0e404b9e08ff68c2644613/dpdk/buildtools/pmdinfogen.py", line 12, in <module>
    from elftools.elf.elffile import ELFFile
ModuleNotFoundError: No module named 'elftools'
make[6]: *** [/root/CENTOS82-64_K4.18.0_GCC8.3.1/x86_64-native-linuxapp-gcc+shared/84729f7edd0e404b9e08ff68c2644613/dpdk/mk/internal/rte.compile-pre.mk:116: portal/dpaa2_hw_dpio.o] Error 1
make[6]: *** Waiting for unfinished jobs....
make[6]: *** [/root/CENTOS82-64_K4.18.0_GCC8.3.1/x86_64-native-linuxapp-gcc+shared/84729f7edd0e404b9e08ff68c2644613/dpdk/mk/internal/rte.compile-pre.mk:116: portal/dpaa2_hw_dpbp.o] Error 1
  CC base/qbman/bman.o
  CC base/qbman/bman_driver.o
  CC base/qbman/qman.o
--
Traceback (most recent call last):
  File "/root/CENTOS82-64_K4.18.0_GCC8.3.1/x86_64-native-linuxapp-gcc+shared/84729f7edd0e404b9e08ff68c2644613/dpdk/buildtools/pmdinfogen.py", line 12, in <module>
    from elftools.elf.elffile import ELFFile
ModuleNotFoundError: No module named 'elftools'
make[6]: *** [/root/CENTOS82-64_K4.18.0_GCC8.3.1/x86_64-native-linuxapp-gcc+shared/84729f7edd0e404b9e08ff68c2644613/dpdk/mk/internal/rte.compile-pre.mk:114: portal/dpaa2_hw_dpci.o] Error 1
  CC base/qbman/qman_driver.o
make[6]: warning:  Clock skew detected.  Your build may be incomplete.
  CC base/qbman/dpaa_alloc.o
  CC base/qbman/dpaa_sys.o
make[5]: *** [/root/CENTOS82-64_K4.18.0_GCC8.3.1/x86_64-native-linuxapp-gcc+shared/84729f7edd0e404b9e08ff68c2644613/dpdk/mk/rte.subdir.mk:35: fslmc] Error 2
make[5]: *** Waiting for unfinished jobs....
  LD librte_bus_dpaa.so.20.0.3
  INSTALL-LIB librte_bus_dpaa.so.20.0.3
make[6]: warning:  Clock skew detected.  Your build may be incomplete.
make[4]: *** [/root/CENTOS82-64_K4.18.0_GCC8.3.1/x86_64-native-linuxapp-gcc+shared/84729f7edd0e404b9e08ff68c2644613/dpdk/mk/rte.subdir.mk:37: bus] Error 2
make[3]: *** [/root/CENTOS82-64_K4.18.0_GCC8.3.1/x86_64-native-linuxapp-gcc+shared/84729f7edd0e404b9e08ff68c2644613/dpdk/mk/rte.sdkbuild.mk:51: drivers] Error 2
make[2]: *** [/root/CENTOS82-64_K4.18.0_GCC8.3.1/x86_64-native-linuxapp-gcc+shared/84729f7edd0e404b9e08ff68c2644613/dpdk/mk/rte.sdkroot.mk:115: all] Error 2
make[1]: *** [/root/CENTOS82-64_K4.18.0_GCC8.3.1/x86_64-native-linuxapp-gcc+shared/84729f7edd0e404b9e08ff68c2644613/dpdk/mk/rte.sdkinstall.mk:61: pre_install] Error 2
make: *** [/root/CENTOS82-64_K4.18.0_GCC8.3.1/x86_64-native-linuxapp-gcc+shared/84729f7edd0e404b9e08ff68c2644613/dpdk/mk/rte.sdkroot.mk:92: install] Error 2


*Makefile Build Failed #6:
OS: CENTOS82-64
Target: x86_64-native-linuxapp-gcc+debug
Traceback (most recent call last):
  File "/root/CENTOS82-64_K4.18.0_GCC8.3.1/x86_64-native-linuxapp-gcc+debug/84729f7edd0e404b9e08ff68c2644613/dpdk/buildtools/pmdinfogen.py", line 12, in <module>
    from elftools.elf.elffile import ELFFile
ModuleNotFoundError: No module named 'elftools'
make[6]: *** [/root/CENTOS82-64_K4.18.0_GCC8.3.1/x86_64-native-linuxapp-gcc+debug/84729f7edd0e404b9e08ff68c2644613/dpdk/mk/internal/rte.compile-pre.mk:116: portal/dpaa2_hw_dpio.o] Error 1
make[6]: *** Waiting for unfinished jobs....
Traceback (most recent call last):
  File "/root/CENTOS82-64_K4.18.0_GCC8.3.1/x86_64-native-linuxapp-gcc+debug/84729f7edd0e404b9e08ff68c2644613/dpdk/buildtools/pmdinfogen.py", line 12, in <module>
    from elftools.elf.elffile import ELFFile
ModuleNotFoundError: No module named 'elftools'
  LD [M]  /root/CENTOS82-64_K4.18.0_GCC8.3.1/x86_64-native-linuxapp-gcc+debug/84729f7edd0e404b9e08ff68c2644613/dpdk/x86_64-native-linuxapp-gcc/build/kernel/linux/igb_uio/igb_uio.ko
make[6]: *** [/root/CENTOS82-64_K4.18.0_GCC8.3.1/x86_64-native-linuxapp-gcc+debug/84729f7edd0e404b9e08ff68c2644613/dpdk/mk/internal/rte.compile-pre.mk:116: portal/dpaa2_hw_dpbp.o] Error 1
INSTALL-MODULE igb_uio.ko
  PMDINFO portal/dpaa2_hw_dpci.o.pmd.c
Traceback (most recent call last):
  File "/root/CENTOS82-64_K4.18.0_GCC8.3.1/x86_64-native-linuxapp-gcc+debug/84729f7edd0e404b9e08ff68c2644613/dpdk/buildtools/pmdinfogen.py", line 12, in <module>
    from elftools.elf.elffile import ELFFile
ModuleNotFoundError: No module named 'elftools'
make[6]: *** [/root/CENTOS82-64_K4.18.0_GCC8.3.1/x86_64-native-linuxapp-gcc+debug/84729f7edd0e404b9e08ff68c2644613/dpdk/mk/internal/rte.compile-pre.mk:114: portal/dpaa2_hw_dpci.o] Error 1
  AR librte_bus_dpaa.a
  INSTALL-LIB librte_bus_dpaa.a
make[6]: warning:  Clock skew detected.  Your build may be incomplete.
make[5]: *** [/root/CENTOS82-64_K4.18.0_GCC8.3.1/x86_64-native-linuxapp-gcc+debug/84729f7edd0e404b9e08ff68c2644613/dpdk/mk/rte.subdir.mk:35: fslmc] Error 2
make[4]: *** [/root/CENTOS82-64_K4.18.0_GCC8.3.1/x86_64-native-linuxapp-gcc+debug/84729f7edd0e404b9e08ff68c2644613/dpdk/mk/rte.subdir.mk:37: bus] Error 2
make[3]: *** [/root/CENTOS82-64_K4.18.0_GCC8.3.1/x86_64-native-linuxapp-gcc+debug/84729f7edd0e404b9e08ff68c2644613/dpdk/mk/rte.sdkbuild.mk:51: drivers] Error 2
make[2]: *** [/root/CENTOS82-64_K4.18.0_GCC8.3.1/x86_64-native-linuxapp-gcc+debug/84729f7edd0e404b9e08ff68c2644613/dpdk/mk/rte.sdkroot.mk:115: all] Error 2
make[1]: *** [/root/CENTOS82-64_K4.18.0_GCC8.3.1/x86_64-native-linuxapp-gcc+debug/84729f7edd0e404b9e08ff68c2644613/dpdk/mk/rte.sdkinstall.mk:61: pre_install] Error 2
make: *** [/root/CENTOS82-64_K4.18.0_GCC8.3.1/x86_64-native-linuxapp-gcc+debug/84729f7edd0e404b9e08ff68c2644613/dpdk/mk/rte.sdkroot.mk:92: install] Error 2


*Makefile Build Failed #7:
OS: FC32-64
Target: x86_64-native-linuxapp-gcc
Traceback (most recent call last):
  File "/root/FC32-64_K5.6.0_GCC10.0.1/x86_64-native-linuxapp-gcc/84729f7edd0e404b9e08ff68c2644613/dpdk/buildtools/pmdinfogen.py", line 12, in <module>
    from elftools.elf.elffile import ELFFile
ModuleNotFoundError: No module named 'elftools'
make[6]: *** [/root/FC32-64_K5.6.0_GCC10.0.1/x86_64-native-linuxapp-gcc/84729f7edd0e404b9e08ff68c2644613/dpdk/mk/internal/rte.compile-pre.mk:114: portal/dpaa2_hw_dpbp.o] Error 1
make[6]: *** Waiting for unfinished jobs....
Traceback (most recent call last):
  File "/root/FC32-64_K5.6.0_GCC10.0.1/x86_64-native-linuxapp-gcc/84729f7edd0e404b9e08ff68c2644613/dpdk/buildtools/pmdinfogen.py", line 12, in <module>
    from elftools.elf.elffile import ELFFile
ModuleNotFoundError: No module named 'elftools'
Traceback (most recent call last):
  File "/root/FC32-64_K5.6.0_GCC10.0.1/x86_64-native-linuxapp-gcc/84729f7edd0e404b9e08ff68c2644613/dpdk/buildtools/pmdinfogen.py", line 12, in <module>
    from elftools.elf.elffile import ELFFile
ModuleNotFoundError: No module named 'elftools'
make[6]: *** [/root/FC32-64_K5.6.0_GCC10.0.1/x86_64-native-linuxapp-gcc/84729f7edd0e404b9e08ff68c2644613/dpdk/mk/internal/rte.compile-pre.mk:114: portal/dpaa2_hw_dpio.o] Error 1
make[6]: *** [/root/FC32-64_K5.6.0_GCC10.0.1/x86_64-native-linuxapp-gcc/84729f7edd0e404b9e08ff68c2644613/dpdk/mk/internal/rte.compile-pre.mk:114: portal/dpaa2_hw_dpci.o] Error 1
make[5]: *** [/root/FC32-64_K5.6.0_GCC10.0.1/x86_64-native-linuxapp-gcc/84729f7edd0e404b9e08ff68c2644613/dpdk/mk/rte.subdir.mk:35: fslmc] Error 2
make[4]: *** [/root/FC32-64_K5.6.0_GCC10.0.1/x86_64-native-linuxapp-gcc/84729f7edd0e404b9e08ff68c2644613/dpdk/mk/rte.subdir.mk:37: bus] Error 2
make[3]: *** [/root/FC32-64_K5.6.0_GCC10.0.1/x86_64-native-linuxapp-gcc/84729f7edd0e404b9e08ff68c2644613/dpdk/mk/rte.sdkbuild.mk:51: drivers] Error 2
make[2]: *** [/root/FC32-64_K5.6.0_GCC10.0.1/x86_64-native-linuxapp-gcc/84729f7edd0e404b9e08ff68c2644613/dpdk/mk/rte.sdkroot.mk:115: all] Error 2
make[1]: *** [/root/FC32-64_K5.6.0_GCC10.0.1/x86_64-native-linuxapp-gcc/84729f7edd0e404b9e08ff68c2644613/dpdk/mk/rte.sdkinstall.mk:61: pre_install] Error 2
make: *** [/root/FC32-64_K5.6.0_GCC10.0.1/x86_64-native-linuxapp-gcc/84729f7edd0e404b9e08ff68c2644613/dpdk/mk/rte.sdkroot.mk:92: install] Error 2


*Makefile Build Failed #8:
OS: FC32-64
Target: x86_64-native-linuxapp-clang
Traceback (most recent call last):
  File "/root/FC32-64_K5.6.0_Clang10.0.0/x86_64-native-linuxapp-clang/84729f7edd0e404b9e08ff68c2644613/dpdk/buildtools/pmdinfogen.py", line 12, in <module>
    from elftools.elf.elffile import ELFFile
ModuleNotFoundError: No module named 'elftools'
Traceback (most recent call last):
  File "/root/FC32-64_K5.6.0_Clang10.0.0/x86_64-native-linuxapp-clang/84729f7edd0e404b9e08ff68c2644613/dpdk/buildtools/pmdinfogen.py", line 12, in <module>
    from elftools.elf.elffile import ELFFile
ModuleNotFoundError: No module named 'elftools'
make[6]: *** [/root/FC32-64_K5.6.0_Clang10.0.0/x86_64-native-linuxapp-clang/84729f7edd0e404b9e08ff68c2644613/dpdk/mk/internal/rte.compile-pre.mk:114: portal/dpaa2_hw_dpci.o] Error 1
make[6]: *** Waiting for unfinished jobs....
make[6]: *** [/root/FC32-64_K5.6.0_Clang10.0.0/x86_64-native-linuxapp-clang/84729f7edd0e404b9e08ff68c2644613/dpdk/mk/internal/rte.compile-pre.mk:114: portal/dpaa2_hw_dpbp.o] Error 1
Traceback (most recent call last):
  File "/root/FC32-64_K5.6.0_Clang10.0.0/x86_64-native-linuxapp-clang/84729f7edd0e404b9e08ff68c2644613/dpdk/buildtools/pmdinfogen.py", line 12, in <module>
    from elftools.elf.elffile import ELFFile
ModuleNotFoundError: No module named 'elftools'
make[6]: *** [/root/FC32-64_K5.6.0_Clang10.0.0/x86_64-native-linuxapp-clang/84729f7edd0e404b9e08ff68c2644613/dpdk/mk/internal/rte.compile-pre.mk:114: portal/dpaa2_hw_dpio.o] Error 1
make[5]: *** [/root/FC32-64_K5.6.0_Clang10.0.0/x86_64-native-linuxapp-clang/84729f7edd0e404b9e08ff68c2644613/dpdk/mk/rte.subdir.mk:35: fslmc] Error 2
make[5]: *** Waiting for unfinished jobs....
  AR librte_bus_dpaa.a
  INSTALL-LIB librte_bus_dpaa.a
make[4]: *** [/root/FC32-64_K5.6.0_Clang10.0.0/x86_64-native-linuxapp-clang/84729f7edd0e404b9e08ff68c2644613/dpdk/mk/rte.subdir.mk:37: bus] Error 2
make[3]: *** [/root/FC32-64_K5.6.0_Clang10.0.0/x86_64-native-linuxapp-clang/84729f7edd0e404b9e08ff68c2644613/dpdk/mk/rte.sdkbuild.mk:51: drivers] Error 2
make[2]: *** [/root/FC32-64_K5.6.0_Clang10.0.0/x86_64-native-linuxapp-clang/84729f7edd0e404b9e08ff68c2644613/dpdk/mk/rte.sdkroot.mk:115: all] Error 2
make[1]: *** [/root/FC32-64_K5.6.0_Clang10.0.0/x86_64-native-linuxapp-clang/84729f7edd0e404b9e08ff68c2644613/dpdk/mk/rte.sdkinstall.mk:61: pre_install] Error 2
make: *** [/root/FC32-64_K5.6.0_Clang10.0.0/x86_64-native-linuxapp-clang/84729f7edd0e404b9e08ff68c2644613/dpdk/mk/rte.sdkroot.mk:92: install] Error 2


*Makefile Build Failed #9:
OS: FreeBSD1201-64
Target: x86_64-native-bsdapp-gcc
awk -f /usr/src/sys/tools/makeobjops.awk /usr/src/sys/kern/bus_if.m -h
awk -f /usr/src/sys/tools/makeobjops.awk /usr/src/sys/dev/pci/pci_if.m -h
Warning: Object directory not changed from original /root/FreeBSD1201-64_K12.1_GCC9.2.0/x86_64-native-bsdapp-gcc/84729f7edd0e404b9e08ff68c2644613/dpdk/x86_64-native-bsdapp-gcc/build/kernel/freebsd/nic_uio
cc  -Winline -Wall -Werror -include /root/FreeBSD1201-64_K12.1_GCC9.2.0/x86_64-native-bsdapp-gcc/84729f7edd0e404b9e08ff68c2644613/dpdk/x86_64-native-bsdapp-gcc/include/rte_config.h  -Werror -D_KERNEL -DKLD_MODULE -nostdinc  -I/root/FreeBSD1201-64_K12.1_GCC9.2.0/x86_64-native-bsdapp-gcc/84729f7edd0e404b9e08ff68c2644613/dpdk/kernel/freebsd/nic_uio -I/root/FreeBSD1201-64_K12.1_GCC9.2.0/x86_64-native-bsdapp-gcc/84729f7edd0e404b9e08ff68c2644613/dpdk/x86_64-native-bsdapp-gcc/include -I. -I/usr/src/sys -I/usr/src/sys/contrib/ck/include -fno-common  -fno-omit-frame-pointer -mno-omit-leaf-frame-pointer -fdebug-prefix-map=./machine=/usr/src/sys/amd64/include -fdebug-prefix-map=./x86=/usr/src/sys/x86/include   -MD  -MF.depend.nic_uio.o -MTnic_uio.o -mcmodel=kernel -mno-red-zone -mno-mmx -mno-sse -msoft-float  -fno-asynchronous-unwind-tables -ffreestanding -fwrapv -fstack-protector -Wall -Wredundant-decls -Wnested-externs -Wstrict-prototypes -Wmissing-prototypes -Wpointer-arith -Wcast-qual -Wundef -Wno-pointer-sign -D__printf__=__freebsd_kprintf__ -Wmissing-include-dirs -fdiagnostics-show-option -Wno-unknown-pragmas -Wno-error-tautological-compare -Wno-error-empty-body -Wno-error-parentheses-equality -Wno-error-unused-function -Wno-error-pointer-sign -Wno-error-shift-negative-value -Wno-address-of-packed-member  -mno-aes -mno-avx  -std=iso9899:1999 -c nic_uio.c -o nic_uio.o
ld -m elf_x86_64_fbsd -L/root/FreeBSD1201-64_K12.1_GCC9.2.0/x86_64-native-bsdapp-gcc/84729f7edd0e404b9e08ff68c2644613/dpdk/x86_64-native-bsdapp-gcc/lib -d -warn-common --build-id=sha1 -r -d -o nic_uio.ko nic_uio.o
:> export_syms
awk -f /usr/src/sys/conf/kmod_syms.awk nic_uio.ko  export_syms | xargs -J% objcopy % nic_uio.ko
--
awk -f /usr/src/sys/tools/makeobjops.awk /usr/src/sys/kern/device_if.m -h
awk -f /usr/src/sys/tools/makeobjops.awk /usr/src/sys/kern/bus_if.m -h
Warning: Object directory not changed from original /root/FreeBSD1201-64_K12.1_GCC9.2.0/x86_64-native-bsdapp-gcc/84729f7edd0e404b9e08ff68c2644613/dpdk/x86_64-native-bsdapp-gcc/build/kernel/freebsd/contigmem
cc  -Winline -Wall -Werror -include /root/FreeBSD1201-64_K12.1_GCC9.2.0/x86_64-native-bsdapp-gcc/84729f7edd0e404b9e08ff68c2644613/dpdk/x86_64-native-bsdapp-gcc/include/rte_config.h  -Werror -D_KERNEL -DKLD_MODULE -nostdinc  -I/root/FreeBSD1201-64_K12.1_GCC9.2.0/x86_64-native-bsdapp-gcc/84729f7edd0e404b9e08ff68c2644613/dpdk/kernel/freebsd/contigmem -I/root/FreeBSD1201-64_K12.1_GCC9.2.0/x86_64-native-bsdapp-gcc/84729f7edd0e404b9e08ff68c2644613/dpdk/x86_64-native-bsdapp-gcc/include -I. -I/usr/src/sys -I/usr/src/sys/contrib/ck/include -fno-common  -fno-omit-frame-pointer -mno-omit-leaf-frame-pointer -fdebug-prefix-map=./machine=/usr/src/sys/amd64/include -fdebug-prefix-map=./x86=/usr/src/sys/x86/include   -MD  -MF.depend.contigmem.o -MTcontigmem.o -mcmodel=kernel -mno-red-zone -mno-mmx -mno-sse -msoft-float  -fno-asynchronous-unwind-tables -ffreestanding -fwrapv -fstack-protector -Wall -Wredundant-decls -Wnested-externs -Wstrict-prototypes -Wmissing-prototypes -Wpointer-arith -Wcast-qual -Wundef -Wno-pointer-sign -D__printf__=__freebsd_kprintf__ -Wmissing-include-dirs -fdiagnostics-show-option -Wno-unknown-pragmas -Wno-error-tautological-compare -Wno-error-empty-body -Wno-error-parentheses-equality -Wno-error-unused-function -Wno-error-pointer-sign -Wno-error-shift-negative-value -Wno-address-of-packed-member  -mno-aes -mno-avx  -std=iso9899:1999 -c contigmem.c -o contigmem.o
objcopy --strip-debug nic_uio.ko
INSTALL-MODULE nic_uio.ko
  CC otx2_mbox.o
--
Traceback (most recent call last):
  File "/root/FreeBSD1201-64_K12.1_GCC9.2.0/x86_64-native-bsdapp-gcc/84729f7edd0e404b9e08ff68c2644613/dpdk/buildtools/pmdinfogen.py", line 12, in <module>
    from elftools.elf.elffile import ELFFile
ModuleNotFoundError: No module named 'elftools'
gmake[6]: *** [/root/FreeBSD1201-64_K12.1_GCC9.2.0/x86_64-native-bsdapp-gcc/84729f7edd0e404b9e08ff68c2644613/dpdk/mk/internal/rte.compile-pre.mk:114: otx2_mempool.o] Error 1
gmake[6]: *** Waiting for unfinished jobs....
gmake[5]: *** [/root/FreeBSD1201-64_K12.1_GCC9.2.0/x86_64-native-bsdapp-gcc/84729f7edd0e404b9e08ff68c2644613/dpdk/mk/rte.subdir.mk:35: octeontx2] Error 2
gmake[5]: *** Waiting for unfinished jobs....
Traceback (most recent call last):
  File "/root/FreeBSD1201-64_K12.1_GCC9.2.0/x86_64-native-bsdapp-gcc/84729f7edd0e404b9e08ff68c2644613/dpdk/buildtools/pmdinfogen.py", line 12, in <module>
    from elftools.elf.elffile import ELFFile
ModuleNotFoundError: No module named 'elftools'
gmake[6]: *** [/root/FreeBSD1201-64_K12.1_GCC9.2.0/x86_64-native-bsdapp-gcc/84729f7edd0e404b9e08ff68c2644613/dpdk/mk/internal/rte.compile-pre.mk:116: octeontx_fpavf.o] Error 1
gmake[6]: *** Waiting for unfinished jobs....
gmake[5]: *** [/root/FreeBSD1201-64_K12.1_GCC9.2.0/x86_64-native-bsdapp-gcc/84729f7edd0e404b9e08ff68c2644613/dpdk/mk/rte.subdir.mk:35: octeontx] Error 2
  AR librte_mempool_bucket.a
  INSTALL-LIB librte_mempool_bucket.a
gmake[6]: warning:  Clock skew detected.  Your build may be incomplete.
gmake[4]: *** [/root/FreeBSD1201-64_K12.1_GCC9.2.0/x86_64-native-bsdapp-gcc/84729f7edd0e404b9e08ff68c2644613/dpdk/mk/rte.subdir.mk:37: mempool] Error 2
gmake[3]: *** [/root/FreeBSD1201-64_K12.1_GCC9.2.0/x86_64-native-bsdapp-gcc/84729f7edd0e404b9e08ff68c2644613/dpdk/mk/rte.sdkbuild.mk:51: drivers] Error 2
gmake[2]: *** [/root/FreeBSD1201-64_K12.1_GCC9.2.0/x86_64-native-bsdapp-gcc/84729f7edd0e404b9e08ff68c2644613/dpdk/mk/rte.sdkroot.mk:115: all] Error 2
gmake[1]: *** [/root/FreeBSD1201-64_K12.1_GCC9.2.0/x86_64-native-bsdapp-gcc/84729f7edd0e404b9e08ff68c2644613/dpdk/mk/rte.sdkinstall.mk:61: pre_install] Error 2
gmake: *** [/root/FreeBSD1201-64_K12.1_GCC9.2.0/x86_64-native-bsdapp-gcc/84729f7edd0e404b9e08ff68c2644613/dpdk/mk/rte.sdkroot.mk:92: install] Error 2


*Makefile Build Failed #10:
OS: FreeBSD1201-64
Target: x86_64-native-bsdapp-clang
awk -f /usr/src/sys/tools/makeobjops.awk /usr/src/sys/kern/device_if.m -h
awk -f /usr/src/sys/tools/makeobjops.awk /usr/src/sys/kern/bus_if.m -h
Warning: Object directory not changed from original /root/FreeBSD1201-64_K12.1_Clang8.0.1/x86_64-native-bsdapp-clang/84729f7edd0e404b9e08ff68c2644613/dpdk/x86_64-native-bsdapp-clang/build/kernel/freebsd/contigmem
cc  -Winline -Wall -Werror -include /root/FreeBSD1201-64_K12.1_Clang8.0.1/x86_64-native-bsdapp-clang/84729f7edd0e404b9e08ff68c2644613/dpdk/x86_64-native-bsdapp-clang/include/rte_config.h  -Werror -D_KERNEL -DKLD_MODULE -nostdinc  -I/root/FreeBSD1201-64_K12.1_Clang8.0.1/x86_64-native-bsdapp-clang/84729f7edd0e404b9e08ff68c2644613/dpdk/kernel/freebsd/contigmem -I/root/FreeBSD1201-64_K12.1_Clang8.0.1/x86_64-native-bsdapp-clang/84729f7edd0e404b9e08ff68c2644613/dpdk/x86_64-native-bsdapp-clang/include -I. -I/usr/src/sys -I/usr/src/sys/contrib/ck/include -fno-common  -fno-omit-frame-pointer -mno-omit-leaf-frame-pointer -fdebug-prefix-map=./machine=/usr/src/sys/amd64/include -fdebug-prefix-map=./x86=/usr/src/sys/x86/include   -MD  -MF.depend.contigmem.o -MTcontigmem.o -mcmodel=kernel -mno-red-zone -mno-mmx -mno-sse -msoft-float  -fno-asynchronous-unwind-tables -ffreestanding -fwrapv -fstack-protector -Wall -Wredundant-decls -Wnested-externs -Wstrict-prototypes -Wmissing-prototypes -Wpointer-arith -Wcast-qual -Wundef -Wno-pointer-sign -D__printf__=__freebsd_kprintf__ -Wmissing-include-dirs -fdiagnostics-show-option -Wno-unknown-pragmas -Wno-error-tautological-compare -Wno-error-empty-body -Wno-error-parentheses-equality -Wno-error-unused-function -Wno-error-pointer-sign -Wno-error-shift-negative-value -Wno-address-of-packed-member  -mno-aes -mno-avx  -std=iso9899:1999 -c contigmem.c -o contigmem.o
ld -m elf_x86_64_fbsd -L/root/FreeBSD1201-64_K12.1_Clang8.0.1/x86_64-native-bsdapp-clang/84729f7edd0e404b9e08ff68c2644613/dpdk/x86_64-native-bsdapp-clang/lib -d -warn-common --build-id=sha1 -r -d -o contigmem.ko contigmem.o
Warning: Object directory not changed from original /root/FreeBSD1201-64_K12.1_Clang8.0.1/x86_64-native-bsdapp-clang/84729f7edd0e404b9e08ff68c2644613/dpdk/x86_64-native-bsdapp-clang/build/kernel/freebsd/nic_uio
cc  -Winline -Wall -Werror -include /root/FreeBSD1201-64_K12.1_Clang8.0.1/x86_64-native-bsdapp-clang/84729f7edd0e404b9e08ff68c2644613/dpdk/x86_64-native-bsdapp-clang/include/rte_config.h  -Werror -D_KERNEL -DKLD_MODULE -nostdinc  -I/root/FreeBSD1201-64_K12.1_Clang8.0.1/x86_64-native-bsdapp-clang/84729f7edd0e404b9e08ff68c2644613/dpdk/kernel/freebsd/nic_uio -I/root/FreeBSD1201-64_K12.1_Clang8.0.1/x86_64-native-bsdapp-clang/84729f7edd0e404b9e08ff68c2644613/dpdk/x86_64-native-bsdapp-clang/include -I. -I/usr/src/sys -I/usr/src/sys/contrib/ck/include -fno-common  -fno-omit-frame-pointer -mno-omit-leaf-frame-pointer -fdebug-prefix-map=./machine=/usr/src/sys/amd64/include -fdebug-prefix-map=./x86=/usr/src/sys/x86/include   -MD  -MF.depend.nic_uio.o -MTnic_uio.o -mcmodel=kernel -mno-red-zone -mno-mmx -mno-sse -msoft-float  -fno-asynchronous-unwind-tables -ffreestanding -fwrapv -fstack-protector -Wall -Wredundant-decls -Wnested-externs -Wstrict-prototypes -Wmissing-prototypes -Wpointer-arith -Wcast-qual -Wundef -Wno-pointer-sign -D__printf__=__freebsd_kprintf__ -Wmissing-include-dirs -fdiagnostics-show-option -Wno-unknown-pragmas -Wno-error-tautological-compare -Wno-error-empty-body -Wno-error-parentheses-equality -Wno-error-unused-function -Wno-error-pointer-sign -Wno-error-shift-negative-value -Wno-address-of-packed-member  -mno-aes -mno-avx  -std=iso9899:1999 -c nic_uio.c -o nic_uio.o
:> export_syms
awk -f /usr/src/sys/conf/kmod_syms.awk contigmem.ko  export_syms | xargs -J% objcopy % contigmem.ko
objcopy --strip-debug contigmem.ko
--
Traceback (most recent call last):
  File "/root/FreeBSD1201-64_K12.1_Clang8.0.1/x86_64-native-bsdapp-clang/84729f7edd0e404b9e08ff68c2644613/dpdk/buildtools/pmdinfogen.py", line 12, in <module>
    from elftools.elf.elffile import ELFFile
ModuleNotFoundError: No module named 'elftools'
gmake[6]: *** [/root/FreeBSD1201-64_K12.1_Clang8.0.1/x86_64-native-bsdapp-clang/84729f7edd0e404b9e08ff68c2644613/dpdk/mk/internal/rte.compile-pre.mk:116: octeontx_fpavf.o] Error 1
gmake[6]: *** Waiting for unfinished jobs....
  AR librte_mempool_ring.a
  PMDINFO otx2_mempool.o.pmd.c
  INSTALL-LIB librte_mempool_ring.a
  AR librte_mempool_stack.a
gmake[5]: *** [/root/FreeBSD1201-64_K12.1_Clang8.0.1/x86_64-native-bsdapp-clang/84729f7edd0e404b9e08ff68c2644613/dpdk/mk/rte.subdir.mk:37: octeontx] Error 2
gmake[5]: *** Waiting for unfinished jobs....
  INSTALL-LIB librte_mempool_stack.a
gmake[6]: warning:  Clock skew detected.  Your build may be incomplete.
--
Traceback (most recent call last):
  File "/root/FreeBSD1201-64_K12.1_Clang8.0.1/x86_64-native-bsdapp-clang/84729f7edd0e404b9e08ff68c2644613/dpdk/buildtools/pmdinfogen.py", line 12, in <module>
    from elftools.elf.elffile import ELFFile
ModuleNotFoundError: No module named 'elftools'
gmake[6]: *** [/root/FreeBSD1201-64_K12.1_Clang8.0.1/x86_64-native-bsdapp-clang/84729f7edd0e404b9e08ff68c2644613/dpdk/mk/internal/rte.compile-pre.mk:114: otx2_mempool.o] Error 1
gmake[6]: *** Waiting for unfinished jobs....
gmake[5]: *** [/root/FreeBSD1201-64_K12.1_Clang8.0.1/x86_64-native-bsdapp-clang/84729f7edd0e404b9e08ff68c2644613/dpdk/mk/rte.subdir.mk:35: octeontx2] Error 2
  AR librte_mempool_bucket.a
  INSTALL-LIB librte_mempool_bucket.a
gmake[6]: warning:  Clock skew detected.  Your build may be incomplete.
gmake[4]: *** [/root/FreeBSD1201-64_K12.1_Clang8.0.1/x86_64-native-bsdapp-clang/84729f7edd0e404b9e08ff68c2644613/dpdk/mk/rte.subdir.mk:37: mempool] Error 2
gmake[3]: *** [/root/FreeBSD1201-64_K12.1_Clang8.0.1/x86_64-native-bsdapp-clang/84729f7edd0e404b9e08ff68c2644613/dpdk/mk/rte.sdkbuild.mk:51: drivers] Error 2
gmake[2]: *** [/root/FreeBSD1201-64_K12.1_Clang8.0.1/x86_64-native-bsdapp-clang/84729f7edd0e404b9e08ff68c2644613/dpdk/mk/rte.sdkroot.mk:115: all] Error 2
gmake[1]: *** [/root/FreeBSD1201-64_K12.1_Clang8.0.1/x86_64-native-bsdapp-clang/84729f7edd0e404b9e08ff68c2644613/dpdk/mk/rte.sdkinstall.mk:61: pre_install] Error 2
gmake: *** [/root/FreeBSD1201-64_K12.1_Clang8.0.1/x86_64-native-bsdapp-clang/84729f7edd0e404b9e08ff68c2644613/dpdk/mk/rte.sdkroot.mk:92: install] Error 2


*Makefile Build Failed #11:
OS: FreeBSD1201-64
Target: x86_64-native-bsdapp-gcc+shared
awk -f /usr/src/sys/tools/makeobjops.awk /usr/src/sys/dev/pci/pci_if.m -h
  LD librte_common_cpt.so.20.0.3
Warning: Object directory not changed from original /root/FreeBSD1201-64_K12.1_GCC7.3.0/x86_64-native-bsdapp-gcc+shared/84729f7edd0e404b9e08ff68c2644613/dpdk/x86_64-native-bsdapp-gcc/build/kernel/freebsd/nic_uio
cc  -Winline -Wall -Werror -include /root/FreeBSD1201-64_K12.1_GCC7.3.0/x86_64-native-bsdapp-gcc+shared/84729f7edd0e404b9e08ff68c2644613/dpdk/x86_64-native-bsdapp-gcc/include/rte_config.h  -Werror -D_KERNEL -DKLD_MODULE -nostdinc  -I/root/FreeBSD1201-64_K12.1_GCC7.3.0/x86_64-native-bsdapp-gcc+shared/84729f7edd0e404b9e08ff68c2644613/dpdk/kernel/freebsd/nic_uio -I/root/FreeBSD1201-64_K12.1_GCC7.3.0/x86_64-native-bsdapp-gcc+shared/84729f7edd0e404b9e08ff68c2644613/dpdk/x86_64-native-bsdapp-gcc/include -I. -I/usr/src/sys -I/usr/src/sys/contrib/ck/include -fno-common  -fno-omit-frame-pointer -mno-omit-leaf-frame-pointer -fdebug-prefix-map=./machine=/usr/src/sys/amd64/include -fdebug-prefix-map=./x86=/usr/src/sys/x86/include   -MD  -MF.depend.nic_uio.o -MTnic_uio.o -mcmodel=kernel -mno-red-zone -mno-mmx -mno-sse -msoft-float  -fno-asynchronous-unwind-tables -ffreestanding -fwrapv -fstack-protector -Wall -Wredundant-decls -Wnested-externs -Wstrict-prototypes -Wmissing-prototypes -Wpointer-arith -Wcast-qual -Wundef -Wno-pointer-sign -D__printf__=__freebsd_kprintf__ -Wmissing-include-dirs -fdiagnostics-show-option -Wno-unknown-pragmas -Wno-error-tautological-compare -Wno-error-empty-body -Wno-error-parentheses-equality -Wno-error-unused-function -Wno-error-pointer-sign -Wno-error-shift-negative-value -Wno-address-of-packed-member  -mno-aes -mno-avx  -std=iso9899:1999 -c nic_uio.c -o nic_uio.o
Warning: Object directory not changed from original /root/FreeBSD1201-64_K12.1_GCC7.3.0/x86_64-native-bsdapp-gcc+shared/84729f7edd0e404b9e08ff68c2644613/dpdk/x86_64-native-bsdapp-gcc/build/kernel/freebsd/contigmem
ld -m elf_x86_64_fbsd -L/root/FreeBSD1201-64_K12.1_GCC7.3.0/x86_64-native-bsdapp-gcc+shared/84729f7edd0e404b9e08ff68c2644613/dpdk/x86_64-native-bsdapp-gcc/lib -d -warn-common --build-id=sha1 -r -d -o nic_uio.ko nic_uio.o
cc  -Winline -Wall -Werror -include /root/FreeBSD1201-64_K12.1_GCC7.3.0/x86_64-native-bsdapp-gcc+shared/84729f7edd0e404b9e08ff68c2644613/dpdk/x86_64-native-bsdapp-gcc/include/rte_config.h  -Werror -D_KERNEL -DKLD_MODULE -nostdinc  -I/root/FreeBSD1201-64_K12.1_GCC7.3.0/x86_64-native-bsdapp-gcc+shared/84729f7edd0e404b9e08ff68c2644613/dpdk/kernel/freebsd/contigmem -I/root/FreeBSD1201-64_K12.1_GCC7.3.0/x86_64-native-bsdapp-gcc+shared/84729f7edd0e404b9e08ff68c2644613/dpdk/x86_64-native-bsdapp-gcc/include -I. -I/usr/src/sys -I/usr/src/sys/contrib/ck/include -fno-common  -fno-omit-frame-pointer -mno-omit-leaf-frame-pointer -fdebug-prefix-map=./machine=/usr/src/sys/amd64/include -fdebug-prefix-map=./x86=/usr/src/sys/x86/include   -MD  -MF.depend.contigmem.o -MTcontigmem.o -mcmodel=kernel -mno-red-zone -mno-mmx -mno-sse -msoft-float  -fno-asynchronous-unwind-tables -ffreestanding -fwrapv -fstack-protector -Wall -Wredundant-decls -Wnested-externs -Wstrict-prototypes -Wmissing-prototypes -Wpointer-arith -Wcast-qual -Wundef -Wno-pointer-sign -D__printf__=__freebsd_kprintf__ -Wmissing-include-dirs -fdiagnostics-show-option -Wno-unknown-pragmas -Wno-error-tautological-compare -Wno-error-empty-body -Wno-error-parentheses-equality -Wno-error-unused-function -Wno-error-pointer-sign -Wno-error-shift-negative-value -Wno-address-of-packed-member  -mno-aes -mno-avx  -std=iso9899:1999 -c contigmem.c -o contigmem.o
  INSTALL-LIB librte_common_iavf.so.20.0.3
gmake[6]: warning:  Clock skew detected.  Your build may be incomplete.
:> export_syms
--
Traceback (most recent call last):
  File "/root/FreeBSD1201-64_K12.1_GCC7.3.0/x86_64-native-bsdapp-gcc+shared/84729f7edd0e404b9e08ff68c2644613/dpdk/buildtools/pmdinfogen.py", line 12, in <module>
    from elftools.elf.elffile import ELFFile
ModuleNotFoundError: No module named 'elftools'
  INSTALL-LIB librte_mempool_stack.so.20.0.3
gmake[6]: *** [/root/FreeBSD1201-64_K12.1_GCC7.3.0/x86_64-native-bsdapp-gcc+shared/84729f7edd0e404b9e08ff68c2644613/dpdk/mk/internal/rte.compile-pre.mk:114: otx2_mempool.o] Error 1
gmake[6]: *** Waiting for unfinished jobs....
gmake[6]: warning:  Clock skew detected.  Your build may be incomplete.
gmake[5]: *** [/root/FreeBSD1201-64_K12.1_GCC7.3.0/x86_64-native-bsdapp-gcc+shared/84729f7edd0e404b9e08ff68c2644613/dpdk/mk/rte.subdir.mk:35: octeontx2] Error 2
gmake[5]: *** Waiting for unfinished jobs....
  LD librte_mempool_ring.so.20.0.3
  INSTALL-LIB librte_mempool_ring.so.20.0.3
--
Traceback (most recent call last):
  File "/root/FreeBSD1201-64_K12.1_GCC7.3.0/x86_64-native-bsdapp-gcc+shared/84729f7edd0e404b9e08ff68c2644613/dpdk/buildtools/pmdinfogen.py", line 12, in <module>
    from elftools.elf.elffile import ELFFile
ModuleNotFoundError: No module named 'elftools'
gmake[6]: *** [/root/FreeBSD1201-64_K12.1_GCC7.3.0/x86_64-native-bsdapp-gcc+shared/84729f7edd0e404b9e08ff68c2644613/dpdk/mk/internal/rte.compile-pre.mk:114: octeontx_fpavf.o] Error 1
gmake[5]: *** [/root/FreeBSD1201-64_K12.1_GCC7.3.0/x86_64-native-bsdapp-gcc+shared/84729f7edd0e404b9e08ff68c2644613/dpdk/mk/rte.subdir.mk:35: octeontx] Error 2
  LD librte_mempool_bucket.so.20.0.3
  INSTALL-LIB librte_mempool_bucket.so.20.0.3
gmake[6]: warning:  Clock skew detected.  Your build may be incomplete.
gmake[4]: *** [/root/FreeBSD1201-64_K12.1_GCC7.3.0/x86_64-native-bsdapp-gcc+shared/84729f7edd0e404b9e08ff68c2644613/dpdk/mk/rte.subdir.mk:37: mempool] Error 2
gmake[3]: *** [/root/FreeBSD1201-64_K12.1_GCC7.3.0/x86_64-native-bsdapp-gcc+shared/84729f7edd0e404b9e08ff68c2644613/dpdk/mk/rte.sdkbuild.mk:51: drivers] Error 2
gmake[2]: *** [/root/FreeBSD1201-64_K12.1_GCC7.3.0/x86_64-native-bsdapp-gcc+shared/84729f7edd0e404b9e08ff68c2644613/dpdk/mk/rte.sdkroot.mk:115: all] Error 2
gmake[1]: *** [/root/FreeBSD1201-64_K12.1_GCC7.3.0/x86_64-native-bsdapp-gcc+shared/84729f7edd0e404b9e08ff68c2644613/dpdk/mk/rte.sdkinstall.mk:61: pre_install] Error 2
gmake: *** [/root/FreeBSD1201-64_K12.1_GCC7.3.0/x86_64-native-bsdapp-gcc+shared/84729f7edd0e404b9e08ff68c2644613/dpdk/mk/rte.sdkroot.mk:92: install] Error 2


*Makefile Build Failed #12:
OS: FreeBSD1201-64
Target: x86_64-native-bsdapp-gcc+debug
awk -f /usr/src/sys/tools/makeobjops.awk /usr/src/sys/dev/pci/pci_if.m -h
awk -f /usr/src/sys/tools/makeobjops.awk /usr/src/sys/kern/bus_if.m -h
Warning: Object directory not changed from original /root/FreeBSD1201-64_K12.1_GCC7.3.0/x86_64-native-bsdapp-gcc+debug/84729f7edd0e404b9e08ff68c2644613/dpdk/x86_64-native-bsdapp-gcc/build/kernel/freebsd/nic_uio
cc  -Winline -Wall -Werror -include /root/FreeBSD1201-64_K12.1_GCC7.3.0/x86_64-native-bsdapp-gcc+debug/84729f7edd0e404b9e08ff68c2644613/dpdk/x86_64-native-bsdapp-gcc/include/rte_config.h  -Werror -D_KERNEL -DKLD_MODULE -nostdinc  -I/root/FreeBSD1201-64_K12.1_GCC7.3.0/x86_64-native-bsdapp-gcc+debug/84729f7edd0e404b9e08ff68c2644613/dpdk/kernel/freebsd/nic_uio -I/root/FreeBSD1201-64_K12.1_GCC7.3.0/x86_64-native-bsdapp-gcc+debug/84729f7edd0e404b9e08ff68c2644613/dpdk/x86_64-native-bsdapp-gcc/include -I. -I/usr/src/sys -I/usr/src/sys/contrib/ck/include -fno-common  -fno-omit-frame-pointer -mno-omit-leaf-frame-pointer -fdebug-prefix-map=./machine=/usr/src/sys/amd64/include -fdebug-prefix-map=./x86=/usr/src/sys/x86/include   -MD  -MF.depend.nic_uio.o -MTnic_uio.o -mcmodel=kernel -mno-red-zone -mno-mmx -mno-sse -msoft-float  -fno-asynchronous-unwind-tables -ffreestanding -fwrapv -fstack-protector -Wall -Wredundant-decls -Wnested-externs -Wstrict-prototypes -Wmissing-prototypes -Wpointer-arith -Wcast-qual -Wundef -Wno-pointer-sign -D__printf__=__freebsd_kprintf__ -Wmissing-include-dirs -fdiagnostics-show-option -Wno-unknown-pragmas -Wno-error-tautological-compare -Wno-error-empty-body -Wno-error-parentheses-equality -Wno-error-unused-function -Wno-error-pointer-sign -Wno-error-shift-negative-value -Wno-address-of-packed-member  -mno-aes -mno-avx  -std=iso9899:1999 -c nic_uio.c -o nic_uio.o
Warning: Object directory not changed from original /root/FreeBSD1201-64_K12.1_GCC7.3.0/x86_64-native-bsdapp-gcc+debug/84729f7edd0e404b9e08ff68c2644613/dpdk/x86_64-native-bsdapp-gcc/build/kernel/freebsd/contigmem
cc  -Winline -Wall -Werror -include /root/FreeBSD1201-64_K12.1_GCC7.3.0/x86_64-native-bsdapp-gcc+debug/84729f7edd0e404b9e08ff68c2644613/dpdk/x86_64-native-bsdapp-gcc/include/rte_config.h  -Werror -D_KERNEL -DKLD_MODULE -nostdinc  -I/root/FreeBSD1201-64_K12.1_GCC7.3.0/x86_64-native-bsdapp-gcc+debug/84729f7edd0e404b9e08ff68c2644613/dpdk/kernel/freebsd/contigmem -I/root/FreeBSD1201-64_K12.1_GCC7.3.0/x86_64-native-bsdapp-gcc+debug/84729f7edd0e404b9e08ff68c2644613/dpdk/x86_64-native-bsdapp-gcc/include -I. -I/usr/src/sys -I/usr/src/sys/contrib/ck/include -fno-common  -fno-omit-frame-pointer -mno-omit-leaf-frame-pointer -fdebug-prefix-map=./machine=/usr/src/sys/amd64/include -fdebug-prefix-map=./x86=/usr/src/sys/x86/include   -MD  -MF.depend.contigmem.o -MTcontigmem.o -mcmodel=kernel -mno-red-zone -mno-mmx -mno-sse -msoft-float  -fno-asynchronous-unwind-tables -ffreestanding -fwrapv -fstack-protector -Wall -Wredundant-decls -Wnested-externs -Wstrict-prototypes -Wmissing-prototypes -Wpointer-arith -Wcast-qual -Wundef -Wno-pointer-sign -D__printf__=__freebsd_kprintf__ -Wmissing-include-dirs -fdiagnostics-show-option -Wno-unknown-pragmas -Wno-error-tautological-compare -Wno-error-empty-body -Wno-error-parentheses-equality -Wno-error-unused-function -Wno-error-pointer-sign -Wno-error-shift-negative-value -Wno-address-of-packed-member  -mno-aes -mno-avx  -std=iso9899:1999 -c contigmem.c -o contigmem.o
ld -m elf_x86_64_fbsd -L/root/FreeBSD1201-64_K12.1_GCC7.3.0/x86_64-native-bsdapp-gcc+debug/84729f7edd0e404b9e08ff68c2644613/dpdk/x86_64-native-bsdapp-gcc/lib -d -warn-common --build-id=sha1 -r -d -o nic_uio.ko nic_uio.o
ld -m elf_x86_64_fbsd -L/root/FreeBSD1201-64_K12.1_GCC7.3.0/x86_64-native-bsdapp-gcc+debug/84729f7edd0e404b9e08ff68c2644613/dpdk/x86_64-native-bsdapp-gcc/lib -d -warn-common --build-id=sha1 -r -d -o contigmem.ko contigmem.o
:> export_syms
--
Traceback (most recent call last):
  File "/root/FreeBSD1201-64_K12.1_GCC7.3.0/x86_64-native-bsdapp-gcc+debug/84729f7edd0e404b9e08ff68c2644613/dpdk/buildtools/pmdinfogen.py", line 12, in <module>
    from elftools.elf.elffile import ELFFile
ModuleNotFoundError: No module named 'elftools'
gmake[6]: *** [/root/FreeBSD1201-64_K12.1_GCC7.3.0/x86_64-native-bsdapp-gcc+debug/84729f7edd0e404b9e08ff68c2644613/dpdk/mk/internal/rte.compile-pre.mk:116: octeontx_fpavf.o] Error 1
gmake[6]: *** Waiting for unfinished jobs....
  AR librte_mempool_stack.a
  PMDINFO otx2_mempool.o.pmd.c
gmake[5]: *** [/root/FreeBSD1201-64_K12.1_GCC7.3.0/x86_64-native-bsdapp-gcc+debug/84729f7edd0e404b9e08ff68c2644613/dpdk/mk/rte.subdir.mk:37: octeontx] Error 2
gmake[5]: *** Waiting for unfinished jobs....
  AR librte_mempool_ring.a
  INSTALL-LIB librte_mempool_ring.a
--
Traceback (most recent call last):
  File "/root/FreeBSD1201-64_K12.1_GCC7.3.0/x86_64-native-bsdapp-gcc+debug/84729f7edd0e404b9e08ff68c2644613/dpdk/buildtools/pmdinfogen.py", line 12, in <module>
    from elftools.elf.elffile import ELFFile
ModuleNotFoundError: No module named 'elftools'
gmake[6]: *** [/root/FreeBSD1201-64_K12.1_GCC7.3.0/x86_64-native-bsdapp-gcc+debug/84729f7edd0e404b9e08ff68c2644613/dpdk/mk/internal/rte.compile-pre.mk:114: otx2_mempool.o] Error 1
gmake[5]: *** [/root/FreeBSD1201-64_K12.1_GCC7.3.0/x86_64-native-bsdapp-gcc+debug/84729f7edd0e404b9e08ff68c2644613/dpdk/mk/rte.subdir.mk:35: octeontx2] Error 2
  AR librte_mempool_bucket.a
  INSTALL-LIB librte_mempool_bucket.a
gmake[6]: warning:  Clock skew detected.  Your build may be incomplete.
gmake[4]: *** [/root/FreeBSD1201-64_K12.1_GCC7.3.0/x86_64-native-bsdapp-gcc+debug/84729f7edd0e404b9e08ff68c2644613/dpdk/mk/rte.subdir.mk:37: mempool] Error 2
gmake[3]: *** [/root/FreeBSD1201-64_K12.1_GCC7.3.0/x86_64-native-bsdapp-gcc+debug/84729f7edd0e404b9e08ff68c2644613/dpdk/mk/rte.sdkbuild.mk:51: drivers] Error 2
gmake[2]: *** [/root/FreeBSD1201-64_K12.1_GCC7.3.0/x86_64-native-bsdapp-gcc+debug/84729f7edd0e404b9e08ff68c2644613/dpdk/mk/rte.sdkroot.mk:115: all] Error 2
gmake[1]: *** [/root/FreeBSD1201-64_K12.1_GCC7.3.0/x86_64-native-bsdapp-gcc+debug/84729f7edd0e404b9e08ff68c2644613/dpdk/mk/rte.sdkinstall.mk:61: pre_install] Error 2
gmake: *** [/root/FreeBSD1201-64_K12.1_GCC7.3.0/x86_64-native-bsdapp-gcc+debug/84729f7edd0e404b9e08ff68c2644613/dpdk/mk/rte.sdkroot.mk:92: install] Error 2


*Makefile Build Failed #13:
OS: RHEL82-64
Target: x86_64-native-linuxapp-gcc
Traceback (most recent call last):
  File "/root/RHEL82-64_K4.18.0_GCC8.3.1/x86_64-native-linuxapp-gcc/84729f7edd0e404b9e08ff68c2644613/dpdk/buildtools/pmdinfogen.py", line 12, in <module>
    from elftools.elf.elffile import ELFFile
ModuleNotFoundError: No module named 'elftools'
make[6]: *** [/root/RHEL82-64_K4.18.0_GCC8.3.1/x86_64-native-linuxapp-gcc/84729f7edd0e404b9e08ff68c2644613/dpdk/mk/internal/rte.compile-pre.mk:116: portal/dpaa2_hw_dpbp.o] Error 1
make[6]: *** Waiting for unfinished jobs....
  CC base/qbman/qman_driver.o
Traceback (most recent call last):
  File "/root/RHEL82-64_K4.18.0_GCC8.3.1/x86_64-native-linuxapp-gcc/84729f7edd0e404b9e08ff68c2644613/dpdk/buildtools/pmdinfogen.py", line 12, in <module>
    from elftools.elf.elffile import ELFFile
ModuleNotFoundError: No module named 'elftools'
make[6]: *** [/root/RHEL82-64_K4.18.0_GCC8.3.1/x86_64-native-linuxapp-gcc/84729f7edd0e404b9e08ff68c2644613/dpdk/mk/internal/rte.compile-pre.mk:116: portal/dpaa2_hw_dpio.o] Error 1
  CC base/qbman/dpaa_alloc.o
  MODPOST 1 modules
  CC base/qbman/dpaa_sys.o
--
Traceback (most recent call last):
  File "/root/RHEL82-64_K4.18.0_GCC8.3.1/x86_64-native-linuxapp-gcc/84729f7edd0e404b9e08ff68c2644613/dpdk/buildtools/pmdinfogen.py", line 12, in <module>
    from elftools.elf.elffile import ELFFile
ModuleNotFoundError: No module named 'elftools'
make[6]: *** [/root/RHEL82-64_K4.18.0_GCC8.3.1/x86_64-native-linuxapp-gcc/84729f7edd0e404b9e08ff68c2644613/dpdk/mk/internal/rte.compile-pre.mk:116: portal/dpaa2_hw_dpci.o] Error 1
  LD [M]  /root/RHEL82-64_K4.18.0_GCC8.3.1/x86_64-native-linuxapp-gcc/84729f7edd0e404b9e08ff68c2644613/dpdk/x86_64-native-linuxapp-gcc/build/kernel/linux/igb_uio/igb_uio.ko
INSTALL-MODULE igb_uio.ko
make[5]: *** [/root/RHEL82-64_K4.18.0_GCC8.3.1/x86_64-native-linuxapp-gcc/84729f7edd0e404b9e08ff68c2644613/dpdk/mk/rte.subdir.mk:35: fslmc] Error 2
make[5]: *** Waiting for unfinished jobs....
  AR librte_bus_dpaa.a
  INSTALL-LIB librte_bus_dpaa.a
make[6]: warning:  Clock skew detected.  Your build may be incomplete.
make[4]: *** [/root/RHEL82-64_K4.18.0_GCC8.3.1/x86_64-native-linuxapp-gcc/84729f7edd0e404b9e08ff68c2644613/dpdk/mk/rte.subdir.mk:37: bus] Error 2
make[3]: *** [/root/RHEL82-64_K4.18.0_GCC8.3.1/x86_64-native-linuxapp-gcc/84729f7edd0e404b9e08ff68c2644613/dpdk/mk/rte.sdkbuild.mk:51: drivers] Error 2
make[2]: *** [/root/RHEL82-64_K4.18.0_GCC8.3.1/x86_64-native-linuxapp-gcc/84729f7edd0e404b9e08ff68c2644613/dpdk/mk/rte.sdkroot.mk:115: all] Error 2
make[1]: *** [/root/RHEL82-64_K4.18.0_GCC8.3.1/x86_64-native-linuxapp-gcc/84729f7edd0e404b9e08ff68c2644613/dpdk/mk/rte.sdkinstall.mk:61: pre_install] Error 2
make: *** [/root/RHEL82-64_K4.18.0_GCC8.3.1/x86_64-native-linuxapp-gcc/84729f7edd0e404b9e08ff68c2644613/dpdk/mk/rte.sdkroot.mk:92: install] Error 2


*Makefile Build Failed #14:
OS: SUSE15-64
Target: x86_64-native-linuxapp-clang
Traceback (most recent call last):
  File "/root/SUSE15-64_K4.12.14_Clang5.0.1/x86_64-native-linuxapp-clang/84729f7edd0e404b9e08ff68c2644613/dpdk/buildtools/pmdinfogen.py", line 12, in <module>
    from elftools.elf.elffile import ELFFile
ModuleNotFoundError: No module named 'elftools'
Traceback (most recent call last):
  File "/root/SUSE15-64_K4.12.14_Clang5.0.1/x86_64-native-linuxapp-clang/84729f7edd0e404b9e08ff68c2644613/dpdk/buildtools/pmdinfogen.py", line 12, in <module>
    from elftools.elf.elffile import ELFFile
ModuleNotFoundError: No module named 'elftools'
make[6]: *** [/root/SUSE15-64_K4.12.14_Clang5.0.1/x86_64-native-linuxapp-clang/84729f7edd0e404b9e08ff68c2644613/dpdk/mk/internal/rte.compile-pre.mk:114: portal/dpaa2_hw_dpbp.o] Error 1
make[6]: *** Waiting for unfinished jobs....
make[6]: *** [/root/SUSE15-64_K4.12.14_Clang5.0.1/x86_64-native-linuxapp-clang/84729f7edd0e404b9e08ff68c2644613/dpdk/mk/internal/rte.compile-pre.mk:114: portal/dpaa2_hw_dpio.o] Error 1
Traceback (most recent call last):
  File "/root/SUSE15-64_K4.12.14_Clang5.0.1/x86_64-native-linuxapp-clang/84729f7edd0e404b9e08ff68c2644613/dpdk/buildtools/pmdinfogen.py", line 12, in <module>
    from elftools.elf.elffile import ELFFile
ModuleNotFoundError: No module named 'elftools'
make[6]: *** [/root/SUSE15-64_K4.12.14_Clang5.0.1/x86_64-native-linuxapp-clang/84729f7edd0e404b9e08ff68c2644613/dpdk/mk/internal/rte.compile-pre.mk:114: portal/dpaa2_hw_dpci.o] Error 1
make[5]: *** [/root/SUSE15-64_K4.12.14_Clang5.0.1/x86_64-native-linuxapp-clang/84729f7edd0e404b9e08ff68c2644613/dpdk/mk/rte.subdir.mk:35: fslmc] Error 2
make[5]: *** Waiting for unfinished jobs....
  AR librte_bus_dpaa.a
  INSTALL-LIB librte_bus_dpaa.a
make[4]: *** [/root/SUSE15-64_K4.12.14_Clang5.0.1/x86_64-native-linuxapp-clang/84729f7edd0e404b9e08ff68c2644613/dpdk/mk/rte.subdir.mk:37: bus] Error 2
make[3]: *** [/root/SUSE15-64_K4.12.14_Clang5.0.1/x86_64-native-linuxapp-clang/84729f7edd0e404b9e08ff68c2644613/dpdk/mk/rte.sdkbuild.mk:51: drivers] Error 2
make[2]: *** [/root/SUSE15-64_K4.12.14_Clang5.0.1/x86_64-native-linuxapp-clang/84729f7edd0e404b9e08ff68c2644613/dpdk/mk/rte.sdkroot.mk:115: all] Error 2
make[1]: *** [/root/SUSE15-64_K4.12.14_Clang5.0.1/x86_64-native-linuxapp-clang/84729f7edd0e404b9e08ff68c2644613/dpdk/mk/rte.sdkinstall.mk:61: pre_install] Error 2
make: *** [/root/SUSE15-64_K4.12.14_Clang5.0.1/x86_64-native-linuxapp-clang/84729f7edd0e404b9e08ff68c2644613/dpdk/mk/rte.sdkroot.mk:92: install] Error 2


*Makefile Build Failed #15:
OS: SUSE15-64
Target: x86_64-native-linuxapp-gcc
Traceback (most recent call last):
  File "/root/SUSE15-64_K4.12.14_GCC7.3.1/x86_64-native-linuxapp-gcc/84729f7edd0e404b9e08ff68c2644613/dpdk/buildtools/pmdinfogen.py", line 12, in <module>
    from elftools.elf.elffile import ELFFile
ModuleNotFoundError: No module named 'elftools'
Traceback (most recent call last):
  File "/root/SUSE15-64_K4.12.14_GCC7.3.1/x86_64-native-linuxapp-gcc/84729f7edd0e404b9e08ff68c2644613/dpdk/buildtools/pmdinfogen.py", line 12, in <module>
    from elftools.elf.elffile import ELFFile
ModuleNotFoundError: No module named 'elftools'
make[6]: *** [/root/SUSE15-64_K4.12.14_GCC7.3.1/x86_64-native-linuxapp-gcc/84729f7edd0e404b9e08ff68c2644613/dpdk/mk/internal/rte.compile-pre.mk:114: portal/dpaa2_hw_dpbp.o] Error 1
Traceback (most recent call last):
  File "/root/SUSE15-64_K4.12.14_GCC7.3.1/x86_64-native-linuxapp-gcc/84729f7edd0e404b9e08ff68c2644613/dpdk/buildtools/pmdinfogen.py", line 12, in <module>
    from elftools.elf.elffile import ELFFile
ModuleNotFoundError: No module named 'elftools'
make[6]: *** Waiting for unfinished jobs....
make[6]: *** [/root/SUSE15-64_K4.12.14_GCC7.3.1/x86_64-native-linuxapp-gcc/84729f7edd0e404b9e08ff68c2644613/dpdk/mk/internal/rte.compile-pre.mk:114: portal/dpaa2_hw_dpio.o] Error 1
make[6]: *** [/root/SUSE15-64_K4.12.14_GCC7.3.1/x86_64-native-linuxapp-gcc/84729f7edd0e404b9e08ff68c2644613/dpdk/mk/internal/rte.compile-pre.mk:114: portal/dpaa2_hw_dpci.o] Error 1
  CC base/qbman/qman.o
  CC base/qbman/qman_driver.o
  CC base/qbman/dpaa_alloc.o
--
  CC base/qbman/dpaa_sys.o
  LD [M]  /root/SUSE15-64_K4.12.14_GCC7.3.1/x86_64-native-linuxapp-gcc/84729f7edd0e404b9e08ff68c2644613/dpdk/x86_64-native-linuxapp-gcc/build/kernel/linux/igb_uio/igb_uio.ko
INSTALL-MODULE igb_uio.ko
make[5]: *** [/root/SUSE15-64_K4.12.14_GCC7.3.1/x86_64-native-linuxapp-gcc/84729f7edd0e404b9e08ff68c2644613/dpdk/mk/rte.subdir.mk:35: fslmc] Error 2
make[5]: *** Waiting for unfinished jobs....
  AR librte_bus_dpaa.a
  INSTALL-LIB librte_bus_dpaa.a
make[4]: *** [/root/SUSE15-64_K4.12.14_GCC7.3.1/x86_64-native-linuxapp-gcc/84729f7edd0e404b9e08ff68c2644613/dpdk/mk/rte.subdir.mk:37: bus] Error 2
make[3]: *** [/root/SUSE15-64_K4.12.14_GCC7.3.1/x86_64-native-linuxapp-gcc/84729f7edd0e404b9e08ff68c2644613/dpdk/mk/rte.sdkbuild.mk:51: drivers] Error 2
make[2]: *** [/root/SUSE15-64_K4.12.14_GCC7.3.1/x86_64-native-linuxapp-gcc/84729f7edd0e404b9e08ff68c2644613/dpdk/mk/rte.sdkroot.mk:115: all] Error 2
make[1]: *** [/root/SUSE15-64_K4.12.14_GCC7.3.1/x86_64-native-linuxapp-gcc/84729f7edd0e404b9e08ff68c2644613/dpdk/mk/rte.sdkinstall.mk:61: pre_install] Error 2
make: *** [/root/SUSE15-64_K4.12.14_GCC7.3.1/x86_64-native-linuxapp-gcc/84729f7edd0e404b9e08ff68c2644613/dpdk/mk/rte.sdkroot.mk:92: install] Error 2


*Makefile Build Failed #16:
OS: UB1804-64
Target: x86_64-native-linuxapp-gcc
Traceback (most recent call last):
  File "/root/UB1804-64_K4.15.0_GCC7.3.0/x86_64-native-linuxapp-gcc/84729f7edd0e404b9e08ff68c2644613/dpdk/buildtools/pmdinfogen.py", line 12, in <module>
    from elftools.elf.elffile import ELFFile
ModuleNotFoundError: No module named 'elftools'
Traceback (most recent call last):
  File "/root/UB1804-64_K4.15.0_GCC7.3.0/x86_64-native-linuxapp-gcc/84729f7edd0e404b9e08ff68c2644613/dpdk/buildtools/pmdinfogen.py", line 12, in <module>
    from elftools.elf.elffile import ELFFile
ModuleNotFoundError: No module named 'elftools'
/root/UB1804-64_K4.15.0_GCC7.3.0/x86_64-native-linuxapp-gcc/84729f7edd0e404b9e08ff68c2644613/dpdk/mk/internal/rte.compile-pre.mk:114: recipe for target 'portal/dpaa2_hw_dpci.o' failed
make[6]: *** [portal/dpaa2_hw_dpci.o] Error 1
make[6]: *** Waiting for unfinished jobs....
Traceback (most recent call last):
  File "/root/UB1804-64_K4.15.0_GCC7.3.0/x86_64-native-linuxapp-gcc/84729f7edd0e404b9e08ff68c2644613/dpdk/buildtools/pmdinfogen.py", line 12, in <module>
    from elftools.elf.elffile import ELFFile
ModuleNotFoundError: No module named 'elftools'
/root/UB1804-64_K4.15.0_GCC7.3.0/x86_64-native-linuxapp-gcc/84729f7edd0e404b9e08ff68c2644613/dpdk/mk/internal/rte.compile-pre.mk:114: recipe for target 'portal/dpaa2_hw_dpio.o' failed
make[6]: *** [portal/dpaa2_hw_dpio.o] Error 1
/root/UB1804-64_K4.15.0_GCC7.3.0/x86_64-native-linuxapp-gcc/84729f7edd0e404b9e08ff68c2644613/dpdk/mk/internal/rte.compile-pre.mk:114: recipe for target 'portal/dpaa2_hw_dpbp.o' failed
make[6]: *** [portal/dpaa2_hw_dpbp.o] Error 1
/root/UB1804-64_K4.15.0_GCC7.3.0/x86_64-native-linuxapp-gcc/84729f7edd0e404b9e08ff68c2644613/dpdk/mk/rte.subdir.mk:35: recipe for target 'fslmc' failed
make[5]: *** [fslmc] Error 2
make[5]: *** Waiting for unfinished jobs....
  AR librte_bus_dpaa.a
  INSTALL-LIB librte_bus_dpaa.a
/root/UB1804-64_K4.15.0_GCC7.3.0/x86_64-native-linuxapp-gcc/84729f7edd0e404b9e08ff68c2644613/dpdk/mk/rte.subdir.mk:35: recipe for target 'bus' failed
make[4]: *** [bus] Error 2
/root/UB1804-64_K4.15.0_GCC7.3.0/x86_64-native-linuxapp-gcc/84729f7edd0e404b9e08ff68c2644613/dpdk/mk/rte.sdkbuild.mk:51: recipe for target 'drivers' failed
make[3]: *** [drivers] Error 2
make[3]: *** Waiting for unfinished jobs....
  Building modules, stage 2.
  MODPOST 1 modules
  CC      /root/UB1804-64_K4.15.0_GCC7.3.0/x86_64-native-linuxapp-gcc/84729f7edd0e404b9e08ff68c2644613/dpdk/x86_64-native-linuxapp-gcc/build/kernel/linux/igb_uio/igb_uio.mod.o
  LD [M]  /root/UB1804-64_K4.15.0_GCC7.3.0/x86_64-native-linuxapp-gcc/84729f7edd0e404b9e08ff68c2644613/dpdk/x86_64-native-linuxapp-gcc/build/kernel/linux/igb_uio/igb_uio.ko
INSTALL-MODULE igb_uio.ko
/root/UB1804-64_K4.15.0_GCC7.3.0/x86_64-native-linuxapp-gcc/84729f7edd0e404b9e08ff68c2644613/dpdk/mk/rte.sdkroot.mk:113: recipe for target 'all' failed
make[2]: *** [all] Error 2
/root/UB1804-64_K4.15.0_GCC7.3.0/x86_64-native-linuxapp-gcc/84729f7edd0e404b9e08ff68c2644613/dpdk/mk/rte.sdkinstall.mk:60: recipe for target 'pre_install' failed
make[1]: *** [pre_install] Error 2
/root/UB1804-64_K4.15.0_GCC7.3.0/x86_64-native-linuxapp-gcc/84729f7edd0e404b9e08ff68c2644613/dpdk/mk/rte.sdkroot.mk:92: recipe for target 'install' failed
make: *** [install] Error 2


*Makefile Build Failed #17:
OS: UB2004-32
Target: i686-native-linuxapp-gcc
Traceback (most recent call last):
  File "/root/UB2004-32_K4.15.0_GCC9.3.0/i686-native-linuxapp-gcc/84729f7edd0e404b9e08ff68c2644613/dpdk/buildtools/pmdinfogen.py", line 12, in <module>
    from elftools.elf.elffile import ELFFile
ModuleNotFoundError: No module named 'elftools'
Traceback (most recent call last):
  File "/root/UB2004-32_K4.15.0_GCC9.3.0/i686-native-linuxapp-gcc/84729f7edd0e404b9e08ff68c2644613/dpdk/buildtools/pmdinfogen.py", line 12, in <module>
    from elftools.elf.elffile import ELFFile
ModuleNotFoundError: No module named 'elftools'
Traceback (most recent call last):
  File "/root/UB2004-32_K4.15.0_GCC9.3.0/i686-native-linuxapp-gcc/84729f7edd0e404b9e08ff68c2644613/dpdk/buildtools/pmdinfogen.py", line 12, in <module>
    from elftools.elf.elffile import ELFFile
ModuleNotFoundError: No module named 'elftools'
make[6]: *** [/root/UB2004-32_K4.15.0_GCC9.3.0/i686-native-linuxapp-gcc/84729f7edd0e404b9e08ff68c2644613/dpdk/mk/internal/rte.compile-pre.mk:114: portal/dpaa2_hw_dpbp.o] Error 1
make[6]: *** Waiting for unfinished jobs....
make[6]: *** [/root/UB2004-32_K4.15.0_GCC9.3.0/i686-native-linuxapp-gcc/84729f7edd0e404b9e08ff68c2644613/dpdk/mk/internal/rte.compile-pre.mk:114: portal/dpaa2_hw_dpci.o] Error 1
make[6]: *** [/root/UB2004-32_K4.15.0_GCC9.3.0/i686-native-linuxapp-gcc/84729f7edd0e404b9e08ff68c2644613/dpdk/mk/internal/rte.compile-pre.mk:114: portal/dpaa2_hw_dpio.o] Error 1
  AR librte_bus_dpaa.a
  INSTALL-LIB librte_bus_dpaa.a
make[5]: *** [/root/UB2004-32_K4.15.0_GCC9.3.0/i686-native-linuxapp-gcc/84729f7edd0e404b9e08ff68c2644613/dpdk/mk/rte.subdir.mk:35: fslmc] Error 2
make[4]: *** [/root/UB2004-32_K4.15.0_GCC9.3.0/i686-native-linuxapp-gcc/84729f7edd0e404b9e08ff68c2644613/dpdk/mk/rte.subdir.mk:37: bus] Error 2
make[3]: *** [/root/UB2004-32_K4.15.0_GCC9.3.0/i686-native-linuxapp-gcc/84729f7edd0e404b9e08ff68c2644613/dpdk/mk/rte.sdkbuild.mk:51: drivers] Error 2
make[2]: *** [/root/UB2004-32_K4.15.0_GCC9.3.0/i686-native-linuxapp-gcc/84729f7edd0e404b9e08ff68c2644613/dpdk/mk/rte.sdkroot.mk:115: all] Error 2
make[1]: *** [/root/UB2004-32_K4.15.0_GCC9.3.0/i686-native-linuxapp-gcc/84729f7edd0e404b9e08ff68c2644613/dpdk/mk/rte.sdkinstall.mk:61: pre_install] Error 2
make: *** [/root/UB2004-32_K4.15.0_GCC9.3.0/i686-native-linuxapp-gcc/84729f7edd0e404b9e08ff68c2644613/dpdk/mk/rte.sdkroot.mk:92: install] Error 2


*Makefile Build Failed #18:
OS: UB2004-64
Target: x86_64-native-linuxapp-clang
Traceback (most recent call last):
  File "/root/UB2004-64_K5.4.0_Clang10.0.0/x86_64-native-linuxapp-clang/84729f7edd0e404b9e08ff68c2644613/dpdk/buildtools/pmdinfogen.py", line 12, in <module>
    from elftools.elf.elffile import ELFFile
ModuleNotFoundError: No module named 'elftools'
Traceback (most recent call last):
  File "/root/UB2004-64_K5.4.0_Clang10.0.0/x86_64-native-linuxapp-clang/84729f7edd0e404b9e08ff68c2644613/dpdk/buildtools/pmdinfogen.py", line 12, in <module>
    from elftools.elf.elffile import ELFFile
ModuleNotFoundError: No module named 'elftools'
make[6]: *** [/root/UB2004-64_K5.4.0_Clang10.0.0/x86_64-native-linuxapp-clang/84729f7edd0e404b9e08ff68c2644613/dpdk/mk/internal/rte.compile-pre.mk:114: portal/dpaa2_hw_dpbp.o] Error 1
make[6]: *** Waiting for unfinished jobs....
make[6]: *** [/root/UB2004-64_K5.4.0_Clang10.0.0/x86_64-native-linuxapp-clang/84729f7edd0e404b9e08ff68c2644613/dpdk/mk/internal/rte.compile-pre.mk:114: portal/dpaa2_hw_dpio.o] Error 1
Traceback (most recent call last):
  File "/root/UB2004-64_K5.4.0_Clang10.0.0/x86_64-native-linuxapp-clang/84729f7edd0e404b9e08ff68c2644613/dpdk/buildtools/pmdinfogen.py", line 12, in <module>
    from elftools.elf.elffile import ELFFile
ModuleNotFoundError: No module named 'elftools'
  AR librte_bus_dpaa.a
  INSTALL-LIB librte_bus_dpaa.a
make[6]: warning:  Clock skew detected.  Your build may be incomplete.
make[6]: *** [/root/UB2004-64_K5.4.0_Clang10.0.0/x86_64-native-linuxapp-clang/84729f7edd0e404b9e08ff68c2644613/dpdk/mk/internal/rte.compile-pre.mk:114: portal/dpaa2_hw_dpci.o] Error 1
make[5]: *** [/root/UB2004-64_K5.4.0_Clang10.0.0/x86_64-native-linuxapp-clang/84729f7edd0e404b9e08ff68c2644613/dpdk/mk/rte.subdir.mk:35: fslmc] Error 2
make[4]: *** [/root/UB2004-64_K5.4.0_Clang10.0.0/x86_64-native-linuxapp-clang/84729f7edd0e404b9e08ff68c2644613/dpdk/mk/rte.subdir.mk:37: bus] Error 2
make[3]: *** [/root/UB2004-64_K5.4.0_Clang10.0.0/x86_64-native-linuxapp-clang/84729f7edd0e404b9e08ff68c2644613/dpdk/mk/rte.sdkbuild.mk:51: drivers] Error 2
make[2]: *** [/root/UB2004-64_K5.4.0_Clang10.0.0/x86_64-native-linuxapp-clang/84729f7edd0e404b9e08ff68c2644613/dpdk/mk/rte.sdkroot.mk:115: all] Error 2
make[1]: *** [/root/UB2004-64_K5.4.0_Clang10.0.0/x86_64-native-linuxapp-clang/84729f7edd0e404b9e08ff68c2644613/dpdk/mk/rte.sdkinstall.mk:61: pre_install] Error 2
make: *** [/root/UB2004-64_K5.4.0_Clang10.0.0/x86_64-native-linuxapp-clang/84729f7edd0e404b9e08ff68c2644613/dpdk/mk/rte.sdkroot.mk:92: install] Error 2


*Makefile Build Failed #19:
OS: UB2004-64
Target: x86_64-native-linuxapp-gcc
Traceback (most recent call last):
  File "/root/UB2004-64_K5.4.0_GCC9.3.0/x86_64-native-linuxapp-gcc/84729f7edd0e404b9e08ff68c2644613/dpdk/buildtools/pmdinfogen.py", line 12, in <module>
    from elftools.elf.elffile import ELFFile
ModuleNotFoundError: No module named 'elftools'
Traceback (most recent call last):
  File "/root/UB2004-64_K5.4.0_GCC9.3.0/x86_64-native-linuxapp-gcc/84729f7edd0e404b9e08ff68c2644613/dpdk/buildtools/pmdinfogen.py", line 12, in <module>
    from elftools.elf.elffile import ELFFile
ModuleNotFoundError: No module named 'elftools'
make[6]: *** [/root/UB2004-64_K5.4.0_GCC9.3.0/x86_64-native-linuxapp-gcc/84729f7edd0e404b9e08ff68c2644613/dpdk/mk/internal/rte.compile-pre.mk:114: portal/dpaa2_hw_dpci.o] Error 1
make[6]: *** Waiting for unfinished jobs....
Traceback (most recent call last):
  File "/root/UB2004-64_K5.4.0_GCC9.3.0/x86_64-native-linuxapp-gcc/84729f7edd0e404b9e08ff68c2644613/dpdk/buildtools/pmdinfogen.py", line 12, in <module>
    from elftools.elf.elffile import ELFFile
ModuleNotFoundError: No module named 'elftools'
make[6]: *** [/root/UB2004-64_K5.4.0_GCC9.3.0/x86_64-native-linuxapp-gcc/84729f7edd0e404b9e08ff68c2644613/dpdk/mk/internal/rte.compile-pre.mk:114: portal/dpaa2_hw_dpbp.o] Error 1
make[6]: *** [/root/UB2004-64_K5.4.0_GCC9.3.0/x86_64-native-linuxapp-gcc/84729f7edd0e404b9e08ff68c2644613/dpdk/mk/internal/rte.compile-pre.mk:114: portal/dpaa2_hw_dpio.o] Error 1
  AR librte_bus_dpaa.a
  INSTALL-LIB librte_bus_dpaa.a
make[5]: *** [/root/UB2004-64_K5.4.0_GCC9.3.0/x86_64-native-linuxapp-gcc/84729f7edd0e404b9e08ff68c2644613/dpdk/mk/rte.subdir.mk:35: fslmc] Error 2
make[4]: *** [/root/UB2004-64_K5.4.0_GCC9.3.0/x86_64-native-linuxapp-gcc/84729f7edd0e404b9e08ff68c2644613/dpdk/mk/rte.subdir.mk:37: bus] Error 2
make[3]: *** [/root/UB2004-64_K5.4.0_GCC9.3.0/x86_64-native-linuxapp-gcc/84729f7edd0e404b9e08ff68c2644613/dpdk/mk/rte.sdkbuild.mk:51: drivers] Error 2
make[2]: *** [/root/UB2004-64_K5.4.0_GCC9.3.0/x86_64-native-linuxapp-gcc/84729f7edd0e404b9e08ff68c2644613/dpdk/mk/rte.sdkroot.mk:115: all] Error 2
make[1]: *** [/root/UB2004-64_K5.4.0_GCC9.3.0/x86_64-native-linuxapp-gcc/84729f7edd0e404b9e08ff68c2644613/dpdk/mk/rte.sdkinstall.mk:61: pre_install] Error 2
make: *** [/root/UB2004-64_K5.4.0_GCC9.3.0/x86_64-native-linuxapp-gcc/84729f7edd0e404b9e08ff68c2644613/dpdk/mk/rte.sdkroot.mk:92: install] Error 2


*Makefile Build Failed #20:
OS: UB2004-64
Target: x86_64-native-linuxapp-icc
Traceback (most recent call last):
  File "/root/UB2004-64_K5.4.0_ICC19.1.0/x86_64-native-linuxapp-icc/84729f7edd0e404b9e08ff68c2644613/dpdk/buildtools/pmdinfogen.py", line 12, in <module>
    from elftools.elf.elffile import ELFFile
ModuleNotFoundError: No module named 'elftools'
Traceback (most recent call last):
  File "/root/UB2004-64_K5.4.0_ICC19.1.0/x86_64-native-linuxapp-icc/84729f7edd0e404b9e08ff68c2644613/dpdk/buildtools/pmdinfogen.py", line 12, in <module>
    from elftools.elf.elffile import ELFFile
ModuleNotFoundError: No module named 'elftools'
Traceback (most recent call last):
  File "/root/UB2004-64_K5.4.0_ICC19.1.0/x86_64-native-linuxapp-icc/84729f7edd0e404b9e08ff68c2644613/dpdk/buildtools/pmdinfogen.py", line 12, in <module>
    from elftools.elf.elffile import ELFFile
ModuleNotFoundError: No module named 'elftools'
make[6]: *** [/root/UB2004-64_K5.4.0_ICC19.1.0/x86_64-native-linuxapp-icc/84729f7edd0e404b9e08ff68c2644613/dpdk/mk/internal/rte.compile-pre.mk:114: portal/dpaa2_hw_dpio.o] Error 1
make[6]: *** Waiting for unfinished jobs....
make[6]: *** [/root/UB2004-64_K5.4.0_ICC19.1.0/x86_64-native-linuxapp-icc/84729f7edd0e404b9e08ff68c2644613/dpdk/mk/internal/rte.compile-pre.mk:114: portal/dpaa2_hw_dpci.o] Error 1
make[6]: *** [/root/UB2004-64_K5.4.0_ICC19.1.0/x86_64-native-linuxapp-icc/84729f7edd0e404b9e08ff68c2644613/dpdk/mk/internal/rte.compile-pre.mk:114: portal/dpaa2_hw_dpbp.o] Error 1
make[5]: *** [/root/UB2004-64_K5.4.0_ICC19.1.0/x86_64-native-linuxapp-icc/84729f7edd0e404b9e08ff68c2644613/dpdk/mk/rte.subdir.mk:35: fslmc] Error 2
make[4]: *** [/root/UB2004-64_K5.4.0_ICC19.1.0/x86_64-native-linuxapp-icc/84729f7edd0e404b9e08ff68c2644613/dpdk/mk/rte.subdir.mk:37: bus] Error 2
make[3]: *** [/root/UB2004-64_K5.4.0_ICC19.1.0/x86_64-native-linuxapp-icc/84729f7edd0e404b9e08ff68c2644613/dpdk/mk/rte.sdkbuild.mk:51: drivers] Error 2
make[2]: *** [/root/UB2004-64_K5.4.0_ICC19.1.0/x86_64-native-linuxapp-icc/84729f7edd0e404b9e08ff68c2644613/dpdk/mk/rte.sdkroot.mk:115: all] Error 2
make[1]: *** [/root/UB2004-64_K5.4.0_ICC19.1.0/x86_64-native-linuxapp-icc/84729f7edd0e404b9e08ff68c2644613/dpdk/mk/rte.sdkinstall.mk:61: pre_install] Error 2
make: *** [/root/UB2004-64_K5.4.0_ICC19.1.0/x86_64-native-linuxapp-icc/84729f7edd0e404b9e08ff68c2644613/dpdk/mk/rte.sdkroot.mk:92: install] Error 2
DPDK STV team


More information about the test-report mailing list