[dpdk-test-report] |FAILURE| pw67495[v3] examples/vhost: add vhostpmd support

sys_stv at intel.com sys_stv at intel.com
Tue Mar 31 20:10:15 CEST 2020


Test-Label: Intel-compilation
Test-Status: FAILURE
http://dpdk.org/patch/67495

_Compilation issues_

Submitter: Sivaprasad Tummala <Sivaprasad.Tummala at intel.com>
Date: 2020-03-31 16:25:02
Reply_mail: 20200331162502.73394-1-Sivaprasad.Tummala at intel.com
DPDK git baseline: Repo:dpdk-next-virtio, CommitID: 545cd4f422ecc60e0470d0576deb29291f0ff9b9

Makefile build Summary: 23 Builds Done, 23 Successful, 0 Failures

Meson build Summary: 8 Builds Done, 3 Successful, 5 Failures

               +==============================================+===========+==========+
               |                   Makefile                   |   Meson   | Document |
+----------------+------+-------+------+------------+-----------+-----------+----------+
| os             | gcc  | clang | icc  | gcc+shared | gcc+debug | gcc/clang | pdf/html |
+----------------+------+-------+------+------------+-----------+-----------+----------+
| RHEL80-64      | pass |       |      |            |           |           |          |
| UB1804-64      | pass | pass  | pass |            |           | FAIL      | pass     |
| UB1604-32      | pass |       |      |            |           | FAIL      |          |
| CENTOS77-64    | pass | pass  | pass | pass       | pass      | FAIL      |          |
| UB1604-64      | pass | pass  |      |            |           |           |          |
| WIN10-64       |      |       |      |            |           | pass      |          |
| UB1910-64      | pass |       |      |            |           |           |          |
| FC31-64        | pass | pass  |      |            |           | FAIL      |          |
| CENTOS80-64    | pass |       |      |            |           |           |          |
| FreeBSD1201-64 | pass | pass  |      | pass       | pass      | pass      |          |
| RHEL77-64      | pass |       |      |            |           |           |          |
| SUSE15-64      | pass | pass  |      |            |           | FAIL      |          |
+----------------+------+-------+------+------------+-----------+-----------+----------+

Test environment and configuration as below:

** Makefile build **


OS: UB1804-64
	Kernel Version: 4.15.0-20-generic
	CPU info: Intel(R) Xeon(R) CPU E5-2699 v3 @ 2.30GHz
	GCC Version: gcc (Ubuntu 7.3.0-16ubuntu3) 7.3.0
	Clang Version: 6.0.0-1ubuntu2 (tags/RELEASE_600/final)
	x86_64-native-linuxapp-clang
	x86_64-native-linuxapp-icc
	x86_64-native-linuxapp-gcc


OS: UB1604-32
	Kernel Version: 4.4.0-131-generic
	CPU info: Intel(R) Xeon(R) Platinum 8180 CPU @ 2.50GHz
	GCC Version: gcc (Ubuntu 5.4.0-6ubuntu1~16.04.11) 5.4.0 20160609
	Clang Version: 3.8.0-2ubuntu4 (tags/RELEASE_380/final)
	i686-native-linuxapp-gcc


OS: CENTOS77-64
	Kernel Version: 3.10.0-1062.9.1.el7.x86_64
	CPU info: Intel(R) Xeon(R) CPU E5-2699 v3 @ 2.30GHz
	GCC Version: gcc (GCC) 4.8.5 20150623 (Red Hat 4.8.5-39)
	Clang Version: 3.4.2 (tags/RELEASE_34/dot2-final)
	x86_64-native-linuxapp-clang
	x86_64-native-linuxapp-gcc+shared
	x86_64-native-linuxapp-gcc
	x86_64-native-linuxapp-gcc+debug
	x86_64-native-linuxapp-icc


OS: UB1604-64
	Kernel Version: 4.4.0-176-generic
	CPU info: Intel(R) Xeon(R) CPU E5-2699 v3 @ 2.30GHz
	GCC Version: gcc (Ubuntu 5.4.0-6ubuntu1~16.04.12) 5.4.0 20160609
	Clang Version: 3.8.0-2ubuntu4 (tags/RELEASE_380/final)
	x86_64-native-linuxapp-clang
	x86_64-native-linuxapp-gcc


OS: CENTOS80-64
	Kernel Version: 4.18.0-80.11.2.el8_0.x86_64
	CPU info: Intel(R) Xeon(R) CPU E5-2699 v3 @ 2.30GHz
	GCC Version: gcc (GCC) 8.2.1 20180905 (Red Hat 8.2.1-3)
	Clang Version: 7.0.1 (tags/RELEASE_701/final)
	x86_64-native-linuxapp-gcc


OS: UB1910-64
	Kernel Version: 5.3.0-18-generic
	CPU info: Intel(R) Xeon(R) Platinum 8180 CPU @ 2.50GHz
	GCC Version: gcc (Ubuntu 9.2.1-9ubuntu2) 9.2.1 20191008
	Clang Version: 9.0.0-2 (tags/RELEASE_900/final)
	x86_64-native-linuxapp-gcc


OS: FC31-64
	Kernel Version: 5.3.15-300.fc31.x86_64
	CPU info: Intel(R) Xeon(R) CPU E5-2699 v4 @ 2.20GHz
	GCC Version: gcc (GCC) 9.2.1 20190827 (Red Hat 9.2.1-1)
	Clang Version: 9.0.0 (Fedora 9.0.0-1.fc31)
	x86_64-native-linuxapp-gcc
	x86_64-native-linuxapp-clang


OS: RHEL80-64
	Kernel Version: 4.18.0-80.el8.x86_64
	CPU info: Intel(R) Xeon(R) CPU E5-2699 v4 @ 2.20GHz
	GCC Version: gcc (GCC) 8.2.1 20180905 (Red Hat 8.2.1-3)
	Clang Version: 6.0.1 (tags/RELEASE_601/final)
	x86_64-native-linuxapp-gcc


OS: FreeBSD1201-64
	Kernel Version: 12.1-RELEASE
	CPU info: Intel(R) Xeon(R) CPU E5-2699 v3 @ 2.30GHz (2294.74-MHz K8-class CPU)
	GCC Version: gcc (FreeBSD Ports Collection) 9.2.0
	Clang Version: 8.0.1 (tags/RELEASE_801/final 366581) (based on LLVM 8.0.1)
	x86_64-native-bsdapp-gcc
	x86_64-native-bsdapp-gcc+shared
	x86_64-native-bsdapp-gcc+debug
	x86_64-native-bsdapp-clang


OS: RHEL77-64
	Kernel Version: 3.10.0-1062.9.1.el7.x86_64
	CPU info: Intel(R) Xeon(R) CPU E5-2699 v4 @ 2.20GHz
	GCC Version: gcc (GCC) 4.8.5 20150623 (Red Hat 4.8.5-39)
	Clang Version: 3.4.2 (tags/RELEASE_34/dot2-final)
	x86_64-native-linuxapp-gcc


OS: SUSE15-64
	Kernel Version: 4.12.14-lp150.11-default
	CPU info: Intel(R) Xeon(R) CPU E5-2699 v4 @ 2.20GHz
	GCC Version: gcc (SUSE Linux) 7.3.1 20180323 [gcc-7-branch revision 258812]
	Clang Version: 5.0.1 (tags/RELEASE_501/final 312548)
	x86_64-native-linuxapp-gcc
	x86_64-native-linuxapp-clang


** Meson build **


OS: UB1804-64
	Kernel Version: 4.15.0-20-generic
	CPU info: Intel(R) Xeon(R) CPU E5-2699 v4 @ 2.20GHz
	GCC Version: gcc (Ubuntu 7.3.0-27ubuntu1~18.04) 7.3.0
	Clang Version: 6.0.0-1ubuntu2 (tags/RELEASE_600/final)
	x86_64-native-linuxapp-doc
	./build-gcc-static
	./build-gcc-shared
	./build-clang-static
	./build-clang-shared
	./build-x86-default


OS: UB1604-32
	Kernel Version: 4.4.0-131-generic
	CPU info: Intel(R) Xeon(R) CPU E5-2699 v4 @ 2.20GHz
	GCC Version: gcc (Ubuntu 5.4.0-6ubuntu1~16.04.11) 5.4.0 20160609
	Clang Version: 3.8.0-2ubuntu4 (tags/RELEASE_380/final)
	./build-gcc-static
	./build-gcc-shared
	./build-clang-static
	./build-clang-shared
	./build-x86-default


OS: CENTOS77-64
	Kernel Version: 3.10.0-1062.12.1.el7.x86_64
	CPU info: Intel(R) Xeon(R) CPU E5-2699 v4 @ 2.20GHz
	GCC Version: gcc (GCC) 4.8.5 20150623 (Red Hat 4.8.5-39)
	Clang Version: 3.4.2 (tags/RELEASE_34/dot2-final)
	./build-gcc-static
	./build-gcc-shared
	./build-clang-static
	./build-clang-shared
	./build-x86-default


OS: WIN10-64
	Kernel Version: N/A
	CPU info: N/A
	GCC Version: N/A
	Clang Version: Clang 8.0.0
	x86_64-windows-clang


OS: FC31-64
	Kernel Version: 5.4.18-200.fc31.x86_64
	CPU info: Intel(R) Xeon(R) CPU E5-2699 v4 @ 2.20GHz
	GCC Version: gcc (GCC) 9.2.1 20190827 (Red Hat 9.2.1-1)
	Clang Version: 9.0.0 (Fedora 9.0.0-1.fc31)
	./build-gcc-static
	./build-gcc-shared
	./build-clang-static
	./build-clang-shared
	./build-x86-default


OS: FreeBSD1201-64
	Kernel Version: 12.1-RELEASE
	CPU info: Intel(R) Xeon(R) CPU E5-2699 v4 @ 2.20GHz (2194.98-MHz K8-class CPU)
	GCC Version: gcc (FreeBSD Ports Collection) 9.2.0
	Clang Version: 8.0.1 (tags/RELEASE_801/final 366581) (based on LLVM 8.0.1)
	./build-gcc-static
	./build-gcc-shared
	./build-clang-static
	./build-clang-shared
	./build-x86-default


OS: SUSE15-64
	Kernel Version: 4.12.14-lp150.12.82-default
	CPU info: Intel(R) Xeon(R) CPU E5-2699 v4 @ 2.20GHz
	GCC Version: gcc (SUSE Linux) 7.4.1 20190905 [gcc-7-branch revision 275407]
	Clang Version: 5.0.1 (tags/RELEASE_501/final 312548)
	./build-gcc-static
	./build-gcc-shared
	./build-clang-static
	./build-clang-shared
	./build-x86-default


*Meson Build Failed #1:
OS: CENTOS77-64
Target:./build-gcc-static
FAILED: examples/c590b3c@@dpdk-vhost at exe/vhost_main.c.o 
gcc -Iexamples/c590b3c@@dpdk-vhost at exe -Iexamples -I../examples -Iexamples/vhost -I../examples/vhost -I. -I../ -Iconfig -I../config -Ilib/librte_eal/common/include -I../lib/librte_eal/common/include -I../lib/librte_eal/linux/eal/include -Ilib/librte_eal/common -I../lib/librte_eal/common -Ilib/librte_eal/common/include/arch/x86 -I../lib/librte_eal/common/include/arch/x86 -Ilib/librte_eal -I../lib/librte_eal -Ilib/librte_kvargs -I../lib/librte_kvargs -Ilib/librte_mempool -I../lib/librte_mempool -Ilib/librte_ring -I../lib/librte_ring -Ilib/librte_net -I../lib/librte_net -Ilib/librte_mbuf -I../lib/librte_mbuf -Ilib/librte_ethdev -I../lib/librte_ethdev -Ilib/librte_meter -I../lib/librte_meter -Ilib/librte_cmdline -I../lib/librte_cmdline -Ilib/librte_vhost -I../lib/librte_vhost -Ilib/librte_cryptodev -I../lib/librte_cryptodev -Ilib/librte_hash -I../lib/librte_hash -Ilib/librte_pci -I../lib/librte_pci -pipe -D_FILE_OFFSET_BITS=64 -Wall -Winvalid-pch -Werror -O2 -g -include rte_config.h -Wextra -Wcast-qual -Wdeprecated -Wformat-nonliteral -Wformat-security -Wmissing-declarations -Wmissing-prototypes -Wnested-externs -Wold-style-definition -Wpointer-arith -Wsign-compare -Wstrict-prototypes -Wundef -Wwrite-strings -Wno-missing-field-initializers -D_GNU_SOURCE -march=native -DALLOW_EXPERIMENTAL_API -MD -MQ 'examples/c590b3c@@dpdk-vhost at exe/vhost_main.c.o' -MF 'examples/c590b3c@@dpdk-vhost at exe/vhost_main.c.o.d' -o 'examples/c590b3c@@dpdk-vhost at exe/vhost_main.c.o' -c ../examples/vhost/main.c
../examples/vhost/main.c: In function ‘unregister_drivers’:
../examples/vhost/main.c:253:13: error: ‘struct vhost_dev’ has no member named ‘eth_dev_id’
     if (vdev->eth_dev_id == port_id) {
             ^
../examples/vhost/main.c: In function ‘drain_eth_rx’:
../examples/vhost/main.c:1232:40: error: ‘struct vhost_dev’ has no member named ‘eth_dev_id’
   enqueue_count = rte_eth_tx_burst(vdev->eth_dev_id, 0,
                                        ^
../examples/vhost/main.c:1239:10: error: ‘struct vhost_dev’ has no member named ‘eth_dev_id’
      vdev->eth_dev_id, 0,
          ^
../examples/vhost/main.c: In function ‘drain_virtio_tx’:
../examples/vhost/main.c:1295:32: error: ‘struct vhost_dev’ has no member named ‘eth_dev_id’
   count = rte_eth_rx_burst(vdev->eth_dev_id,
                                ^
../examples/vhost/main.c: In function ‘vhost_device_attach_callback’:
../examples/vhost/main.c:1536:6: error: ‘struct vhost_dev’ has no member named ‘eth_dev_id’
  vdev->eth_dev_id = port_id;
      ^
[2160/2238] Compiling C object 'examples/c590b3c@@dpdk-efd_server at exe/server_node_efd_server_main.c.o'.
[2161/2238] Compiling C object 'examples/c590b3c@@dpdk-vhost_blk at exe/vhost_blk_blk.c.o'.
[2162/2238] Compiling C object 'examples/c590b3c@@dpdk-vmdq at exe/vmdq_main.c.o'.
[2163/2238] Compiling C object 'examples/c590b3c@@dpdk-vhost at exe/vhost_virtio_net.c.o'.
[2164/2238] Compiling C object 'examples/c590b3c@@dpdk-vmdq_dcb at exe/vmdq_dcb_main.c.o'.
[2165/2238] Compiling C object 'app/test/3062f5d@@dpdk-test at exe/test_memcpy_perf.c.o'.
[2166/2238] Compiling C object 'app/test/3062f5d@@dpdk-test at exe/test_ring.c.o'.
[2167/2238] Compiling C object 'drivers/a715181@@tmp_rte_pmd_octeontx2_event at sta/event_octeontx2_otx2_worker.c.o'.
[2168/2238] Compiling C object 'drivers/a715181@@tmp_rte_pmd_octeontx2_event at sta/event_octeontx2_otx2_worker_dual.c.o'.
ninja: build stopped: subcommand failed




*Meson Build Failed #2:
OS: UB1604-32
Target:./build-gcc-static
FAILED: examples/c590b3c@@dpdk-vhost at exe/vhost_main.c.o 
gcc -Iexamples/c590b3c@@dpdk-vhost at exe -Iexamples -I../examples -Iexamples/vhost -I../examples/vhost -I. -I../ -Iconfig -I../config -Ilib/librte_eal/common/include -I../lib/librte_eal/common/include -I../lib/librte_eal/linux/eal/include -Ilib/librte_eal/common -I../lib/librte_eal/common -Ilib/librte_eal/common/include/arch/x86 -I../lib/librte_eal/common/include/arch/x86 -Ilib/librte_eal -I../lib/librte_eal -Ilib/librte_kvargs -I../lib/librte_kvargs -Ilib/librte_mempool -I../lib/librte_mempool -Ilib/librte_ring -I../lib/librte_ring -Ilib/librte_net -I../lib/librte_net -Ilib/librte_mbuf -I../lib/librte_mbuf -Ilib/librte_ethdev -I../lib/librte_ethdev -Ilib/librte_meter -I../lib/librte_meter -Ilib/librte_cmdline -I../lib/librte_cmdline -Ilib/librte_vhost -I../lib/librte_vhost -Ilib/librte_cryptodev -I../lib/librte_cryptodev -Ilib/librte_hash -I../lib/librte_hash -Ilib/librte_pci -I../lib/librte_pci -fdiagnostics-color=always -pipe -D_FILE_OFFSET_BITS=64 -Wall -Winvalid-pch -Werror -O2 -g -include rte_config.h -Wextra -Wcast-qual -Wdeprecated -Wformat-nonliteral -Wformat-security -Wmissing-declarations -Wmissing-prototypes -Wnested-externs -Wold-style-definition -Wpointer-arith -Wsign-compare -Wstrict-prototypes -Wundef -Wwrite-strings -Wno-missing-field-initializers -Wno-pointer-to-int-cast -D_GNU_SOURCE -march=native -DALLOW_EXPERIMENTAL_API -MD -MQ 'examples/c590b3c@@dpdk-vhost at exe/vhost_main.c.o' -MF 'examples/c590b3c@@dpdk-vhost at exe/vhost_main.c.o.d' -o 'examples/c590b3c@@dpdk-vhost at exe/vhost_main.c.o' -c ../examples/vhost/main.c
../examples/vhost/main.c: In function ‘unregister_drivers’:
../examples/vhost/main.c:253:13: error: ‘struct vhost_dev’ has no member named ‘eth_dev_id’
     if (vdev->eth_dev_id == port_id) {
             ^
../examples/vhost/main.c: In function ‘drain_eth_rx’:
../examples/vhost/main.c:1232:40: error: ‘struct vhost_dev’ has no member named ‘eth_dev_id’
   enqueue_count = rte_eth_tx_burst(vdev->eth_dev_id, 0,
                                        ^
../examples/vhost/main.c:1239:10: error: ‘struct vhost_dev’ has no member named ‘eth_dev_id’
      vdev->eth_dev_id, 0,
          ^
../examples/vhost/main.c: In function ‘drain_virtio_tx’:
../examples/vhost/main.c:1295:32: error: ‘struct vhost_dev’ has no member named ‘eth_dev_id’
   count = rte_eth_rx_burst(vdev->eth_dev_id,
                                ^
../examples/vhost/main.c: In function ‘vhost_device_attach_callback’:
../examples/vhost/main.c:1536:6: error: ‘struct vhost_dev’ has no member named ‘eth_dev_id’
  vdev->eth_dev_id = port_id;
      ^
[1898/1972] Compiling C object 'examples/c590b3c@@dpdk-vdpa at exe/vdpa_main.c.o'.
[1899/1972] Compiling C object 'examples/c590b3c@@dpdk-vhost_blk at exe/vhost_blk_vhost_blk_compat.c.o'.
[1900/1972] Compiling C object 'examples/c590b3c@@dpdk-vmdq at exe/vmdq_main.c.o'.
[1901/1972] Compiling C object 'examples/c590b3c@@dpdk-vmdq_dcb at exe/vmdq_dcb_main.c.o'.
[1902/1972] Compiling C object 'examples/c590b3c@@dpdk-vhost at exe/vhost_virtio_net.c.o'.
[1903/1972] Compiling C object 'app/test/3062f5d@@dpdk-test at exe/test_ring.c.o'.
[1904/1972] Compiling C object 'drivers/a715181@@tmp_rte_pmd_octeontx2_event at sta/event_octeontx2_otx2_worker.c.o'.
[1905/1972] Compiling C object 'drivers/a715181@@tmp_rte_pmd_octeontx2_event at sta/event_octeontx2_otx2_worker_dual.c.o'.
ninja: build stopped: subcommand failed




*Meson Build Failed #3:
OS: FC31-64
Target:./build-gcc-static
FAILED: examples/c590b3c@@dpdk-vhost at exe/vhost_main.c.o 
gcc -Iexamples/c590b3c@@dpdk-vhost at exe -Iexamples -I../examples -Iexamples/vhost -I../examples/vhost -I. -I../ -Iconfig -I../config -Ilib/librte_eal/common/include -I../lib/librte_eal/common/include -I../lib/librte_eal/linux/eal/include -Ilib/librte_eal/common -I../lib/librte_eal/common -Ilib/librte_eal/common/include/arch/x86 -I../lib/librte_eal/common/include/arch/x86 -Ilib/librte_eal -I../lib/librte_eal -Ilib/librte_kvargs -I../lib/librte_kvargs -Ilib/librte_mempool -I../lib/librte_mempool -Ilib/librte_ring -I../lib/librte_ring -Ilib/librte_net -I../lib/librte_net -Ilib/librte_mbuf -I../lib/librte_mbuf -Ilib/librte_ethdev -I../lib/librte_ethdev -Ilib/librte_meter -I../lib/librte_meter -Ilib/librte_cmdline -I../lib/librte_cmdline -Ilib/librte_vhost -I../lib/librte_vhost -Ilib/librte_cryptodev -I../lib/librte_cryptodev -Ilib/librte_hash -I../lib/librte_hash -Ilib/librte_pci -I../lib/librte_pci -fdiagnostics-color=always -pipe -D_FILE_OFFSET_BITS=64 -Wall -Winvalid-pch -Werror -O2 -g -include rte_config.h -Wextra -Wcast-qual -Wdeprecated -Wformat-nonliteral -Wformat-security -Wmissing-declarations -Wmissing-prototypes -Wnested-externs -Wold-style-definition -Wpointer-arith -Wsign-compare -Wstrict-prototypes -Wundef -Wwrite-strings -Wno-address-of-packed-member -Wno-packed-not-aligned -Wno-missing-field-initializers -D_GNU_SOURCE -march=native -Wno-format-truncation -DALLOW_EXPERIMENTAL_API -MD -MQ 'examples/c590b3c@@dpdk-vhost at exe/vhost_main.c.o' -MF 'examples/c590b3c@@dpdk-vhost at exe/vhost_main.c.o.d' -o 'examples/c590b3c@@dpdk-vhost at exe/vhost_main.c.o' -c ../examples/vhost/main.c
../examples/vhost/main.c: In function ‘unregister_drivers’:
../examples/vhost/main.c:253:13: error: ‘struct vhost_dev’ has no member named ‘eth_dev_id’
  253 |     if (vdev->eth_dev_id == port_id) {
      |             ^~
../examples/vhost/main.c: In function ‘drain_eth_rx’:
../examples/vhost/main.c:1232:40: error: ‘struct vhost_dev’ has no member named ‘eth_dev_id’
 1232 |   enqueue_count = rte_eth_tx_burst(vdev->eth_dev_id, 0,
      |                                        ^~
../examples/vhost/main.c:1239:10: error: ‘struct vhost_dev’ has no member named ‘eth_dev_id’
 1239 |      vdev->eth_dev_id, 0,
      |          ^~
../examples/vhost/main.c: In function ‘drain_virtio_tx’:
../examples/vhost/main.c:1295:32: error: ‘struct vhost_dev’ has no member named ‘eth_dev_id’
 1295 |   count = rte_eth_rx_burst(vdev->eth_dev_id,
      |                                ^~
../examples/vhost/main.c: In function ‘vhost_device_attach_callback’:
../examples/vhost/main.c:1536:6: error: ‘struct vhost_dev’ has no member named ‘eth_dev_id’
 1536 |  vdev->eth_dev_id = port_id;
      |      ^~
[2169/2247] Compiling C object 'examples/c590b3c@@dpdk-vmdq_dcb at exe/vmdq_dcb_main.c.o'.
[2170/2247] Compiling C object 'examples/c590b3c@@dpdk-vhost_blk at exe/vhost_blk_vhost_blk_compat.c.o'.
[2171/2247] Compiling C object 'examples/c590b3c@@dpdk-vmdq at exe/vmdq_main.c.o'.
[2172/2247] Compiling C object 'examples/c590b3c@@dpdk-vhost_crypto at exe/vhost_crypto_main.c.o'.
[2173/2247] Compiling C object 'examples/c590b3c@@dpdk-vhost_blk at exe/vhost_blk_vhost_blk.c.o'.
[2174/2247] Compiling C object 'examples/c590b3c@@dpdk-vhost at exe/vhost_virtio_net.c.o'.
[2175/2247] Compiling C object 'app/test/3062f5d@@dpdk-test at exe/test_ring.c.o'.
[2176/2247] Compiling C object 'drivers/a715181@@tmp_rte_pmd_octeontx2_event at sta/event_octeontx2_otx2_worker.c.o'.
[2177/2247] Compiling C object 'drivers/a715181@@tmp_rte_pmd_octeontx2_event at sta/event_octeontx2_otx2_worker_dual.c.o'.
ninja: build stopped: subcommand failed




*Meson Build Failed #4:
OS: UB1804-64
Target:./build-gcc-static
FAILED: examples/c590b3c@@dpdk-vhost at exe/vhost_main.c.o 
gcc -Iexamples/c590b3c@@dpdk-vhost at exe -Iexamples -I../examples -Iexamples/vhost -I../examples/vhost -I. -I../ -Iconfig -I../config -Ilib/librte_eal/common/include -I../lib/librte_eal/common/include -I../lib/librte_eal/linux/eal/include -Ilib/librte_eal/common -I../lib/librte_eal/common -Ilib/librte_eal/common/include/arch/x86 -I../lib/librte_eal/common/include/arch/x86 -Ilib/librte_eal -I../lib/librte_eal -Ilib/librte_kvargs -I../lib/librte_kvargs -Ilib/librte_mempool -I../lib/librte_mempool -Ilib/librte_ring -I../lib/librte_ring -Ilib/librte_net -I../lib/librte_net -Ilib/librte_mbuf -I../lib/librte_mbuf -Ilib/librte_ethdev -I../lib/librte_ethdev -Ilib/librte_meter -I../lib/librte_meter -Ilib/librte_cmdline -I../lib/librte_cmdline -Ilib/librte_vhost -I../lib/librte_vhost -Ilib/librte_cryptodev -I../lib/librte_cryptodev -Ilib/librte_hash -I../lib/librte_hash -Ilib/librte_pci -I../lib/librte_pci -fdiagnostics-color=always -pipe -D_FILE_OFFSET_BITS=64 -Wall -Winvalid-pch -Werror -O2 -g -include rte_config.h -Wextra -Wcast-qual -Wdeprecated -Wformat-nonliteral -Wformat-security -Wmissing-declarations -Wmissing-prototypes -Wnested-externs -Wold-style-definition -Wpointer-arith -Wsign-compare -Wstrict-prototypes -Wundef -Wwrite-strings -Wno-missing-field-initializers -D_GNU_SOURCE -march=native -mno-avx512f -Wno-format-truncation -DALLOW_EXPERIMENTAL_API -MD -MQ 'examples/c590b3c@@dpdk-vhost at exe/vhost_main.c.o' -MF 'examples/c590b3c@@dpdk-vhost at exe/vhost_main.c.o.d' -o 'examples/c590b3c@@dpdk-vhost at exe/vhost_main.c.o' -c ../examples/vhost/main.c
../examples/vhost/main.c: In function ‘unregister_drivers’:
../examples/vhost/main.c:253:13: error: ‘struct vhost_dev’ has no member named ‘eth_dev_id’
     if (vdev->eth_dev_id == port_id) {
             ^~
../examples/vhost/main.c: In function ‘drain_eth_rx’:
../examples/vhost/main.c:1232:40: error: ‘struct vhost_dev’ has no member named ‘eth_dev_id’
   enqueue_count = rte_eth_tx_burst(vdev->eth_dev_id, 0,
                                        ^~
../examples/vhost/main.c:1239:10: error: ‘struct vhost_dev’ has no member named ‘eth_dev_id’
      vdev->eth_dev_id, 0,
          ^~
../examples/vhost/main.c: In function ‘drain_virtio_tx’:
../examples/vhost/main.c:1295:32: error: ‘struct vhost_dev’ has no member named ‘eth_dev_id’
   count = rte_eth_rx_burst(vdev->eth_dev_id,
                                ^~
../examples/vhost/main.c: In function ‘vhost_device_attach_callback’:
../examples/vhost/main.c:1536:6: error: ‘struct vhost_dev’ has no member named ‘eth_dev_id’
  vdev->eth_dev_id = port_id;
      ^~
[2075/2160] Compiling C object 'examples/c590b3c@@dpdk-timer at exe/timer_main.c.o'.
[2076/2160] Compiling C object 'examples/c590b3c@@dpdk-efd_node at exe/server_node_efd_node_node.c.o'.
[2077/2160] Compiling C object 'examples/c590b3c@@dpdk-vdpa at exe/vdpa_main.c.o'.
[2078/2160] Compiling C object 'examples/c590b3c@@dpdk-tep_termination at exe/tep_termination_vxlan.c.o'.
[2079/2160] Compiling C object 'examples/c590b3c@@dpdk-vhost_crypto at exe/vhost_crypto_main.c.o'.
[2080/2160] Compiling C object 'examples/c590b3c@@dpdk-tep_termination at exe/tep_termination_vxlan_setup.c.o'.
[2081/2160] Compiling C object 'drivers/a715181@@tmp_rte_pmd_octeontx2_event at sta/event_octeontx2_otx2_worker.c.o'.
[2082/2160] Compiling C object 'drivers/a715181@@tmp_rte_pmd_octeontx2_event at sta/event_octeontx2_otx2_worker_dual.c.o'.
[2083/2160] Compiling C object 'app/test/3062f5d@@dpdk-test at exe/test_ring.c.o'.
ninja: build stopped: subcommand failed




*Meson Build Failed #5:
OS: SUSE15-64
Target:./build-gcc-static
FAILED: examples/c590b3c@@dpdk-vhost at exe/vhost_main.c.o 
gcc -Iexamples/c590b3c@@dpdk-vhost at exe -Iexamples -I../examples -Iexamples/vhost -I../examples/vhost -I. -I../ -Iconfig -I../config -Ilib/librte_eal/common/include -I../lib/librte_eal/common/include -I../lib/librte_eal/linux/eal/include -Ilib/librte_eal/common -I../lib/librte_eal/common -Ilib/librte_eal/common/include/arch/x86 -I../lib/librte_eal/common/include/arch/x86 -Ilib/librte_eal -I../lib/librte_eal -Ilib/librte_kvargs -I../lib/librte_kvargs -Ilib/librte_mempool -I../lib/librte_mempool -Ilib/librte_ring -I../lib/librte_ring -Ilib/librte_net -I../lib/librte_net -Ilib/librte_mbuf -I../lib/librte_mbuf -Ilib/librte_ethdev -I../lib/librte_ethdev -Ilib/librte_meter -I../lib/librte_meter -Ilib/librte_cmdline -I../lib/librte_cmdline -Ilib/librte_vhost -I../lib/librte_vhost -Ilib/librte_cryptodev -I../lib/librte_cryptodev -Ilib/librte_hash -I../lib/librte_hash -Ilib/librte_pci -I../lib/librte_pci -fdiagnostics-color=always -pipe -D_FILE_OFFSET_BITS=64 -Wall -Winvalid-pch -Werror -O2 -g -include rte_config.h -Wextra -Wcast-qual -Wdeprecated -Wformat-nonliteral -Wformat-security -Wmissing-declarations -Wmissing-prototypes -Wnested-externs -Wold-style-definition -Wpointer-arith -Wsign-compare -Wstrict-prototypes -Wundef -Wwrite-strings -Wno-missing-field-initializers -D_GNU_SOURCE -march=native -Wno-format-truncation -DALLOW_EXPERIMENTAL_API -MD -MQ 'examples/c590b3c@@dpdk-vhost at exe/vhost_main.c.o' -MF 'examples/c590b3c@@dpdk-vhost at exe/vhost_main.c.o.d' -o 'examples/c590b3c@@dpdk-vhost at exe/vhost_main.c.o' -c ../examples/vhost/main.c
../examples/vhost/main.c: In function ‘unregister_drivers’:
../examples/vhost/main.c:253:13: error: ‘struct vhost_dev’ has no member named ‘eth_dev_id’
     if (vdev->eth_dev_id == port_id) {
             ^~
../examples/vhost/main.c: In function ‘drain_eth_rx’:
../examples/vhost/main.c:1232:40: error: ‘struct vhost_dev’ has no member named ‘eth_dev_id’
   enqueue_count = rte_eth_tx_burst(vdev->eth_dev_id, 0,
                                        ^~
../examples/vhost/main.c:1239:10: error: ‘struct vhost_dev’ has no member named ‘eth_dev_id’
      vdev->eth_dev_id, 0,
          ^~
../examples/vhost/main.c: In function ‘drain_virtio_tx’:
../examples/vhost/main.c:1295:32: error: ‘struct vhost_dev’ has no member named ‘eth_dev_id’
   count = rte_eth_rx_burst(vdev->eth_dev_id,
                                ^~
../examples/vhost/main.c: In function ‘vhost_device_attach_callback’:
../examples/vhost/main.c:1536:6: error: ‘struct vhost_dev’ has no member named ‘eth_dev_id’
  vdev->eth_dev_id = port_id;
      ^~
[2073/2150] Compiling C object 'examples/c590b3c@@dpdk-vmdq at exe/vmdq_main.c.o'.
[2074/2150] Compiling C object 'examples/c590b3c@@dpdk-tep_termination at exe/tep_termination_main.c.o'.
[2075/2150] Compiling C object 'examples/c590b3c@@dpdk-vmdq_dcb at exe/vmdq_dcb_main.c.o'.
[2076/2150] Compiling C object 'examples/c590b3c@@dpdk-vhost_crypto at exe/vhost_crypto_main.c.o'.
[2077/2150] Compiling C object 'examples/c590b3c@@dpdk-vhost at exe/vhost_virtio_net.c.o'.
[2078/2150] Compiling C object 'drivers/a715181@@tmp_rte_pmd_octeontx2_event at sta/event_octeontx2_otx2_worker.c.o'.
[2079/2150] Compiling C object 'app/test/3062f5d@@dpdk-test at exe/test_ring.c.o'.
[2080/2150] Compiling C object 'drivers/a715181@@tmp_rte_pmd_octeontx2_event at sta/event_octeontx2_otx2_worker_dual.c.o'.
ninja: build stopped: subcommand failed



DPDK STV team


More information about the test-report mailing list