[dpdk-test-report] |FAILURE| pw70449[2/2] ring: empty optimization

sys_stv at intel.com sys_stv at intel.com
Tue May 19 19:56:30 CEST 2020


Test-Label: Intel-compilation
Test-Status: FAILURE
http://dpdk.org/patch/70449

_Compilation issues_

Submitter: Morten Brørup <mb at smartsharesystems.com>
Date: 2020-05-19 15:27:25
Reply_mail: 20200519152725.63486-3-mb at smartsharesystems.com
DPDK git baseline: Repo:dpdk, CommitID: a26b116749a38db09223cfbb18f4c349f2bbae8e

Makefile build Summary: 23 Builds Done, 20 Successful, 3 Failures

Meson build Summary: 9 Builds Done, 9 Successful, 0 Failures

               +==============================================+===========+==========+
               |                   Makefile                   |   Meson   | Document |
+----------------+------+-------+------+------------+-----------+-----------+----------+
| os             | gcc  | clang | icc  | gcc+shared | gcc+debug | gcc/clang | pdf/html |
+----------------+------+-------+------+------------+-----------+-----------+----------+
| RHEL80-64      | pass |       |      |            |           |           |          |
| UB2004-64      | pass | pass  | FAIL |            |           | pass      |          |
| UB1804-64      | pass | pass  | FAIL |            |           | pass      | pass     |
| FC32-64        |      | pass  |      |            |           |           |          |
| CENTOS77-64    | pass |       |      |            |           |           |          |
| WIN10-64       |      |       |      |            |           | pass      |          |
| CENTOS80-64    | pass | pass  | FAIL | pass       | pass      | pass      |          |
| FC31-64        | pass |       |      |            |           | pass      |          |
| UB1804-32      | pass |       |      |            |           | pass      |          |
| FreeBSD1201-64 | pass | pass  |      | pass       | pass      | pass      |          |
| RHEL77-64      | pass |       |      |            |           |           |          |
| SUSE15-64      | pass | pass  |      |            |           | pass      |          |
+----------------+------+-------+------+------------+-----------+-----------+----------+

Test environment and configuration as below:

** Makefile build **


OS: UB2004-64
	Kernel Version: 5.4.0-26-generic
	CPU info: Intel(R) Xeon(R) Platinum 8180 CPU @ 2.50GHz
	GCC Version: gcc (Ubuntu 9.3.0-10ubuntu2) 9.3.0
	Clang Version: 10.0.0-4ubuntu1
	x86_64-native-linuxapp-icc
	x86_64-native-linuxapp-gcc
	x86_64-native-linuxapp-clang


OS: UB1804-64
	Kernel Version: 4.15.0-20-generic
	CPU info: Intel(R) Xeon(R) CPU E5-2699 v3 @ 2.30GHz
	GCC Version: gcc (Ubuntu 7.3.0-16ubuntu3) 7.3.0
	Clang Version: 6.0.0-1ubuntu2 (tags/RELEASE_600/final)
	x86_64-native-linuxapp-clang
	x86_64-native-linuxapp-icc
	x86_64-native-linuxapp-gcc


OS: FC32-64
	Kernel Version: 5.6.0-0.rc7.git0.2.fc32.x86_64
	CPU info: Intel(R) Xeon(R) CPU E5-2699 v4 @ 2.20GHz
	GCC Version: gcc (GCC) 10.0.1 20200311 (Red Hat 10.0.1-0.9)
	Clang Version: 10.0.0 (Fedora 10.0.0-0.3.rc4.fc32)
	x86_64-native-linuxapp-clang


OS: CENTOS77-64
	Kernel Version: 3.10.0-1062.9.1.el7.x86_64
	CPU info: Intel(R) Xeon(R) CPU E5-2699 v3 @ 2.30GHz
	GCC Version: gcc (GCC) 4.8.5 20150623 (Red Hat 4.8.5-39)
	Clang Version: 3.4.2 (tags/RELEASE_34/dot2-final)
	x86_64-native-linuxapp-gcc


OS: CENTOS80-64
	Kernel Version: 4.18.0-80.11.2.el8_0.x86_64
	CPU info: Intel(R) Xeon(R) CPU E5-2699 v3 @ 2.30GHz
	GCC Version: gcc (GCC) 8.2.1 20180905 (Red Hat 8.2.1-3)
	Clang Version: 7.0.1 (tags/RELEASE_701/final)
	x86_64-native-linuxapp-icc
	x86_64-native-linuxapp-gcc+debug
	x86_64-native-linuxapp-gcc
	x86_64-native-linuxapp-gcc+shared
	x86_64-native-linuxapp-clang


OS: UB1804-32
	Kernel Version: 4.15.0-20-generic
	CPU info: Intel(R) Xeon(R) Platinum 8180 CPU @ 2.50GHz
	GCC Version: gcc (Ubuntu 7.5.0-3ubuntu1~18.04) 7.5.0
	Clang Version: 6.0.0-1ubuntu2 (tags/RELEASE_600/final)
	i686-native-linuxapp-gcc


OS: FC31-64
	Kernel Version: 5.3.15-300.fc31.x86_64
	CPU info: Intel(R) Xeon(R) CPU E5-2699 v4 @ 2.20GHz
	GCC Version: gcc (GCC) 9.2.1 20190827 (Red Hat 9.2.1-1)
	Clang Version: 9.0.0 (Fedora 9.0.0-1.fc31)
	x86_64-native-linuxapp-gcc


OS: RHEL80-64
	Kernel Version: 4.18.0-80.el8.x86_64
	CPU info: Intel(R) Xeon(R) CPU E5-2699 v4 @ 2.20GHz
	GCC Version: gcc (GCC) 8.2.1 20180905 (Red Hat 8.2.1-3)
	Clang Version: 6.0.1 (tags/RELEASE_601/final)
	x86_64-native-linuxapp-gcc


OS: FreeBSD1201-64
	Kernel Version: 12.1-RELEASE
	CPU info: Intel(R) Xeon(R) CPU E5-2699 v3 @ 2.30GHz (2294.74-MHz K8-class CPU)
	GCC Version: gcc (FreeBSD Ports Collection) 9.2.0
	Clang Version: 8.0.1 (tags/RELEASE_801/final 366581) (based on LLVM 8.0.1)
	x86_64-native-bsdapp-gcc
	x86_64-native-bsdapp-clang
	x86_64-native-bsdapp-gcc+shared
	x86_64-native-bsdapp-gcc+debug


OS: RHEL77-64
	Kernel Version: 3.10.0-1062.9.1.el7.x86_64
	CPU info: Intel(R) Xeon(R) CPU E5-2699 v3 @ 2.30GHz
	GCC Version: gcc (GCC) 4.8.5 20150623 (Red Hat 4.8.5-39)
	Clang Version: 3.4.2 (tags/RELEASE_34/dot2-final)
	x86_64-native-linuxapp-gcc


OS: SUSE15-64
	Kernel Version: 4.12.14-lp150.11-default
	CPU info: Intel(R) Xeon(R) CPU E5-2699 v4 @ 2.20GHz
	GCC Version: gcc (SUSE Linux) 7.3.1 20180323 [gcc-7-branch revision 258812]
	Clang Version: 5.0.1 (tags/RELEASE_501/final 312548)
	x86_64-native-linuxapp-gcc
	x86_64-native-linuxapp-clang


** Meson build **


OS: UB2004-64
	Kernel Version: 5.4.0-26-generic
	CPU info: Intel(R) Xeon(R) CPU E5-2699 v4 @ 2.20GHz
	GCC Version: gcc (Ubuntu 9.3.0-10ubuntu2) 9.3.0
	Clang Version: 10.0.0-4ubuntu1
	./build-gcc-static
	./build-gcc-shared
	./build-clang-static
	./build-clang-shared
	./build-x86-default


OS: UB1804-64
	Kernel Version: 4.15.0-20-generic
	CPU info: Intel(R) Xeon(R) Platinum 8180 CPU @ 2.50GHz
	GCC Version: gcc (Ubuntu 7.3.0-16ubuntu3) 7.3.0
	Clang Version: 6.0.0-1ubuntu2 (tags/RELEASE_600/final)
	x86_64-native-linuxapp-doc
	./build-gcc-static
	./build-gcc-shared
	./build-clang-static
	./build-clang-shared
	./build-x86-default


OS: FC31-64
	Kernel Version: 5.4.18-200.fc31.x86_64
	CPU info: Intel(R) Xeon(R) Platinum 8180 CPU @ 2.50GHz
	GCC Version: gcc (GCC) 9.2.1 20190827 (Red Hat 9.2.1-1)
	Clang Version: 9.0.0 (Fedora 9.0.0-1.fc31)
	./build-gcc-static
	./build-gcc-shared
	./build-clang-static
	./build-clang-shared
	./build-x86-default


OS: CENTOS80-64
	Kernel Version: 4.18.0-80.11.2.el8_0.x86_64
	CPU info: Intel(R) Xeon(R) CPU E5-2699 v3 @ 2.30GHz
	GCC Version: gcc (GCC) 8.2.1 20180905 (Red Hat 8.2.1-3)
	Clang Version: 7.0.1 (tags/RELEASE_701/final)
	./build-gcc-static
	./build-gcc-shared
	./build-clang-static
	./build-clang-shared
	./build-x86-default


OS: UB1804-32
	Kernel Version: 4.15.0-20-generic
	CPU info: Intel(R) Xeon(R) CPU E5-2699 v4 @ 2.20GHz
	GCC Version: gcc (Ubuntu 7.5.0-3ubuntu1~18.04) 7.5.0
	Clang Version: 6.0.0-1ubuntu2 (tags/RELEASE_600/final)
	./build-gcc-static
	./build-gcc-shared
	./build-clang-static
	./build-clang-shared
	./build-x86-default


OS: WIN10-64
	Kernel Version: N/A
	CPU info: N/A
	GCC Version: N/A
	Clang Version: Clang 8.0.0
	x86_64-windows-clang


OS: FreeBSD1201-64
	Kernel Version: 12.1-RELEASE
	CPU info: Intel(R) Xeon(R) CPU E5-2699 v4 @ 2.20GHz (2194.97-MHz K8-class CPU)
	GCC Version: gcc (FreeBSD Ports Collection) 9.2.0
	Clang Version: 8.0.1 (tags/RELEASE_801/final 366581) (based on LLVM 8.0.1)
	./build-gcc-static
	./build-gcc-shared
	./build-clang-static
	./build-clang-shared
	./build-x86-default


OS: SUSE15-64
	Kernel Version: 4.12.14-lp150.12.82-default
	CPU info: Intel(R) Xeon(R) CPU E5-2699 v4 @ 2.20GHz
	GCC Version: gcc (SUSE Linux) 7.4.1 20190905 [gcc-7-branch revision 275407]
	Clang Version: 5.0.1 (tags/RELEASE_501/final 312548)
	./build-gcc-static
	./build-gcc-shared
	./build-clang-static
	./build-clang-shared
	./build-x86-default


*Make Build Failed #1:
OS: CENTOS80-64
Target: x86_64-native-linuxapp-icc
  CC mc/dpci.o
  CC base/qbman/bman.o
  CC mc/dpdmai.o
  CC portal/dpaa2_hw_dpio.o
  CC portal/dpaa2_hw_dpbp.o
make[6]: *** [/root/CENTOS80-64_K4.18.0_ICC19.0.0/x86_64-native-linuxapp-icc/335365f4ff514c4bb3241a0485b29b5f/dpdk/mk/internal/rte.compile-pre.mk:114: qbman/qbman_portal.o] Error 1
make[6]: *** Waiting for unfinished jobs....
  AR librte_bus_pci.a
  CC base/qbman/bman_driver.o
  CC base/qbman/qman.o
  CC base/qbman/qman_driver.o
--
  PMDINFO portal/dpaa2_hw_dpio.o.pmd.c
  CC portal/dpaa2_hw_dpio.o.pmd.o
  CC base/qbman/dpaa_sys.o
  LD portal/dpaa2_hw_dpio.o
  LD portal/dpaa2_hw_dpbp.o
make[5]: *** [/root/CENTOS80-64_K4.18.0_ICC19.0.0/x86_64-native-linuxapp-icc/335365f4ff514c4bb3241a0485b29b5f/dpdk/mk/rte.subdir.mk:35: fslmc] Error 2
make[5]: *** Waiting for unfinished jobs....
  AR librte_bus_dpaa.a
  INSTALL-LIB librte_bus_dpaa.a
make[4]: *** [/root/CENTOS80-64_K4.18.0_ICC19.0.0/x86_64-native-linuxapp-icc/335365f4ff514c4bb3241a0485b29b5f/dpdk/mk/rte.subdir.mk:37: bus] Error 2
make[3]: *** [/root/CENTOS80-64_K4.18.0_ICC19.0.0/x86_64-native-linuxapp-icc/335365f4ff514c4bb3241a0485b29b5f/dpdk/mk/rte.sdkbuild.mk:51: drivers] Error 2
make[2]: *** [/root/CENTOS80-64_K4.18.0_ICC19.0.0/x86_64-native-linuxapp-icc/335365f4ff514c4bb3241a0485b29b5f/dpdk/mk/rte.sdkroot.mk:99: all] Error 2
make[1]: *** [/root/CENTOS80-64_K4.18.0_ICC19.0.0/x86_64-native-linuxapp-icc/335365f4ff514c4bb3241a0485b29b5f/dpdk/mk/rte.sdkinstall.mk:61: pre_install] Error 2
make: *** [/root/CENTOS80-64_K4.18.0_ICC19.0.0/x86_64-native-linuxapp-icc/335365f4ff514c4bb3241a0485b29b5f/dpdk/mk/rte.sdkroot.mk:77: install] Error 2


*Make Build Failed #2:
OS: UB1804-64
Target: x86_64-native-linuxapp-icc
  AR librte_bus_pci.a
  INSTALL-LIB librte_bus_pci.a
  CC base/qbman/dpaa_alloc.o
  CC mc/mc_sys.o
  CC base/qbman/dpaa_sys.o
/root/UB1804-64_K4.15.0_ICC19.0.0/x86_64-native-linuxapp-icc/335365f4ff514c4bb3241a0485b29b5f/dpdk/mk/internal/rte.compile-pre.mk:114: recipe for target 'qbman/qbman_portal.o' failed
make[6]: *** [qbman/qbman_portal.o] Error 1
make[6]: *** Waiting for unfinished jobs....
/root/UB1804-64_K4.15.0_ICC19.0.0/x86_64-native-linuxapp-icc/335365f4ff514c4bb3241a0485b29b5f/dpdk/mk/rte.subdir.mk:35: recipe for target 'fslmc' failed
make[5]: *** [fslmc] Error 2
make[5]: *** Waiting for unfinished jobs....
  AR librte_bus_dpaa.a
  INSTALL-LIB librte_bus_dpaa.a
/root/UB1804-64_K4.15.0_ICC19.0.0/x86_64-native-linuxapp-icc/335365f4ff514c4bb3241a0485b29b5f/dpdk/mk/rte.subdir.mk:35: recipe for target 'bus' failed
make[4]: *** [bus] Error 2
/root/UB1804-64_K4.15.0_ICC19.0.0/x86_64-native-linuxapp-icc/335365f4ff514c4bb3241a0485b29b5f/dpdk/mk/rte.sdkbuild.mk:51: recipe for target 'drivers' failed
make[3]: *** [drivers] Error 2
/root/UB1804-64_K4.15.0_ICC19.0.0/x86_64-native-linuxapp-icc/335365f4ff514c4bb3241a0485b29b5f/dpdk/mk/rte.sdkroot.mk:98: recipe for target 'all' failed
make[2]: *** [all] Error 2
/root/UB1804-64_K4.15.0_ICC19.0.0/x86_64-native-linuxapp-icc/335365f4ff514c4bb3241a0485b29b5f/dpdk/mk/rte.sdkinstall.mk:60: recipe for target 'pre_install' failed
make[1]: *** [pre_install] Error 2
/root/UB1804-64_K4.15.0_ICC19.0.0/x86_64-native-linuxapp-icc/335365f4ff514c4bb3241a0485b29b5f/dpdk/mk/rte.sdkroot.mk:77: recipe for target 'install' failed
make: *** [install] Error 2


*Make Build Failed #3:
OS: UB2004-64
Target: x86_64-native-linuxapp-icc
  AR librte_bus_pci.a
  INSTALL-LIB librte_bus_pci.a
  CC mc/dpbp.o
  CC mc/dpio.o
  CC mc/mc_sys.o
make[6]: *** [/root/UB2004-64_K5.4.0_ICC19.0.0/x86_64-native-linuxapp-icc/335365f4ff514c4bb3241a0485b29b5f/dpdk/mk/internal/rte.compile-pre.mk:116: qbman/qbman_portal.o] Error 1
make[6]: *** Waiting for unfinished jobs....
make[5]: *** [/root/UB2004-64_K5.4.0_ICC19.0.0/x86_64-native-linuxapp-icc/335365f4ff514c4bb3241a0485b29b5f/dpdk/mk/rte.subdir.mk:35: fslmc] Error 2
make[5]: *** Waiting for unfinished jobs....
  AR librte_bus_dpaa.a
  INSTALL-LIB librte_bus_dpaa.a
make[4]: *** [/root/UB2004-64_K5.4.0_ICC19.0.0/x86_64-native-linuxapp-icc/335365f4ff514c4bb3241a0485b29b5f/dpdk/mk/rte.subdir.mk:37: bus] Error 2
make[3]: *** [/root/UB2004-64_K5.4.0_ICC19.0.0/x86_64-native-linuxapp-icc/335365f4ff514c4bb3241a0485b29b5f/dpdk/mk/rte.sdkbuild.mk:51: drivers] Error 2
make[2]: *** [/root/UB2004-64_K5.4.0_ICC19.0.0/x86_64-native-linuxapp-icc/335365f4ff514c4bb3241a0485b29b5f/dpdk/mk/rte.sdkroot.mk:99: all] Error 2
make[1]: *** [/root/UB2004-64_K5.4.0_ICC19.0.0/x86_64-native-linuxapp-icc/335365f4ff514c4bb3241a0485b29b5f/dpdk/mk/rte.sdkinstall.mk:61: pre_install] Error 2
make: *** [/root/UB2004-64_K5.4.0_ICC19.0.0/x86_64-native-linuxapp-icc/335365f4ff514c4bb3241a0485b29b5f/dpdk/mk/rte.sdkroot.mk:77: install] Error 2

DPDK STV team


More information about the test-report mailing list