[dpdk-test-report] |FAILURE| pw70590[v2, 3/7] app: UNKNOWN link speed print format

sys_stv at intel.com sys_stv at intel.com
Sat May 30 09:24:18 CEST 2020


Test-Label: Intel-compilation
Test-Status: FAILURE
http://dpdk.org/patch/70590

_Compilation issues_

Submitter: Ivan Dyukov <i.dyukov at samsung.com>
Date: 2020-05-26 19:10:06
Reply_mail: 20200526191033.16459-4-i.dyukov at samsung.com
DPDK git baseline: Repo:dpdk, CommitID: 60814f955cfdebeb1d7bb3c8c5ae6c566b15f572

Makefile build Summary: 23 Builds Done, 21 Successful, 2 Failures

Meson build Summary: 9 Builds Done, 2 Successful, 7 Failures

               +==============================================+===========+==========+
               |                   Makefile                   |   Meson   | Document |
+----------------+------+-------+------+------------+-----------+-----------+----------+
| os             | gcc  | clang | icc  | gcc+shared | gcc+debug | gcc/clang | pdf/html |
+----------------+------+-------+------+------------+-----------+-----------+----------+
| RHEL80-64      | pass |       |      |            |           |           |          |
| UB2004-64      | pass | pass  | pass |            |           | FAIL      |          |
| UB1804-64      | pass | pass  | pass |            |           | FAIL      | pass     |
| FC32-64        | pass | pass  |      |            |           |           |          |
| CENTOS77-64    | pass |       |      |            |           |           |          |
| WIN10-64       |      |       |      |            |           | pass      |          |
| CENTOS80-64    | pass | pass  | pass | FAIL       | pass      | FAIL      |          |
| FC31-64        |      |       |      |            |           | FAIL      |          |
| UB1804-32      | pass |       |      |            |           | FAIL      |          |
| FreeBSD1201-64 | pass | pass  |      | FAIL       | pass      | FAIL      |          |
| RHEL77-64      | pass |       |      |            |           |           |          |
| SUSE15-64      | pass | pass  |      |            |           | FAIL      |          |
+----------------+------+-------+------+------------+-----------+-----------+----------+

Test environment and configuration as below:

** Makefile build **


OS: UB2004-64
	Kernel Version: 5.4.0-26-generic
	CPU info: Intel(R) Xeon(R) Platinum 8180 CPU @ 2.50GHz
	GCC Version: gcc (Ubuntu 9.3.0-10ubuntu2) 9.3.0
	Clang Version: 10.0.0-4ubuntu1
	x86_64-native-linuxapp-clang
	x86_64-native-linuxapp-gcc
	x86_64-native-linuxapp-icc


OS: UB1804-64
	Kernel Version: 4.15.0-20-generic
	CPU info: Intel(R) Xeon(R) CPU E5-2699 v3 @ 2.30GHz
	GCC Version: gcc (Ubuntu 7.3.0-16ubuntu3) 7.3.0
	Clang Version: 6.0.0-1ubuntu2 (tags/RELEASE_600/final)
	x86_64-native-linuxapp-clang
	x86_64-native-linuxapp-gcc
	x86_64-native-linuxapp-icc


OS: FC32-64
	Kernel Version: 5.6.0-0.rc7.git0.2.fc32.x86_64
	CPU info: Intel(R) Xeon(R) CPU E5-2699 v4 @ 2.20GHz
	GCC Version: gcc (GCC) 10.0.1 20200311 (Red Hat 10.0.1-0.9)
	Clang Version: 10.0.0 (Fedora 10.0.0-0.3.rc4.fc32)
	x86_64-native-linuxapp-clang
	x86_64-native-linuxapp-gcc


OS: CENTOS77-64
	Kernel Version: 3.10.0-1062.9.1.el7.x86_64
	CPU info: Intel(R) Xeon(R) Platinum 8280M CPU @ 2.70GHz
	GCC Version: gcc (GCC) 4.8.5 20150623 (Red Hat 4.8.5-39)
	Clang Version: 3.4.2 (tags/RELEASE_34/dot2-final)
	x86_64-native-linuxapp-gcc


OS: CENTOS80-64
	Kernel Version: 4.18.0-80.11.2.el8_0.x86_64
	CPU info: Intel(R) Xeon(R) CPU E5-2699 v3 @ 2.30GHz
	GCC Version: gcc (GCC) 8.2.1 20180905 (Red Hat 8.2.1-3)
	Clang Version: 7.0.1 (tags/RELEASE_701/final)
	x86_64-native-linuxapp-clang
	x86_64-native-linuxapp-gcc
	x86_64-native-linuxapp-gcc+debug
	x86_64-native-linuxapp-gcc+shared
	x86_64-native-linuxapp-icc


OS: UB1804-32
	Kernel Version: 4.15.0-20-generic
	CPU info: Intel(R) Xeon(R) Platinum 8180 CPU @ 2.50GHz
	GCC Version: gcc (Ubuntu 7.5.0-3ubuntu1~18.04) 7.5.0
	Clang Version: 6.0.0-1ubuntu2 (tags/RELEASE_600/final)
	i686-native-linuxapp-gcc


OS: RHEL80-64
	Kernel Version: 4.18.0-80.el8.x86_64
	CPU info: Intel(R) Xeon(R) CPU E5-2699 v4 @ 2.20GHz
	GCC Version: gcc (GCC) 8.2.1 20180905 (Red Hat 8.2.1-3)
	Clang Version: 6.0.1 (tags/RELEASE_601/final)
	x86_64-native-linuxapp-gcc


OS: FreeBSD1201-64
	Kernel Version: 12.1-RELEASE
	CPU info: Intel(R) Xeon(R) CPU E5-2699 v3 @ 2.30GHz (2294.74-MHz K8-class CPU)
	GCC Version: gcc (FreeBSD Ports Collection) 9.2.0
	Clang Version: 8.0.1 (tags/RELEASE_801/final 366581) (based on LLVM 8.0.1)
	x86_64-native-bsdapp-clang
	x86_64-native-bsdapp-gcc+debug
	x86_64-native-bsdapp-gcc+shared
	x86_64-native-bsdapp-gcc


OS: RHEL77-64
	Kernel Version: 3.10.0-1062.9.1.el7.x86_64
	CPU info: Intel(R) Xeon(R) CPU E5-2699 v3 @ 2.30GHz
	GCC Version: gcc (GCC) 4.8.5 20150623 (Red Hat 4.8.5-39)
	Clang Version: 3.4.2 (tags/RELEASE_34/dot2-final)
	x86_64-native-linuxapp-gcc


OS: SUSE15-64
	Kernel Version: 4.12.14-lp150.11-default
	CPU info: Intel(R) Xeon(R) CPU E5-2699 v4 @ 2.20GHz
	GCC Version: gcc (SUSE Linux) 7.3.1 20180323 [gcc-7-branch revision 258812]
	Clang Version: 5.0.1 (tags/RELEASE_501/final 312548)
	x86_64-native-linuxapp-clang
	x86_64-native-linuxapp-gcc


** Meson build **


OS: UB2004-64
	Kernel Version: 5.4.0-26-generic
	CPU info: Intel(R) Xeon(R) CPU E5-2699 v4 @ 2.20GHz
	GCC Version: gcc (Ubuntu 9.3.0-10ubuntu2) 9.3.0
	Clang Version: 10.0.0-4ubuntu1
	./build-gcc-static
	./build-gcc-shared
	./build-clang-static
	./build-clang-shared
	./build-x86-default


OS: UB1804-64
	Kernel Version: 4.15.0-20-generic
	CPU info: Intel(R) Xeon(R) Platinum 8180 CPU @ 2.50GHz
	GCC Version: gcc (Ubuntu 7.3.0-16ubuntu3) 7.3.0
	Clang Version: 6.0.0-1ubuntu2 (tags/RELEASE_600/final)
	x86_64-native-linuxapp-doc
	./build-gcc-static
	./build-gcc-shared
	./build-clang-static
	./build-clang-shared
	./build-x86-default


OS: WIN10-64
	Kernel Version: N/A
	CPU info: N/A
	GCC Version: N/A
	Clang Version: Clang 8.0.0
	x86_64-windows-clang


OS: CENTOS80-64
	Kernel Version: 4.18.0-80.11.2.el8_0.x86_64
	CPU info: Intel(R) Xeon(R) Platinum 8280M CPU @ 2.70GHz
	GCC Version: gcc (GCC) 8.3.1 20190507 (Red Hat 8.3.1-4)
	Clang Version: 8.0.1 (Red Hat 8.0.1-1.module_el8.1.0+215+a01033fb)
	./build-gcc-static
	./build-gcc-shared
	./build-clang-static
	./build-clang-shared
	./build-x86-default


OS: FC31-64
	Kernel Version: 5.4.18-200.fc31.x86_64
	CPU info: Intel(R) Xeon(R) Platinum 8180 CPU @ 2.50GHz
	GCC Version: gcc (GCC) 9.2.1 20190827 (Red Hat 9.2.1-1)
	Clang Version: 9.0.0 (Fedora 9.0.0-1.fc31)
	./build-gcc-static
	./build-gcc-shared
	./build-clang-static
	./build-clang-shared
	./build-x86-default


OS: UB1804-32
	Kernel Version: 4.15.0-20-generic
	CPU info: Intel(R) Xeon(R) CPU E5-2699 v4 @ 2.20GHz
	GCC Version: gcc (Ubuntu 7.5.0-3ubuntu1~18.04) 7.5.0
	Clang Version: 6.0.0-1ubuntu2 (tags/RELEASE_600/final)
	./build-gcc-static
	./build-gcc-shared
	./build-clang-static
	./build-clang-shared
	./build-x86-default


OS: FreeBSD1201-64
	Kernel Version: 12.1-RELEASE
	CPU info: Intel(R) Xeon(R) CPU E5-2699 v4 @ 2.20GHz (2194.97-MHz K8-class CPU)
	GCC Version: gcc (FreeBSD Ports Collection) 9.2.0
	Clang Version: 8.0.1 (tags/RELEASE_801/final 366581) (based on LLVM 8.0.1)
	./build-gcc-static
	./build-gcc-shared
	./build-clang-static
	./build-clang-shared
	./build-x86-default


OS: SUSE15-64
	Kernel Version: 4.12.14-lp150.12.82-default
	CPU info: Intel(R) Xeon(R) CPU E5-2699 v4 @ 2.20GHz
	GCC Version: gcc (SUSE Linux) 7.4.1 20190905 [gcc-7-branch revision 275407]
	Clang Version: 5.0.1 (tags/RELEASE_501/final 312548)
	./build-gcc-static
	./build-gcc-shared
	./build-clang-static
	./build-clang-shared
	./build-x86-default


*Make Build Failed #1:
OS: CENTOS80-64
Target: x86_64-native-linuxapp-gcc+shared
main.o: In function `show_port':
main.c:(.text+0x1968): undefined reference to `rte_eth_link_prepare_text'
  CC test.o
collect2: error: ld returned 1 exit status
make[5]: *** [/root/CENTOS80-64_K4.18.0_GCC8.2.1/x86_64-native-linuxapp-gcc+shared/60e87329c6dc4b60b81893fba910aa35/dpdk/mk/rte.app.mk:454: dpdk-procinfo] Error 1
make[4]: *** [/root/CENTOS80-64_K4.18.0_GCC8.2.1/x86_64-native-linuxapp-gcc+shared/60e87329c6dc4b60b81893fba910aa35/dpdk/mk/rte.subdir.mk:35: proc-info] Error 2
make[4]: *** Waiting for unfinished jobs....
  CC test_bbdev_perf.o
  CC init.o
--
  CC test_memory.o
init.o: In function `app_init':
init.c:(.text.unlikely+0x323): undefined reference to `rte_eth_link_prepare_text'
collect2: error: ld returned 1 exit status
make[5]: *** [/root/CENTOS80-64_K4.18.0_GCC8.2.1/x86_64-native-linuxapp-gcc+shared/60e87329c6dc4b60b81893fba910aa35/dpdk/mk/rte.app.mk:454: testpipeline] Error 1
make[4]: *** [/root/CENTOS80-64_K4.18.0_GCC8.2.1/x86_64-native-linuxapp-gcc+shared/60e87329c6dc4b60b81893fba910aa35/dpdk/mk/rte.subdir.mk:35: test-pipeline] Error 2
  CC test_memzone.o
  CC flowgen.o
  CC rxonly.o
--
config.c:(.text+0x2373): undefined reference to `rte_eth_link_prepare_text'
config.o: In function `port_summary_display':
config.c:(.text+0x28ef): undefined reference to `rte_eth_link_prepare_text'
collect2: error: ld returned 1 exit status
make[5]: *** [/root/CENTOS80-64_K4.18.0_GCC8.2.1/x86_64-native-linuxapp-gcc+shared/60e87329c6dc4b60b81893fba910aa35/dpdk/mk/rte.app.mk:454: testpmd] Error 1
make[4]: *** [/root/CENTOS80-64_K4.18.0_GCC8.2.1/x86_64-native-linuxapp-gcc+shared/60e87329c6dc4b60b81893fba910aa35/dpdk/mk/rte.subdir.mk:35: test-pmd] Error 2
  CC test_rwlock.o
  CC test_stack.o
  CC test_stack_perf.o
--
  LD test
test_pmd_perf.o: In function `test_pmd_perf':
test_pmd_perf.c:(.text+0x108a): undefined reference to `rte_eth_link_prepare_text'
collect2: error: ld returned 1 exit status
make[5]: *** [/root/CENTOS80-64_K4.18.0_GCC8.2.1/x86_64-native-linuxapp-gcc+shared/60e87329c6dc4b60b81893fba910aa35/dpdk/mk/rte.app.mk:454: test] Error 1
make[4]: *** [/root/CENTOS80-64_K4.18.0_GCC8.2.1/x86_64-native-linuxapp-gcc+shared/60e87329c6dc4b60b81893fba910aa35/dpdk/mk/rte.subdir.mk:35: test] Error 2
make[3]: *** [/root/CENTOS80-64_K4.18.0_GCC8.2.1/x86_64-native-linuxapp-gcc+shared/60e87329c6dc4b60b81893fba910aa35/dpdk/mk/rte.sdkbuild.mk:53: app] Error 2
make[2]: *** [/root/CENTOS80-64_K4.18.0_GCC8.2.1/x86_64-native-linuxapp-gcc+shared/60e87329c6dc4b60b81893fba910aa35/dpdk/mk/rte.sdkroot.mk:99: all] Error 2
make[1]: *** [/root/CENTOS80-64_K4.18.0_GCC8.2.1/x86_64-native-linuxapp-gcc+shared/60e87329c6dc4b60b81893fba910aa35/dpdk/mk/rte.sdkinstall.mk:61: pre_install] Error 2
make: *** [/root/CENTOS80-64_K4.18.0_GCC8.2.1/x86_64-native-linuxapp-gcc+shared/60e87329c6dc4b60b81893fba910aa35/dpdk/mk/rte.sdkroot.mk:77: install] Error 2


*Make Build Failed #2:
OS: FreeBSD1201-64
Target: x86_64-native-bsdapp-gcc+shared
awk -f /usr/src/sys/tools/makeobjops.awk /usr/src/sys/kern/bus_if.m -h
awk -f /usr/src/sys/tools/makeobjops.awk /usr/src/sys/dev/pci/pci_if.m -h
Warning: Object directory not changed from original /root/FreeBSD1201-64_K12.1_GCC7.3.0/x86_64-native-bsdapp-gcc+shared/60e87329c6dc4b60b81893fba910aa35/dpdk/x86_64-native-bsdapp-gcc/build/kernel/freebsd/contigmem
cc  -Winline -Wall -Werror -include /root/FreeBSD1201-64_K12.1_GCC7.3.0/x86_64-native-bsdapp-gcc+shared/60e87329c6dc4b60b81893fba910aa35/dpdk/x86_64-native-bsdapp-gcc/include/rte_config.h  -Werror -D_KERNEL -DKLD_MODULE -nostdinc  -I/root/FreeBSD1201-64_K12.1_GCC7.3.0/x86_64-native-bsdapp-gcc+shared/60e87329c6dc4b60b81893fba910aa35/dpdk/kernel/freebsd/contigmem -I/root/FreeBSD1201-64_K12.1_GCC7.3.0/x86_64-native-bsdapp-gcc+shared/60e87329c6dc4b60b81893fba910aa35/dpdk/x86_64-native-bsdapp-gcc/include -I. -I/usr/src/sys -I/usr/src/sys/contrib/ck/include -fno-common  -fno-omit-frame-pointer -mno-omit-leaf-frame-pointer -fdebug-prefix-map=./machine=/usr/src/sys/amd64/include -fdebug-prefix-map=./x86=/usr/src/sys/x86/include   -MD  -MF.depend.contigmem.o -MTcontigmem.o -mcmodel=kernel -mno-red-zone -mno-mmx -mno-sse -msoft-float  -fno-asynchronous-unwind-tables -ffreestanding -fwrapv -fstack-protector -Wall -Wredundant-decls -Wnested-externs -Wstrict-prototypes -Wmissing-prototypes -Wpointer-arith -Wcast-qual -Wundef -Wno-pointer-sign -D__printf__=__freebsd_kprintf__ -Wmissing-include-dirs -fdiagnostics-show-option -Wno-unknown-pragmas -Wno-error-tautological-compare -Wno-error-empty-body -Wno-error-parentheses-equality -Wno-error-unused-function -Wno-error-pointer-sign -Wno-error-shift-negative-value -Wno-address-of-packed-member  -mno-aes -mno-avx  -std=iso9899:1999 -c contigmem.c -o contigmem.o
Warning: Object directory not changed from original /root/FreeBSD1201-64_K12.1_GCC7.3.0/x86_64-native-bsdapp-gcc+shared/60e87329c6dc4b60b81893fba910aa35/dpdk/x86_64-native-bsdapp-gcc/build/kernel/freebsd/nic_uio
cc  -Winline -Wall -Werror -include /root/FreeBSD1201-64_K12.1_GCC7.3.0/x86_64-native-bsdapp-gcc+shared/60e87329c6dc4b60b81893fba910aa35/dpdk/x86_64-native-bsdapp-gcc/include/rte_config.h  -Werror -D_KERNEL -DKLD_MODULE -nostdinc  -I/root/FreeBSD1201-64_K12.1_GCC7.3.0/x86_64-native-bsdapp-gcc+shared/60e87329c6dc4b60b81893fba910aa35/dpdk/kernel/freebsd/nic_uio -I/root/FreeBSD1201-64_K12.1_GCC7.3.0/x86_64-native-bsdapp-gcc+shared/60e87329c6dc4b60b81893fba910aa35/dpdk/x86_64-native-bsdapp-gcc/include -I. -I/usr/src/sys -I/usr/src/sys/contrib/ck/include -fno-common  -fno-omit-frame-pointer -mno-omit-leaf-frame-pointer -fdebug-prefix-map=./machine=/usr/src/sys/amd64/include -fdebug-prefix-map=./x86=/usr/src/sys/x86/include   -MD  -MF.depend.nic_uio.o -MTnic_uio.o -mcmodel=kernel -mno-red-zone -mno-mmx -mno-sse -msoft-float  -fno-asynchronous-unwind-tables -ffreestanding -fwrapv -fstack-protector -Wall -Wredundant-decls -Wnested-externs -Wstrict-prototypes -Wmissing-prototypes -Wpointer-arith -Wcast-qual -Wundef -Wno-pointer-sign -D__printf__=__freebsd_kprintf__ -Wmissing-include-dirs -fdiagnostics-show-option -Wno-unknown-pragmas -Wno-error-tautological-compare -Wno-error-empty-body -Wno-error-parentheses-equality -Wno-error-unused-function -Wno-error-pointer-sign -Wno-error-shift-negative-value -Wno-address-of-packed-member  -mno-aes -mno-avx  -std=iso9899:1999 -c nic_uio.c -o nic_uio.o
== Build drivers/common
ld -m elf_x86_64_fbsd -L/root/FreeBSD1201-64_K12.1_GCC7.3.0/x86_64-native-bsdapp-gcc+shared/60e87329c6dc4b60b81893fba910aa35/dpdk/x86_64-native-bsdapp-gcc/lib -d -warn-common --build-id=sha1 -r -d -o contigmem.ko contigmem.o
ld -m elf_x86_64_fbsd -L/root/FreeBSD1201-64_K12.1_GCC7.3.0/x86_64-native-bsdapp-gcc+shared/60e87329c6dc4b60b81893fba910aa35/dpdk/x86_64-native-bsdapp-gcc/lib -d -warn-common --build-id=sha1 -r -d -o nic_uio.ko nic_uio.o
--
  LD testpipeline
/usr/local/bin/ld: init.o: in function `app_init':
init.c:(.text.unlikely+0x32c): undefined reference to `rte_eth_link_prepare_text'
collect2: error: ld returned 1 exit status
gmake[5]: *** [/root/FreeBSD1201-64_K12.1_GCC7.3.0/x86_64-native-bsdapp-gcc+shared/60e87329c6dc4b60b81893fba910aa35/dpdk/mk/rte.app.mk:454: testpipeline] Error 1
gmake[4]: *** [/root/FreeBSD1201-64_K12.1_GCC7.3.0/x86_64-native-bsdapp-gcc+shared/60e87329c6dc4b60b81893fba910aa35/dpdk/mk/rte.subdir.mk:37: test-pipeline] Error 2
gmake[4]: *** Waiting for unfinished jobs....
  CC macswap.o
  CC test_memory.o
--
config.c:(.text+0x238e): undefined reference to `rte_eth_link_prepare_text'
/usr/local/bin/ld: config.o: in function `port_summary_display':
config.c:(.text+0x291d): undefined reference to `rte_eth_link_prepare_text'
collect2: error: ld returned 1 exit status
gmake[5]: *** [/root/FreeBSD1201-64_K12.1_GCC7.3.0/x86_64-native-bsdapp-gcc+shared/60e87329c6dc4b60b81893fba910aa35/dpdk/mk/rte.app.mk:454: testpmd] Error 1
gmake[4]: *** [/root/FreeBSD1201-64_K12.1_GCC7.3.0/x86_64-native-bsdapp-gcc+shared/60e87329c6dc4b60b81893fba910aa35/dpdk/mk/rte.subdir.mk:35: test-pmd] Error 2
  CC test_table.o
  CC cperf_test_throughput.o
  CC cperf_test_latency.o
--
  LD test
/usr/local/bin/ld: test_pmd_perf.o: in function `test_pmd_perf':
test_pmd_perf.c:(.text+0x72f): undefined reference to `rte_eth_link_prepare_text'
collect2: error: ld returned 1 exit status
gmake[5]: *** [/root/FreeBSD1201-64_K12.1_GCC7.3.0/x86_64-native-bsdapp-gcc+shared/60e87329c6dc4b60b81893fba910aa35/dpdk/mk/rte.app.mk:454: test] Error 1
gmake[4]: *** [/root/FreeBSD1201-64_K12.1_GCC7.3.0/x86_64-native-bsdapp-gcc+shared/60e87329c6dc4b60b81893fba910aa35/dpdk/mk/rte.subdir.mk:35: test] Error 2
gmake[3]: *** [/root/FreeBSD1201-64_K12.1_GCC7.3.0/x86_64-native-bsdapp-gcc+shared/60e87329c6dc4b60b81893fba910aa35/dpdk/mk/rte.sdkbuild.mk:53: app] Error 2
gmake[2]: *** [/root/FreeBSD1201-64_K12.1_GCC7.3.0/x86_64-native-bsdapp-gcc+shared/60e87329c6dc4b60b81893fba910aa35/dpdk/mk/rte.sdkroot.mk:99: all] Error 2
gmake[1]: *** [/root/FreeBSD1201-64_K12.1_GCC7.3.0/x86_64-native-bsdapp-gcc+shared/60e87329c6dc4b60b81893fba910aa35/dpdk/mk/rte.sdkinstall.mk:61: pre_install] Error 2
gmake: *** [/root/FreeBSD1201-64_K12.1_GCC7.3.0/x86_64-native-bsdapp-gcc+shared/60e87329c6dc4b60b81893fba910aa35/dpdk/mk/rte.sdkroot.mk:77: install] Error 2

*Meson Build Failed #1:
OS: CENTOS80-64
Target:./build-gcc-static
FAILED: app/dpdk-proc-info 
gcc  -o app/dpdk-proc-info 'app/a172ced@@dpdk-proc-info at exe/proc-info_main.c.o' -Wl,--as-needed -Wl,--no-undefined -Wl,--no-as-needed -pthread -Wl,--start-group -lm -ldl -lnuma lib/librte_ethdev.so.20.0.3 lib/librte_eal.so.20.0.3 lib/librte_kvargs.so.20.0.3 lib/librte_telemetry.so.0.200.3 lib/librte_net.so.20.0.3 lib/librte_mbuf.so.20.0.3 lib/librte_mempool.so.20.0.3 lib/librte_ring.so.20.0.3 lib/librte_meter.so.20.0.3 lib/librte_metrics.so.20.0.3 lib/librte_security.so.20.0.3 lib/librte_cryptodev.so.20.0.3 -Wl,--end-group '-Wl,-rpath,$ORIGIN/../lib:XXXXXXXXXXXXXXXXXXX' -Wl,-rpath-link,/root/CENTOS80-64_K4.18.0_GCC8.2.1/x86_64-native-linuxapp-gcc/60e87329c6dc4b60b81893fba910aa35/dpdk/build-gcc-shared/lib
app/a172ced@@dpdk-proc-info at exe/proc-info_main.c.o: In function `show_port':
/root/CENTOS80-64_K4.18.0_GCC8.2.1/x86_64-native-linuxapp-gcc/60e87329c6dc4b60b81893fba910aa35/dpdk/build-gcc-shared/../app/proc-info/main.c:689: undefined reference to `rte_eth_link_prepare_text'
collect2: error: ld returned 1 exit status
[1006/2405] Linking target drivers/librte_pmd_ena.so.20.0.3.
[1007/2405] Generating rte_pmd_enic.pmd.c with a custom command.
[1008/2405] Compiling C object 'app/a172ced@@dpdk-pdump at exe/pdump_main.c.o'.
[1009/2405] Compiling C object 'app/a172ced@@dpdk-test-bbdev at exe/test-bbdev_test_bbdev_vector.c.o'.
[1010/2405] Compiling C object 'drivers/a715181@@tmp_rte_pmd_failsafe at sta/net_failsafe_failsafe_ops.c.o'.
[1011/2405] Compiling C object 'drivers/net/i40e/base/3c1f984@@i40e_base at sta/i40e_lan_hmc.c.o'.
[1012/2405] Compiling C object 'drivers/a715181@@tmp_rte_pmd_fm10k at sta/net_fm10k_fm10k_rxtx.c.o'.
[1013/2405] Compiling C object 'drivers/a715181@@tmp_rte_pmd_fm10k at sta/net_fm10k_fm10k_rxtx_vec.c.o'.
[1014/2405] Compiling C object 'drivers/a715181@@tmp_rte_pmd_bbdev_fpga_5gnr_fec at sta/baseband_fpga_5gnr_fec_rte_fpga_5gnr_fec.c.o'.
[1015/2405] Compiling C object 'drivers/a715181@@tmp_rte_pmd_fm10k at sta/net_fm10k_fm10k_ethdev.c.o'.
[1016/2405] Compiling C object 'app/a172ced@@dpdk-test-bbdev at exe/test-bbdev_test_bbdev_perf.c.o'.
ninja: build stopped: subcommand failed




*Meson Build Failed #2:
OS: FC31-64
Target:./build-gcc-static
FAILED: app/dpdk-proc-info 
gcc  -o app/dpdk-proc-info 'app/a172ced@@dpdk-proc-info at exe/proc-info_main.c.o' -Wl,--as-needed -Wl,--no-undefined -Wl,--no-as-needed -pthread -Wl,--start-group -lm -ldl -lnuma lib/librte_ethdev.so.20.0.3 lib/librte_eal.so.20.0.3 lib/librte_kvargs.so.20.0.3 lib/librte_telemetry.so.0.200.3 lib/librte_net.so.20.0.3 lib/librte_mbuf.so.20.0.3 lib/librte_mempool.so.20.0.3 lib/librte_ring.so.20.0.3 lib/librte_meter.so.20.0.3 lib/librte_metrics.so.20.0.3 lib/librte_security.so.20.0.3 lib/librte_cryptodev.so.20.0.3 -Wl,--end-group '-Wl,-rpath,$ORIGIN/../lib:XXXXXXXXXXXXXXXXXXX' -Wl,-rpath-link,/root/FC31-64_K5.3.14_GCC9.2.1/x86_64-native-linuxapp-gcc/60e87329c6dc4b60b81893fba910aa35/dpdk/build-gcc-shared/lib
/usr/bin/ld: app/a172ced@@dpdk-proc-info at exe/proc-info_main.c.o: in function `show_port':
/root/FC31-64_K5.3.14_GCC9.2.1/x86_64-native-linuxapp-gcc/60e87329c6dc4b60b81893fba910aa35/dpdk/build-gcc-shared/../app/proc-info/main.c:689: undefined reference to `rte_eth_link_prepare_text'
collect2: error: ld returned 1 exit status
[1007/2406] Linking target app/dpdk-pdump.
[1008/2406] Generating rte_pmd_enic.sym_chk with a meson_exe.py custom command.
[1009/2406] Compiling C object 'app/a172ced@@dpdk-test-acl at exe/test-acl_main.c.o'.
[1010/2406] Compiling C object 'drivers/a715181@@tmp_rte_pmd_failsafe at sta/net_failsafe_failsafe_ops.c.o'.
[1011/2406] Compiling C object 'drivers/net/i40e/base/3c1f984@@i40e_base at sta/i40e_lan_hmc.c.o'.
[1012/2406] Compiling C object 'drivers/a715181@@tmp_rte_pmd_fm10k at sta/net_fm10k_fm10k_ethdev.c.o'.
[1013/2406] Compiling C object 'drivers/a715181@@tmp_rte_pmd_fm10k at sta/net_fm10k_fm10k_rxtx.c.o'.
[1014/2406] Compiling C object 'drivers/a715181@@tmp_rte_pmd_fm10k at sta/net_fm10k_fm10k_rxtx_vec.c.o'.
[1015/2406] Compiling C object 'drivers/a715181@@tmp_rte_pmd_bbdev_fpga_5gnr_fec at sta/baseband_fpga_5gnr_fec_rte_fpga_5gnr_fec.c.o'.
ninja: build stopped: subcommand failed




*Meson Build Failed #3:
OS: FreeBSD1201-64
Target:./build-gcc-static
FAILED: app/dpdk-proc-info 
gcc  -o app/dpdk-proc-info 'app/a172ced@@dpdk-proc-info at exe/proc-info_main.c.o' -Wl,--as-needed -Wl,--no-undefined -Wl,--no-as-needed -pthread -Wl,--start-group -lm -lexecinfo lib/librte_ethdev.so.20.0.3 lib/librte_eal.so.20.0.3 lib/librte_kvargs.so.20.0.3 lib/librte_telemetry.so.0.200.3 lib/librte_net.so.20.0.3 lib/librte_mbuf.so.20.0.3 lib/librte_mempool.so.20.0.3 lib/librte_ring.so.20.0.3 lib/librte_meter.so.20.0.3 lib/librte_metrics.so.20.0.3 lib/librte_security.so.20.0.3 lib/librte_cryptodev.so.20.0.3 -Wl,--end-group '-Wl,-rpath,$ORIGIN/../lib:XXXXXXXXXXXXXXXXX' -Wl,-rpath-link,/root/FreeBSD1201-64_K12.1_GCC9.2.0/x86_64-native-bsdapp-gcc/60e87329c6dc4b60b81893fba910aa35/dpdk/build-gcc-shared/lib
/usr/local/bin/ld: app/a172ced@@dpdk-proc-info at exe/proc-info_main.c.o: in function `show_port':
/root/FreeBSD1201-64_K12.1_GCC9.2.0/x86_64-native-bsdapp-gcc/60e87329c6dc4b60b81893fba910aa35/dpdk/build-gcc-shared/../app/proc-info/main.c:689: undefined reference to `rte_eth_link_prepare_text'
collect2: error: ld returned 1 exit status
[1406/1796] Compiling C object 'app/a172ced@@dpdk-pdump at exe/pdump_main.c.o'
[1407/1796] Generating rte_pmd_bbdev_turbo_sw.pmd.c with a custom command
[1408/1796] Compiling C object 'app/a172ced@@dpdk-test-acl at exe/test-acl_main.c.o'
[1409/1796] Generating rte_pmd_bbdev_null.sym_chk with a meson_exe.py custom command
[1410/1796] Generating rte_pmd_octeontx_event.sym_chk with a meson_exe.py custom command
[1411/1796] Generating rte_pmd_bbdev_fpga_5gnr_fec.sym_chk with a meson_exe.py custom command
[1412/1796] Generating rte_pmd_bbdev_fpga_lte_fec.sym_chk with a meson_exe.py custom command
[1413/1796] Compiling C object 'drivers/a715181@@tmp_rte_pmd_octeontx2_event at sta/event_octeontx2_otx2_worker.c.o'
[1414/1796] Compiling C object 'drivers/a715181@@tmp_rte_pmd_octeontx2_event at sta/event_octeontx2_otx2_worker_dual.c.o'
ninja: build stopped: subcommand failed




*Meson Build Failed #4:
OS: SUSE15-64
Target:./build-gcc-static
FAILED: app/dpdk-proc-info 
gcc  -o app/dpdk-proc-info 'app/a172ced@@dpdk-proc-info at exe/proc-info_main.c.o' -Wl,--no-undefined -Wl,--as-needed -Wl,--no-as-needed -pthread -Wl,--start-group -lm -ldl -lnuma lib/librte_ethdev.so.20.0.3 lib/librte_eal.so.20.0.3 lib/librte_kvargs.so.20.0.3 lib/librte_telemetry.so.0.200.3 lib/librte_net.so.20.0.3 lib/librte_mbuf.so.20.0.3 lib/librte_mempool.so.20.0.3 lib/librte_ring.so.20.0.3 lib/librte_meter.so.20.0.3 lib/librte_metrics.so.20.0.3 lib/librte_security.so.20.0.3 lib/librte_cryptodev.so.20.0.3 -Wl,--end-group '-Wl,-rpath,$ORIGIN/../lib:XXXXXXXXXXXXXXXXXXX' -Wl,-rpath-link,/root/SUSE15-64_K4.12.14_GCC7.3.1/x86_64-native-linuxapp-gcc/60e87329c6dc4b60b81893fba910aa35/dpdk/build-gcc-shared/lib 
/usr/lib64/gcc/x86_64-suse-linux/7/../../../../x86_64-suse-linux/bin/ld: app/a172ced@@dpdk-proc-info at exe/proc-info_main.c.o: in function `show_port':
/root/SUSE15-64_K4.12.14_GCC7.3.1/x86_64-native-linuxapp-gcc/60e87329c6dc4b60b81893fba910aa35/dpdk/build-gcc-shared/../app/proc-info/main.c:689: undefined reference to `rte_eth_link_prepare_text'
collect2: error: ld returned 1 exit status
[1891/2309] Linking target drivers/librte_pmd_bbdev_fpga_5gnr_fec.so.20.0.3.
[1892/2309] Compiling C object 'drivers/a715181@@tmp_rte_pmd_octeontx_event at sta/event_octeontx_ssovf_worker.c.o'.
[1893/2309] Generating rte_pmd_bbdev_turbo_sw.sym_chk with a meson_exe.py custom command.
[1894/2309] Compiling C object 'app/a172ced@@dpdk-pdump at exe/pdump_main.c.o'.
[1895/2309] Generating symbol file 'drivers/a715181@@rte_pmd_bbdev_fpga_lte_fec at sha/librte_pmd_bbdev_fpga_lte_fec.so.20.0.3.symbols'.
[1896/2309] Compiling C object 'app/a172ced@@dpdk-test-acl at exe/test-acl_main.c.o'.
[1897/2309] Compiling C object 'app/a172ced@@dpdk-test-bbdev at exe/test-bbdev_test_bbdev.c.o'.
[1898/2309] Compiling C object 'drivers/a715181@@tmp_rte_pmd_octeontx2_event at sta/event_octeontx2_otx2_worker.c.o'.
[1899/2309] Compiling C object 'drivers/a715181@@tmp_rte_pmd_octeontx2_event at sta/event_octeontx2_otx2_worker_dual.c.o'.
ninja: build stopped: subcommand failed




*Meson Build Failed #5:
OS: UB1804-32
Target:./build-gcc-static
FAILED: app/dpdk-proc-info 
gcc  -o app/dpdk-proc-info 'app/a172ced@@dpdk-proc-info at exe/proc-info_main.c.o' -Wl,--no-undefined -Wl,--as-needed -Wl,--no-as-needed -pthread -Wl,--start-group -lm -ldl -lnuma -m32 lib/librte_ethdev.so.20.0.3 lib/librte_eal.so.20.0.3 lib/librte_kvargs.so.20.0.3 lib/librte_telemetry.so.0.200.3 lib/librte_net.so.20.0.3 lib/librte_mbuf.so.20.0.3 lib/librte_mempool.so.20.0.3 lib/librte_ring.so.20.0.3 lib/librte_meter.so.20.0.3 lib/librte_metrics.so.20.0.3 lib/librte_security.so.20.0.3 lib/librte_cryptodev.so.20.0.3 -Wl,--end-group '-Wl,-rpath,$ORIGIN/../lib:XXXXXXXXXXXXXXXXXXXXXXXXXXXXXXXXXX' -Wl,-rpath-link,/root/UB1804-32_K4.15.0_GCC7.3.0/i686-native-linuxapp-gcc/60e87329c6dc4b60b81893fba910aa35/dpdk/build-gcc-shared/lib 
/usr/local/bin/ld: app/a172ced@@dpdk-proc-info at exe/proc-info_main.c.o: in function `show_port':
/root/UB1804-32_K4.15.0_GCC7.3.0/i686-native-linuxapp-gcc/60e87329c6dc4b60b81893fba910aa35/dpdk/build-gcc-shared/../app/proc-info/main.c:689: undefined reference to `rte_eth_link_prepare_text'
collect2: error: ld returned 1 exit status
[1752/2140] Compiling C object 'app/a172ced@@dpdk-test-cmdline at exe/test-cmdline_cmdline_test.c.o'.
[1753/2140] Linking target drivers/librte_pmd_bbdev_fpga_lte_fec.so.20.0.3.
[1754/2140] Generating rte_pmd_octeontx_event.sym_chk with a meson_exe.py custom command.
[1755/2140] Generating rte_pmd_bbdev_fpga_5gnr_fec.sym_chk with a meson_exe.py custom command.
[1756/2140] Generating rte_pmd_bbdev_turbo_sw.sym_chk with a meson_exe.py custom command.
[1757/2140] Compiling C object 'app/a172ced@@dpdk-pdump at exe/pdump_main.c.o'.
[1758/2140] Compiling C object 'app/a172ced@@dpdk-test-bbdev at exe/test-bbdev_test_bbdev.c.o'.
[1759/2140] Compiling C object 'app/a172ced@@dpdk-test-bbdev at exe/test-bbdev_test_bbdev_vector.c.o'.
[1760/2140] Compiling C object 'app/a172ced@@dpdk-test-bbdev at exe/test-bbdev_test_bbdev_perf.c.o'.
[1761/2140] Compiling C object 'drivers/a715181@@tmp_rte_pmd_octeontx2_event at sta/event_octeontx2_otx2_worker.c.o'.
[1762/2140] Compiling C object 'drivers/a715181@@tmp_rte_pmd_octeontx2_event at sta/event_octeontx2_otx2_worker_dual.c.o'.
ninja: build stopped: subcommand failed




*Meson Build Failed #6:
OS: UB1804-64
Target:./build-gcc-static
FAILED: app/dpdk-proc-info 
gcc  -o app/dpdk-proc-info 'app/a172ced@@dpdk-proc-info at exe/proc-info_main.c.o' -Wl,--as-needed -Wl,--no-undefined -Wl,--no-as-needed -pthread -Wl,--start-group -lm -ldl lib/librte_ethdev.so.20.0.3 lib/librte_eal.so.20.0.3 lib/librte_kvargs.so.20.0.3 lib/librte_telemetry.so.0.200.3 lib/librte_net.so.20.0.3 lib/librte_mbuf.so.20.0.3 lib/librte_mempool.so.20.0.3 lib/librte_ring.so.20.0.3 lib/librte_meter.so.20.0.3 lib/librte_metrics.so.20.0.3 lib/librte_security.so.20.0.3 lib/librte_cryptodev.so.20.0.3 -Wl,--end-group '-Wl,-rpath,$ORIGIN/../lib:XXXXXXXXXXXXXXXXXXXXXXXXXXXXXXXXXX' -Wl,-rpath-link,/root/UB1804-64_K4.15.0_GCC7.3.0/x86_64-native-linuxapp-gcc/60e87329c6dc4b60b81893fba910aa35/dpdk/build-gcc-shared/lib
app/a172ced@@dpdk-proc-info at exe/proc-info_main.c.o: In function `show_port':
/root/UB1804-64_K4.15.0_GCC7.3.0/x86_64-native-linuxapp-gcc/60e87329c6dc4b60b81893fba910aa35/dpdk/build-gcc-shared/../app/proc-info/main.c:689: undefined reference to `rte_eth_link_prepare_text'
collect2: error: ld returned 1 exit status
[1872/2281] Linking target app/dpdk-test-acl.
[1873/2281] Compiling C object 'app/a172ced@@dpdk-test-bbdev at exe/test-bbdev_test_bbdev.c.o'.
[1874/2281] Generating symbol file 'drivers/a715181@@rte_pmd_bbdev_fpga_5gnr_fec at sha/librte_pmd_bbdev_fpga_5gnr_fec.so.20.0.3.symbols'.
[1875/2281] Generating rte_pmd_octeontx_event.sym_chk with a meson_exe.py custom command.
[1876/2281] Generating symbol file 'drivers/a715181@@rte_pmd_bbdev_fpga_lte_fec at sha/librte_pmd_bbdev_fpga_lte_fec.so.20.0.3.symbols'.
[1877/2281] Compiling C object 'app/a172ced@@dpdk-pdump at exe/pdump_main.c.o'.
[1878/2281] Compiling C object 'app/a172ced@@dpdk-test-bbdev at exe/test-bbdev_test_bbdev_perf.c.o'.
[1879/2281] Compiling C object 'drivers/a715181@@tmp_rte_pmd_octeontx2_event at sta/event_octeontx2_otx2_worker.c.o'.
[1880/2281] Compiling C object 'drivers/a715181@@tmp_rte_pmd_octeontx2_event at sta/event_octeontx2_otx2_worker_dual.c.o'.
ninja: build stopped: subcommand failed




*Meson Build Failed #7:
OS: UB2004-64
Target:./build-gcc-static
FAILED: app/dpdk-proc-info 
gcc  -o app/dpdk-proc-info 'app/a172ced@@dpdk-proc-info at exe/proc-info_main.c.o' -Wl,--as-needed -Wl,--no-undefined -Wl,--no-as-needed -pthread -Wl,--start-group -lm -ldl -lnuma lib/librte_ethdev.so.20.0.3 lib/librte_eal.so.20.0.3 lib/librte_kvargs.so.20.0.3 lib/librte_telemetry.so.0.200.3 lib/librte_net.so.20.0.3 lib/librte_mbuf.so.20.0.3 lib/librte_mempool.so.20.0.3 lib/librte_ring.so.20.0.3 lib/librte_meter.so.20.0.3 lib/librte_metrics.so.20.0.3 lib/librte_security.so.20.0.3 lib/librte_cryptodev.so.20.0.3 -Wl,--end-group '-Wl,-rpath,$ORIGIN/../lib:XXXXXXXXXXXXXXXXXXXXXXXXXXXXXXXXXX' -Wl,-rpath-link,/root/UB2004-64_K5.4.0_GCC9.3.0/x86_64-native-linuxapp-gcc/60e87329c6dc4b60b81893fba910aa35/dpdk/build-gcc-shared/lib
/usr/bin/ld: app/a172ced@@dpdk-proc-info at exe/proc-info_main.c.o: in function `show_port':
/root/UB2004-64_K5.4.0_GCC9.3.0/x86_64-native-linuxapp-gcc/60e87329c6dc4b60b81893fba910aa35/dpdk/build-gcc-shared/../app/proc-info/main.c:689: undefined reference to `rte_eth_link_prepare_text'
collect2: error: ld returned 1 exit status
[1009/2397] Compiling C object 'app/a172ced@@dpdk-test-cmdline at exe/test-cmdline_cmdline_test.c.o'.
[1010/2397] Compiling C object 'drivers/a715181@@tmp_rte_pmd_bbdev_fpga_5gnr_fec at sta/baseband_fpga_5gnr_fec_rte_fpga_5gnr_fec.c.o'.
[1011/2397] Compiling C object 'drivers/net/i40e/base/3c1f984@@i40e_base at sta/i40e_lan_hmc.c.o'.
[1012/2397] Compiling C object 'app/a172ced@@dpdk-test-acl at exe/test-acl_main.c.o'.
[1013/2397] Generating rte_pmd_enic.sym_chk with a meson_exe.py custom command.
[1014/2397] Compiling C object 'drivers/a715181@@tmp_rte_pmd_fm10k at sta/net_fm10k_fm10k_rxtx.c.o'.
[1015/2397] Compiling C object 'drivers/a715181@@tmp_rte_pmd_failsafe at sta/net_failsafe_failsafe_ops.c.o'.
[1016/2397] Compiling C object 'app/a172ced@@dpdk-test-bbdev at exe/test-bbdev_test_bbdev.c.o'.
[1017/2397] Compiling C object 'drivers/a715181@@tmp_rte_pmd_fm10k at sta/net_fm10k_fm10k_rxtx_vec.c.o'.
[1018/2397] Compiling C object 'drivers/a715181@@tmp_rte_pmd_fm10k at sta/net_fm10k_fm10k_ethdev.c.o'.
[1019/2397] Compiling C object 'app/a172ced@@dpdk-test-bbdev at exe/test-bbdev_test_bbdev_perf.c.o'.
ninja: build stopped: subcommand failed



DPDK STV team


More information about the test-report mailing list