[dpdk-test-report] |FAILURE| pw(83441) [8/8] ionic: nits - whitespace, logging, helper variables

sys_stv at intel.com sys_stv at intel.com
Tue Nov 3 10:45:27 CET 2020


Test-Label: Intel-compilation
Test-Status: FAILURE
http://dpdk.org/patch/83441

_Compilation issues_

Submitter: Andrew Boyer <aboyer at pensando.io>
Date: 2020-11-02 18:35:27
Reply_mail: 20201102183527.69209-9-aboyer at pensando.io

DPDK git baseline: Repo:dpdk-next-net, CommitID: c738ca48f38314bbc577b0f873f8a9fa99f21aee


Meson Build Summary: 22 Builds Done, 21 Successful, 1 Failures, 0 Blocked

+----------------+------------+--------------+------------+------------+-----------+----------+
| os             | gcc-static | clang-static | icc-static | gcc-shared | gcc-debug | document |
+----------------+------------+--------------+------------+------------+-----------+----------+
| CENTOS82-64    | pass       | pass         | pass       | pass       | pass      |          |
| RHEL82-64      | pass       |              |            |            |           |          |
| UB1804-64      | pass       |              |            |            |           |          |
| FC33-64        | pass       | pass         |            |            |           |          |
| UB2010-64      | pass       |              |            |            |           |          |
| UB2004-64      | pass       | pass         | pass       |            |           | pass     |
| WIN10-64       |            | pass         |            |            |           |          |
| UB2004-32      | FAIL       |              |            |            |           |          |
| FreeBSD1201-64 | pass       | pass         |            | pass       | pass      |          |
| SUSE15-64      | pass       | pass         |            |            |           |          |
+----------------+------------+--------------+------------+------------+-----------+----------+
Test environment and configuration as below:


OS: CENTOS82-64
	Kernel Version: 4.18.0-193.14.2.el8_2.x86_64
	CPU info: Intel(R) Xeon(R) Platinum 8280M CPU @ 2.70GHz
	GCC Version: gcc (GCC) 8.3.1 20191121 (Red Hat 8.3.1-5)
	Clang Version: 9.0.1 (Red Hat 9.0.1-2.module_el8.2.0+309+0c7b6b03)
	x86_64-native-linuxapp-gcc
	x86_64-native-linuxapp-clang
	x86_64-native-linuxapp-icc
	x86_64-native-linuxapp-gcc+shared
	x86_64-native-linuxapp-gcc+debug

OS: RHEL82-64
	Kernel Version: 4.18.0-193.el8.x86_64
	CPU info: Intel(R) Xeon(R) Platinum 8280M CPU @ 2.70GHz
	GCC Version: gcc (GCC) 8.3.1 20191121 (Red Hat 8.3.1-5)
	Clang Version: 8.0.1 (Red Hat 8.0.1-1.module_el8.1.0+215+a01033fb)
	x86_64-native-linuxapp-gcc

OS: UB1804-64
	Kernel Version: 5.3.0-59-generic
	CPU info: Intel(R) Xeon(R) Platinum 8180 CPU @ 2.50GHz
	GCC Version: gcc (Ubuntu 8.4.0-1ubuntu1~18.04) 8.4.0
	Clang Version: 6.0.0-1ubuntu2 (tags/RELEASE_600/final)
	x86_64-native-linuxapp-gcc

OS: FC33-64
	Kernel Version: 5.8.16-300.fc33.x86_64
	CPU info: Intel(R) Xeon(R) CPU E5-2699 v4 @ 2.20GHz
	GCC Version: gcc (GCC) 10.2.1 20201005 (Red Hat 10.2.1-5)
	Clang Version: 11.0.0 (Fedora 11.0.0-1.fc33)
	x86_64-native-linuxapp-gcc
	x86_64-native-linuxapp-clang

OS: UB2010-64
	Kernel Version: 5.8.0-25-generic
	CPU info: Intel(R) Xeon(R) CPU E5-2699 v4 @ 2.20GHz
	GCC Version: gcc (Ubuntu 10.2.0-13ubuntu1) 10.2.0
	Clang Version: 11.0.0-2
	x86_64-native-linuxapp-gcc

OS: UB2004-64
	Kernel Version: 5.4.0-47-generic
	CPU info: Intel(R) Xeon(R) Platinum 8180 CPU @ 2.50GHz
	GCC Version: gcc (Ubuntu 10-20200416-0ubuntu1) 10.0.1 20200416 (experimental) [master revision 3c3f12e2a76:dcee354ce56:44b326839d864fc10c459916abcc97f35a9ac3de]
	Clang Version: 10.0.0-4ubuntu1
	x86_64-native-linuxapp-clang
	x86_64-native-linuxapp-gcc
	x86_64-native-linuxapp-icc
	x86_64-native-linuxapp-doc

OS: WIN10-64
	Kernel Version: N/A
	CPU info: N/A
	GCC Version: N/A
	Clang Version: Clang 8.0.0
	x86_64-windows-clang

OS: UB2004-32
	Kernel Version: 5.4.0-47-generic
	CPU info: Intel(R) Xeon(R) Platinum 8180 CPU @ 2.50GHz
	GCC Version: gcc (Ubuntu 9.3.0-10ubuntu2) 9.3.0
	Clang Version: 10.0.0-4ubuntu1
	i686-native-linuxapp-gcc

OS: FreeBSD1201-64
	Kernel Version: 12.1-RELEASE
	CPU info: Intel(R) Xeon(R) CPU E5-2699 v3 @ 2.30GHz (2294.74-MHz K8-class CPU)
	GCC Version: gcc (FreeBSD Ports Collection) 9.2.0
	Clang Version: 8.0.1 (tags/RELEASE_801/final 366581) (based on LLVM 8.0.1)
	x86_64-native-bsdapp-gcc
	x86_64-native-bsdapp-clang
	x86_64-native-bsdapp-gcc+shared
	x86_64-native-bsdapp-gcc+debug

OS: SUSE15-64
	Kernel Version: 4.12.14-lp150.11-default
	CPU info: Intel(R) Xeon(R) CPU E5-2699 v4 @ 2.20GHz
	GCC Version: gcc (SUSE Linux) 7.3.1 20180323 [gcc-7-branch revision 258812]
	Clang Version: 5.0.1 (tags/RELEASE_501/final 312548)
	x86_64-native-linuxapp-clang
	x86_64-native-linuxapp-gcc



*Build Failed #1:
OS: UB2004-32
Target: i686-native-linuxapp-gcc
FAILED: drivers/libtmp_rte_net_ionic.a.p/net_ionic_ionic_rxtx.c.o 
gcc -Idrivers/libtmp_rte_net_ionic.a.p -Idrivers -I../drivers -Idrivers/net/ionic -I../drivers/net/ionic -Ilib/librte_ethdev -I../lib/librte_ethdev -I. -I.. -Iconfig -I../config -Ilib/librte_eal/include -I../lib/librte_eal/include -Ilib/librte_eal/linux/include -I../lib/librte_eal/linux/include -Ilib/librte_eal/x86/include -I../lib/librte_eal/x86/include -Ilib/librte_eal/common -I../lib/librte_eal/common -Ilib/librte_eal -I../lib/librte_eal -Ilib/librte_kvargs -I../lib/librte_kvargs -Ilib/librte_metrics -I../lib/librte_metrics -Ilib/librte_telemetry -I../lib/librte_telemetry -Ilib/librte_net -I../lib/librte_net -Ilib/librte_mbuf -I../lib/librte_mbuf -Ilib/librte_mempool -I../lib/librte_mempool -Ilib/librte_ring -I../lib/librte_ring -Ilib/librte_meter -I../lib/librte_meter -Idrivers/bus/pci -I../drivers/bus/pci -I../drivers/bus/pci/linux -Ilib/librte_pci -I../lib/librte_pci -Idrivers/bus/vdev -I../drivers/bus/vdev -fdiagnostics-color=always -pipe -D_FILE_OFFSET_BITS=64 -Wall -Winvalid-pch -Werror -O3 -include rte_config.h -Wextra -Wcast-qual -Wdeprecated -Wformat-nonliteral -Wformat-security -Wmissing-declarations -Wmissing-prototypes -Wnested-externs -Wold-style-definition -Wpointer-arith -Wsign-compare -Wstrict-prototypes -Wundef -Wwrite-strings -Wno-address-of-packed-member -Wno-packed-not-aligned -Wno-missing-field-initializers -Wno-pointer-to-int-cast -D_GNU_SOURCE -m32 -fPIC -march=native -DALLOW_EXPERIMENTAL_API -DALLOW_INTERNAL_API -Wno-format-truncation -MD -MQ drivers/libtmp_rte_net_ionic.a.p/net_ionic_ionic_rxtx.c.o -MF drivers/libtmp_rte_net_ionic.a.p/net_ionic_ionic_rxtx.c.o.d -o drivers/libtmp_rte_net_ionic.a.p/net_ionic_ionic_rxtx.c.o -c ../drivers/net/ionic/ionic_rxtx.c
In file included from ../drivers/net/ionic/ionic_rxtx.c:44:
../drivers/net/ionic/ionic_rxtx.c: In function ‘ionic_dev_tx_queue_setup’:
../drivers/net/ionic/ionic_logs.h:13:17: error: format ‘%lx’ expects argument of type ‘long unsigned int’, but argument 7 has type ‘uint64_t’ {aka ‘long long unsigned int’} [-Werror=format=]
   13 |  ionic_logtype, "%s(): " fmt "\n", __func__, ##args)
      |                 ^~~~~~~~
../drivers/net/ionic/ionic_rxtx.c:175:2: note: in expansion of macro ‘IONIC_PRINT’
  175 |  IONIC_PRINT(DEBUG,
      |  ^~~~~~~~~~~
../drivers/net/ionic/ionic_rxtx.c:176:56: note: format string is defined here
  176 |   "Configuring TX queue %u with %u buffers, offloads %lx",
      |                                                      ~~^
      |                                                        |
      |                                                        long unsigned int
      |                                                      %llx
In file included from ../drivers/net/ionic/ionic_rxtx.c:44:
../drivers/net/ionic/ionic_rxtx.c: In function ‘ionic_dev_rx_queue_setup’:
../drivers/net/ionic/ionic_logs.h:13:17: error: format ‘%lx’ expects argument of type ‘long unsigned int’, but argument 7 has type ‘uint64_t’ {aka ‘long long unsigned int’} [-Werror=format=]
   13 |  ionic_logtype, "%s(): " fmt "\n", __func__, ##args)
      |                 ^~~~~~~~
../drivers/net/ionic/ionic_rxtx.c:661:2: note: in expansion of macro ‘IONIC_PRINT’
  661 |  IONIC_PRINT(DEBUG,
      |  ^~~~~~~~~~~
../drivers/net/ionic/ionic_rxtx.c:662:56: note: format string is defined here
  662 |   "Configuring RX queue %u with %u buffers, offloads %lx",
      |                                                      ~~^
      |                                                        |
      |                                                        long unsigned int
      |                                                      %llx
cc1: all warnings being treated as errors
[1268/2445] Compiling C object drivers/net/ixgbe/base/libixgbe_base.a.p/ixgbe_api.c.o
[1269/2445] Generating rte_net_ice.sym_chk with a meson_exe.py custom command
[1270/2445] Compiling C object drivers/libtmp_rte_net_ionic.a.p/net_ionic_ionic_lif.c.o
FAILED: drivers/libtmp_rte_net_ionic.a.p/net_ionic_ionic_lif.c.o 
gcc -Idrivers/libtmp_rte_net_ionic.a.p -Idrivers -I../drivers -Idrivers/net/ionic -I../drivers/net/ionic -Ilib/librte_ethdev -I../lib/librte_ethdev -I. -I.. -Iconfig -I../config -Ilib/librte_eal/include -I../lib/librte_eal/include -Ilib/librte_eal/linux/include -I../lib/librte_eal/linux/include -Ilib/librte_eal/x86/include -I../lib/librte_eal/x86/include -Ilib/librte_eal/common -I../lib/librte_eal/common -Ilib/librte_eal -I../lib/librte_eal -Ilib/librte_kvargs -I../lib/librte_kvargs -Ilib/librte_metrics -I../lib/librte_metrics -Ilib/librte_telemetry -I../lib/librte_telemetry -Ilib/librte_net -I../lib/librte_net -Ilib/librte_mbuf -I../lib/librte_mbuf -Ilib/librte_mempool -I../lib/librte_mempool -Ilib/librte_ring -I../lib/librte_ring -Ilib/librte_meter -I../lib/librte_meter -Idrivers/bus/pci -I../drivers/bus/pci -I../drivers/bus/pci/linux -Ilib/librte_pci -I../lib/librte_pci -Idrivers/bus/vdev -I../drivers/bus/vdev -fdiagnostics-color=always -pipe -D_FILE_OFFSET_BITS=64 -Wall -Winvalid-pch -Werror -O3 -include rte_config.h -Wextra -Wcast-qual -Wdeprecated -Wformat-nonliteral -Wformat-security -Wmissing-declarations -Wmissing-prototypes -Wnested-externs -Wold-style-definition -Wpointer-arith -Wsign-compare -Wstrict-prototypes -Wundef -Wwrite-strings -Wno-address-of-packed-member -Wno-packed-not-aligned -Wno-missing-field-initializers -Wno-pointer-to-int-cast -D_GNU_SOURCE -m32 -fPIC -march=native -DALLOW_EXPERIMENTAL_API -DALLOW_INTERNAL_API -Wno-format-truncation -MD -MQ drivers/libtmp_rte_net_ionic.a.p/net_ionic_ionic_lif.c.o -MF drivers/libtmp_rte_net_ionic.a.p/net_ionic_ionic_lif.c.o.d -o drivers/libtmp_rte_net_ionic.a.p/net_ionic_ionic_lif.c.o -c ../drivers/net/ionic/ionic_lif.c
In file included from ../drivers/net/ionic/ionic_osdep.h:21,
                 from ../drivers/net/ionic/ionic_dev.h:10,
                 from ../drivers/net/ionic/ionic.h:13,
                 from ../drivers/net/ionic/ionic_lif.c:8:
../drivers/net/ionic/ionic_lif.c: In function ‘ionic_qcq_alloc’:
../drivers/net/ionic/ionic_logs.h:13:17: error: format ‘%lx’ expects argument of type ‘long unsigned int’, but argument 5 has type ‘rte_iova_t’ {aka ‘long long unsigned int’} [-Werror=format=]
   13 |  ionic_logtype, "%s(): " fmt "\n", __func__, ##args)
      |                 ^~~~~~~~
../drivers/net/ionic/ionic_lif.c:687:2: note: in expansion of macro ‘IONIC_PRINT’
  687 |  IONIC_PRINT(DEBUG, "Q-Base-PA = %#lx CQ-Base-PA = %#lx "
      |  ^~~~~~~~~~~
../drivers/net/ionic/ionic_lif.c:687:37: note: format string is defined here
  687 |  IONIC_PRINT(DEBUG, "Q-Base-PA = %#lx CQ-Base-PA = %#lx "
      |                                  ~~~^
      |                                     |
      |                                     long unsigned int
      |                                  %#llx
In file included from ../drivers/net/ionic/ionic_osdep.h:21,
                 from ../drivers/net/ionic/ionic_dev.h:10,
                 from ../drivers/net/ionic/ionic.h:13,
                 from ../drivers/net/ionic/ionic_lif.c:8:
../drivers/net/ionic/ionic_logs.h:13:17: error: format ‘%lx’ expects argument of type ‘long unsigned int’, but argument 6 has type ‘rte_iova_t’ {aka ‘long long unsigned int’} [-Werror=format=]
   13 |  ionic_logtype, "%s(): " fmt "\n", __func__, ##args)
      |                 ^~~~~~~~
../drivers/net/ionic/ionic_lif.c:687:2: note: in expansion of macro ‘IONIC_PRINT’
  687 |  IONIC_PRINT(DEBUG, "Q-Base-PA = %#lx CQ-Base-PA = %#lx "
      |  ^~~~~~~~~~~
../drivers/net/ionic/ionic_lif.c:687:55: note: format string is defined here
  687 |  IONIC_PRINT(DEBUG, "Q-Base-PA = %#lx CQ-Base-PA = %#lx "
      |                                                    ~~~^
      |                                                       |
      |                                                       long unsigned int
      |                                                    %#llx
In file included from ../drivers/net/ionic/ionic_osdep.h:21,
                 from ../drivers/net/ionic/ionic_dev.h:10,
                 from ../drivers/net/ionic/ionic.h:13,
                 from ../drivers/net/ionic/ionic_lif.c:8:
../drivers/net/ionic/ionic_logs.h:13:17: error: format ‘%lx’ expects argument of type ‘long unsigned int’, but argument 7 has type ‘rte_iova_t’ {aka ‘long long unsigned int’} [-Werror=format=]
   13 |  ionic_logtype, "%s(): " fmt "\n", __func__, ##args)
      |                 ^~~~~~~~
../drivers/net/ionic/ionic_lif.c:687:2: note: in expansion of macro ‘IONIC_PRINT’
  687 |  IONIC_PRINT(DEBUG, "Q-Base-PA = %#lx CQ-Base-PA = %#lx "
      |  ^~~~~~~~~~~
../drivers/net/ionic/ionic_lif.c:688:20: note: format string is defined here
  688 |   "SG-base-PA = %#lx",
      |                 ~~~^
      |                    |
      |                    long unsigned int
      |                 %#llx
cc1: all warnings being treated as errors
[1271/2445] Compiling C object drivers/net/ixgbe/base/libixgbe_base.a.p/ixgbe_82598.c.o
[1272/2445] Compiling C object drivers/net/ixgbe/base/libixgbe_base.a.p/ixgbe_dcb_82598.c.o
[1273/2445] Compiling C object drivers/net/ixgbe/base/libixgbe_base.a.p/ixgbe_dcb_82599.c.o
[1274/2445] Compiling C object drivers/libtmp_rte_net_igc.a.p/net_igc_igc_txrx.c.o
[1275/2445] Compiling C object drivers/net/ixgbe/base/libixgbe_base.a.p/ixgbe_82599.c.o
[1276/2445] Compiling C object drivers/net/ixgbe/base/libixgbe_base.a.p/ixgbe_common.c.o
ninja: build stopped: subcommand failed


DPDK STV team


More information about the test-report mailing list