[dpdk-test-report] |FAILURE| pw(83874) [v3] net/i40e: fix incorrect FDIR flex configuration

sys_stv at intel.com sys_stv at intel.com
Tue Nov 10 13:01:26 CET 2020


Test-Label: Intel-compilation
Test-Status: FAILURE
http://dpdk.org/patch/83874

_Compilation issues_

Submitter: Chenxu Di <chenxux.di at intel.com>
Date: 2020-11-10 05:42:57
Reply_mail: 20201110054257.80765-1-chenxux.di at intel.com

DPDK git baseline: Repo:dpdk-next-net-intel, CommitID: 3d7db4276c2e3ea75c2fa28e22c1eff6619a28b1


Meson Build Summary: 22 Builds Done, 1 Successful, 21 Failures, 0 Blocked

+----------------+------------+--------------+------------+------------+-----------+----------+
| os             | gcc-static | clang-static | icc-static | gcc-shared | gcc-debug | document |
+----------------+------------+--------------+------------+------------+-----------+----------+
| CENTOS82-64    | FAIL       | FAIL         | FAIL       | FAIL       | FAIL      |          |
| RHEL82-64      | FAIL       |              |            |            |           |          |
| UB1804-64      | FAIL       |              |            |            |           |          |
| FC33-64        | FAIL       | FAIL         |            |            |           |          |
| UB2010-64      | FAIL       |              |            |            |           |          |
| UB2004-64      | FAIL       | FAIL         | FAIL       |            |           | FAIL     |
| WIN10-64       |            | pass         |            |            |           |          |
| UB2004-32      | FAIL       |              |            |            |           |          |
| FreeBSD1201-64 | FAIL       | FAIL         |            | FAIL       | FAIL      |          |
| SUSE15-64      | FAIL       | FAIL         |            |            |           |          |
+----------------+------------+--------------+------------+------------+-----------+----------+
Test environment and configuration as below:


OS: CENTOS82-64
	Kernel Version: 4.18.0-193.14.2.el8_2.x86_64
	CPU info: Intel(R) Xeon(R) Platinum 8280M CPU @ 2.70GHz
	GCC Version: gcc (GCC) 8.3.1 20191121 (Red Hat 8.3.1-5)
	Clang Version: 9.0.1 (Red Hat 9.0.1-2.module_el8.2.0+309+0c7b6b03)
	x86_64-native-linuxapp-gcc
	x86_64-native-linuxapp-clang
	x86_64-native-linuxapp-icc
	x86_64-native-linuxapp-gcc+shared
	x86_64-native-linuxapp-gcc+debug

OS: RHEL82-64
	Kernel Version: 4.18.0-193.el8.x86_64
	CPU info: Intel(R) Xeon(R) CPU E5-2699 v4 @ 2.20GHz
	GCC Version: gcc (GCC) 8.3.1 20191121 (Red Hat 8.3.1-5)
	Clang Version: 8.0.1 (Red Hat 8.0.1-1.module_el8.1.0+215+a01033fb)
	x86_64-native-linuxapp-gcc

OS: UB1804-64
	Kernel Version: 5.3.0-59-generic
	CPU info: Intel(R) Xeon(R) Platinum 8180 CPU @ 2.50GHz
	GCC Version: gcc (Ubuntu 8.4.0-1ubuntu1~18.04) 8.4.0
	Clang Version: 6.0.0-1ubuntu2 (tags/RELEASE_600/final)
	x86_64-native-linuxapp-gcc

OS: FC33-64
	Kernel Version: 5.8.16-300.fc33.x86_64
	CPU info: Intel(R) Xeon(R) CPU E5-2699 v4 @ 2.20GHz
	GCC Version: gcc (GCC) 10.2.1 20201005 (Red Hat 10.2.1-5)
	Clang Version: 11.0.0 (Fedora 11.0.0-1.fc33)
	x86_64-native-linuxapp-gcc
	x86_64-native-linuxapp-clang

OS: UB2010-64
	Kernel Version: 5.8.0-25-generic
	CPU info: Intel(R) Xeon(R) CPU E5-2699 v4 @ 2.20GHz
	GCC Version: gcc (Ubuntu 10.2.0-13ubuntu1) 10.2.0
	Clang Version: 11.0.0-2
	x86_64-native-linuxapp-gcc

OS: UB2004-64
	Kernel Version: 5.4.0-47-generic
	CPU info: Intel(R) Xeon(R) Platinum 8180 CPU @ 2.50GHz
	GCC Version: gcc (Ubuntu 10-20200416-0ubuntu1) 10.0.1 20200416 (experimental) [master revision 3c3f12e2a76:dcee354ce56:44b326839d864fc10c459916abcc97f35a9ac3de]
	Clang Version: 10.0.0-4ubuntu1
	x86_64-native-linuxapp-clang
	x86_64-native-linuxapp-gcc
	x86_64-native-linuxapp-icc
	x86_64-native-linuxapp-doc

OS: WIN10-64
	Kernel Version: N/A
	CPU info: N/A
	GCC Version: N/A
	Clang Version: Clang 8.0.0
	x86_64-windows-clang

OS: UB2004-32
	Kernel Version: 5.4.0-47-generic
	CPU info: Intel(R) Xeon(R) Platinum 8180 CPU @ 2.50GHz
	GCC Version: gcc (Ubuntu 9.3.0-10ubuntu2) 9.3.0
	Clang Version: 10.0.0-4ubuntu1
	i686-native-linuxapp-gcc

OS: FreeBSD1201-64
	Kernel Version: 12.1-RELEASE
	CPU info: Intel(R) Xeon(R) CPU E5-2699 v3 @ 2.30GHz (2294.74-MHz K8-class CPU)
	GCC Version: gcc (FreeBSD Ports Collection) 9.2.0
	Clang Version: 8.0.1 (tags/RELEASE_801/final 366581) (based on LLVM 8.0.1)
	x86_64-native-bsdapp-gcc
	x86_64-native-bsdapp-clang
	x86_64-native-bsdapp-gcc+shared
	x86_64-native-bsdapp-gcc+debug

OS: SUSE15-64
	Kernel Version: 4.12.14-lp150.11-default
	CPU info: Intel(R) Xeon(R) CPU E5-2699 v4 @ 2.20GHz
	GCC Version: gcc (SUSE Linux) 7.3.1 20180323 [gcc-7-branch revision 258812]
	Clang Version: 5.0.1 (tags/RELEASE_501/final 312548)
	x86_64-native-linuxapp-clang
	x86_64-native-linuxapp-gcc



*Build Failed #1:
OS: CENTOS82-64
Target: x86_64-native-linuxapp-gcc
FAILED: drivers/libtmp_rte_net_i40e.a.p/net_i40e_i40e_fdir.c.o 
gcc -Idrivers/libtmp_rte_net_i40e.a.p -Idrivers -I../drivers -Idrivers/net/i40e -I../drivers/net/i40e -Idrivers/net/i40e/base -I../drivers/net/i40e/base -Ilib/librte_ethdev -I../lib/librte_ethdev -I. -I.. -Iconfig -I../config -Ilib/librte_eal/include -I../lib/librte_eal/include -Ilib/librte_eal/linux/include -I../lib/librte_eal/linux/include -Ilib/librte_eal/x86/include -I../lib/librte_eal/x86/include -Ilib/librte_eal/common -I../lib/librte_eal/common -Ilib/librte_eal -I../lib/librte_eal -Ilib/librte_kvargs -I../lib/librte_kvargs -Ilib/librte_metrics -I../lib/librte_metrics -Ilib/librte_telemetry -I../lib/librte_telemetry -Ilib/librte_net -I../lib/librte_net -Ilib/librte_mbuf -I../lib/librte_mbuf -Ilib/librte_mempool -I../lib/librte_mempool -Ilib/librte_ring -I../lib/librte_ring -Ilib/librte_meter -I../lib/librte_meter -Idrivers/bus/pci -I../drivers/bus/pci -I../drivers/bus/pci/linux -Ilib/librte_pci -I../lib/librte_pci -Idrivers/bus/vdev -I../drivers/bus/vdev -Ilib/librte_hash -I../lib/librte_hash -Ilib/librte_rcu -I../lib/librte_rcu -fdiagnostics-color=always -pipe -D_FILE_OFFSET_BITS=64 -Wall -Winvalid-pch -Werror -O3 -include rte_config.h -Wextra -Wcast-qual -Wdeprecated -Wformat-nonliteral -Wformat-security -Wmissing-declarations -Wmissing-prototypes -Wnested-externs -Wold-style-definition -Wpointer-arith -Wsign-compare -Wstrict-prototypes -Wundef -Wwrite-strings -Wno-packed-not-aligned -Wno-missing-field-initializers -D_GNU_SOURCE -fPIC -march=native -mno-avx512f -DALLOW_EXPERIMENTAL_API -DALLOW_INTERNAL_API -Wno-format-truncation -DPF_DRIVER -DVF_DRIVER -DINTEGRATED_VF -DX722_A0_SUPPORT -DCC_AVX2_SUPPORT -MD -MQ drivers/libtmp_rte_net_i40e.a.p/net_i40e_i40e_fdir.c.o -MF drivers/libtmp_rte_net_i40e.a.p/net_i40e_i40e_fdir.c.o.d -o drivers/libtmp_rte_net_i40e.a.p/net_i40e_i40e_fdir.c.o -c ../drivers/net/i40e/i40e_fdir.c
../drivers/net/i40e/i40e_fdir.c:1593:1: error: redefinition of ‘i40e_flow_store_flex_pit’
 i40e_flow_store_flex_pit(struct i40e_pf *pf,
 ^~~~~~~~~~~~~~~~~~~~~~~~
../drivers/net/i40e/i40e_fdir.c:1446:1: note: previous definition of ‘i40e_flow_store_flex_pit’ was here
 i40e_flow_store_flex_pit(struct i40e_pf *pf,
 ^~~~~~~~~~~~~~~~~~~~~~~~
../drivers/net/i40e/i40e_fdir.c:1626:1: error: redefinition of ‘i40e_flow_set_fdir_flex_pit’
 i40e_flow_set_fdir_flex_pit(struct i40e_pf *pf,
 ^~~~~~~~~~~~~~~~~~~~~~~~~~~
../drivers/net/i40e/i40e_fdir.c:1479:1: note: previous definition of ‘i40e_flow_set_fdir_flex_pit’ was here
 i40e_flow_set_fdir_flex_pit(struct i40e_pf *pf,
 ^~~~~~~~~~~~~~~~~~~~~~~~~~~
../drivers/net/i40e/i40e_fdir.c:1668:1: error: redefinition of ‘i40e_flow_store_flex_mask’
 i40e_flow_store_flex_mask(struct i40e_pf *pf,
 ^~~~~~~~~~~~~~~~~~~~~~~~~
../drivers/net/i40e/i40e_fdir.c:1521:1: note: previous definition of ‘i40e_flow_store_flex_mask’ was here
 i40e_flow_store_flex_mask(struct i40e_pf *pf,
 ^~~~~~~~~~~~~~~~~~~~~~~~~
../drivers/net/i40e/i40e_fdir.c:1710:1: error: redefinition of ‘i40e_flow_set_fdir_flex_msk’
 i40e_flow_set_fdir_flex_msk(struct i40e_pf *pf,
 ^~~~~~~~~~~~~~~~~~~~~~~~~~~
../drivers/net/i40e/i40e_fdir.c:1563:1: note: previous definition of ‘i40e_flow_set_fdir_flex_msk’ was here
 i40e_flow_set_fdir_flex_msk(struct i40e_pf *pf,
 ^~~~~~~~~~~~~~~~~~~~~~~~~~~
../drivers/net/i40e/i40e_fdir.c:1563:1: error: ‘i40e_flow_set_fdir_flex_msk’ defined but not used [-Werror=unused-function]
../drivers/net/i40e/i40e_fdir.c:1521:1: error: ‘i40e_flow_store_flex_mask’ defined but not used [-Werror=unused-function]
 i40e_flow_store_flex_mask(struct i40e_pf *pf,
 ^~~~~~~~~~~~~~~~~~~~~~~~~
../drivers/net/i40e/i40e_fdir.c:1479:1: error: ‘i40e_flow_set_fdir_flex_pit’ defined but not used [-Werror=unused-function]
 i40e_flow_set_fdir_flex_pit(struct i40e_pf *pf,
 ^~~~~~~~~~~~~~~~~~~~~~~~~~~
../drivers/net/i40e/i40e_fdir.c:1446:1: error: ‘i40e_flow_store_flex_pit’ defined but not used [-Werror=unused-function]
 i40e_flow_store_flex_pit(struct i40e_pf *pf,
 ^~~~~~~~~~~~~~~~~~~~~~~~
cc1: all warnings being treated as errors
[1236/2736] Generating rte_net_fm10k.pmd.c with a custom command
[1237/2736] Compiling C object drivers/net/i40e/base/libi40e_base.a.p/i40e_common.c.o
[1238/2736] Linking target drivers/librte_net_failsafe.so.21.0
[1239/2736] Compiling C object drivers/libtmp_rte_net_i40e.a.p/net_i40e_i40e_pf.c.o
[1240/2736] Compiling C object drivers/libtmp_rte_net_i40e.a.p/net_i40e_i40e_tm.c.o
[1241/2736] Compiling C object drivers/libtmp_rte_net_i40e.a.p/net_i40e_i40e_ethdev_vf.c.o
[1242/2736] Compiling C object drivers/libtmp_rte_net_i40e.a.p/net_i40e_i40e_flow.c.o
[1243/2736] Compiling C object drivers/libtmp_rte_net_i40e.a.p/net_i40e_i40e_rxtx.c.o
[1244/2736] Compiling C object drivers/libtmp_rte_net_i40e.a.p/net_i40e_i40e_ethdev.c.o
ninja: build stopped: subcommand failed




*Build Failed #2:
OS: CENTOS82-64
Target: x86_64-native-linuxapp-clang
FAILED: drivers/libtmp_rte_net_i40e.a.p/net_i40e_i40e_fdir.c.o 
clang -Idrivers/libtmp_rte_net_i40e.a.p -Idrivers -I../drivers -Idrivers/net/i40e -I../drivers/net/i40e -Idrivers/net/i40e/base -I../drivers/net/i40e/base -Ilib/librte_ethdev -I../lib/librte_ethdev -I. -I.. -Iconfig -I../config -Ilib/librte_eal/include -I../lib/librte_eal/include -Ilib/librte_eal/linux/include -I../lib/librte_eal/linux/include -Ilib/librte_eal/x86/include -I../lib/librte_eal/x86/include -Ilib/librte_eal/common -I../lib/librte_eal/common -Ilib/librte_eal -I../lib/librte_eal -Ilib/librte_kvargs -I../lib/librte_kvargs -Ilib/librte_metrics -I../lib/librte_metrics -Ilib/librte_telemetry -I../lib/librte_telemetry -Ilib/librte_net -I../lib/librte_net -Ilib/librte_mbuf -I../lib/librte_mbuf -Ilib/librte_mempool -I../lib/librte_mempool -Ilib/librte_ring -I../lib/librte_ring -Ilib/librte_meter -I../lib/librte_meter -Idrivers/bus/pci -I../drivers/bus/pci -I../drivers/bus/pci/linux -Ilib/librte_pci -I../lib/librte_pci -Idrivers/bus/vdev -I../drivers/bus/vdev -Ilib/librte_hash -I../lib/librte_hash -Ilib/librte_rcu -I../lib/librte_rcu -Xclang -fcolor-diagnostics -pipe -D_FILE_OFFSET_BITS=64 -Wall -Winvalid-pch -Werror -O3 -include rte_config.h -Wextra -Wcast-qual -Wdeprecated -Wformat-nonliteral -Wformat-security -Wmissing-declarations -Wmissing-prototypes -Wnested-externs -Wold-style-definition -Wpointer-arith -Wsign-compare -Wstrict-prototypes -Wundef -Wwrite-strings -Wno-address-of-packed-member -Wno-missing-field-initializers -D_GNU_SOURCE -fPIC -march=native -mno-avx512f -DALLOW_EXPERIMENTAL_API -DALLOW_INTERNAL_API -DPF_DRIVER -DVF_DRIVER -DINTEGRATED_VF -DX722_A0_SUPPORT -DCC_AVX2_SUPPORT -MD -MQ drivers/libtmp_rte_net_i40e.a.p/net_i40e_i40e_fdir.c.o -MF drivers/libtmp_rte_net_i40e.a.p/net_i40e_i40e_fdir.c.o.d -o drivers/libtmp_rte_net_i40e.a.p/net_i40e_i40e_fdir.c.o -c ../drivers/net/i40e/i40e_fdir.c
../drivers/net/i40e/i40e_fdir.c:1593:1: error: redefinition of 'i40e_flow_store_flex_pit'
i40e_flow_store_flex_pit(struct i40e_pf *pf,
^
../drivers/net/i40e/i40e_fdir.c:1446:1: note: previous definition is here
i40e_flow_store_flex_pit(struct i40e_pf *pf,
^
../drivers/net/i40e/i40e_fdir.c:1626:1: error: redefinition of 'i40e_flow_set_fdir_flex_pit'
i40e_flow_set_fdir_flex_pit(struct i40e_pf *pf,
^
../drivers/net/i40e/i40e_fdir.c:1479:1: note: previous definition is here
i40e_flow_set_fdir_flex_pit(struct i40e_pf *pf,
^
../drivers/net/i40e/i40e_fdir.c:1668:1: error: redefinition of 'i40e_flow_store_flex_mask'
i40e_flow_store_flex_mask(struct i40e_pf *pf,
^
../drivers/net/i40e/i40e_fdir.c:1521:1: note: previous definition is here
i40e_flow_store_flex_mask(struct i40e_pf *pf,
^
../drivers/net/i40e/i40e_fdir.c:1710:1: error: redefinition of 'i40e_flow_set_fdir_flex_msk'
i40e_flow_set_fdir_flex_msk(struct i40e_pf *pf,
^
../drivers/net/i40e/i40e_fdir.c:1563:1: note: previous definition is here
i40e_flow_set_fdir_flex_msk(struct i40e_pf *pf,
^
4 errors generated.
[1246/2736] Linking target drivers/librte_net_failsafe.so.21.0
[1247/2736] Generating rte_net_fm10k.sym_chk with a meson_exe.py custom command
[1248/2736] Compiling C object drivers/libtmp_rte_net_i40e.a.p/net_i40e_i40e_ethdev_vf.c.o
[1249/2736] Compiling C object drivers/libtmp_rte_net_i40e.a.p/net_i40e_i40e_pf.c.o
[1250/2736] Compiling C object drivers/libtmp_rte_net_i40e.a.p/net_i40e_i40e_rxtx.c.o
[1251/2736] Compiling C object drivers/libtmp_rte_net_i40e.a.p/net_i40e_i40e_tm.c.o
[1252/2736] Compiling C object drivers/libtmp_rte_net_i40e.a.p/net_i40e_i40e_flow.c.o
[1253/2736] Compiling C object drivers/libtmp_rte_net_i40e.a.p/net_i40e_rte_pmd_i40e.c.o
[1254/2736] Compiling C object drivers/libtmp_rte_net_i40e.a.p/net_i40e_i40e_ethdev.c.o
ninja: build stopped: subcommand failed




*Build Failed #3:
OS: CENTOS82-64
Target: x86_64-native-linuxapp-icc
FAILED: drivers/libtmp_rte_net_i40e.a.p/net_i40e_i40e_fdir.c.o 
icc -Idrivers/libtmp_rte_net_i40e.a.p -Idrivers -I../drivers -Idrivers/net/i40e -I../drivers/net/i40e -Idrivers/net/i40e/base -I../drivers/net/i40e/base -Ilib/librte_ethdev -I../lib/librte_ethdev -I. -I.. -Iconfig -I../config -Ilib/librte_eal/include -I../lib/librte_eal/include -Ilib/librte_eal/linux/include -I../lib/librte_eal/linux/include -Ilib/librte_eal/x86/include -I../lib/librte_eal/x86/include -Ilib/librte_eal/common -I../lib/librte_eal/common -Ilib/librte_eal -I../lib/librte_eal -Ilib/librte_kvargs -I../lib/librte_kvargs -Ilib/librte_metrics -I../lib/librte_metrics -Ilib/librte_telemetry -I../lib/librte_telemetry -Ilib/librte_net -I../lib/librte_net -Ilib/librte_mbuf -I../lib/librte_mbuf -Ilib/librte_mempool -I../lib/librte_mempool -Ilib/librte_ring -I../lib/librte_ring -Ilib/librte_meter -I../lib/librte_meter -Idrivers/bus/pci -I../drivers/bus/pci -I../drivers/bus/pci/linux -Ilib/librte_pci -I../lib/librte_pci -Idrivers/bus/vdev -I../drivers/bus/vdev -Ilib/librte_hash -I../lib/librte_hash -Ilib/librte_rcu -I../lib/librte_rcu -pipe -D_FILE_OFFSET_BITS=64 -Wall -w3 -diag-disable:remark -Werror -O3 -include rte_config.h -Wextra -Wcast-qual -Wdeprecated -Wformat-security -Wmissing-declarations -Wmissing-prototypes -Wold-style-definition -Wpointer-arith -Wsign-compare -Wstrict-prototypes -Wundef -Wwrite-strings -Wno-missing-field-initializers -diag-disable=188 -diag-disable=2203 -diag-disable=2279 -diag-disable=2557 -diag-disable=3179 -diag-disable=3656 -D_GNU_SOURCE -fPIC -march=native -mno-avx512f -DALLOW_EXPERIMENTAL_API -DALLOW_INTERNAL_API -DPF_DRIVER -DVF_DRIVER -DINTEGRATED_VF -DX722_A0_SUPPORT -DCC_AVX2_SUPPORT -MD -MQ drivers/libtmp_rte_net_i40e.a.p/net_i40e_i40e_fdir.c.o -MF drivers/libtmp_rte_net_i40e.a.p/net_i40e_i40e_fdir.c.o.d -o drivers/libtmp_rte_net_i40e.a.p/net_i40e_i40e_fdir.c.o -c ../drivers/net/i40e/i40e_fdir.c
../drivers/net/i40e/i40e_fdir.c(1593): error: function "i40e_flow_store_flex_pit" has already been defined
  i40e_flow_store_flex_pit(struct i40e_pf *pf,
  ^

../drivers/net/i40e/i40e_fdir.c(1626): error: function "i40e_flow_set_fdir_flex_pit" has already been defined
  i40e_flow_set_fdir_flex_pit(struct i40e_pf *pf,
  ^

../drivers/net/i40e/i40e_fdir.c(1668): error: function "i40e_flow_store_flex_mask" has already been defined
  i40e_flow_store_flex_mask(struct i40e_pf *pf,
  ^

../drivers/net/i40e/i40e_fdir.c(1710): error: function "i40e_flow_set_fdir_flex_msk" has already been defined
  i40e_flow_set_fdir_flex_msk(struct i40e_pf *pf,
  ^

compilation aborted for ../drivers/net/i40e/i40e_fdir.c (code 2)
[1233/2736] Linking target drivers/librte_net_failsafe.so.21.0
[1234/2736] Compiling C object drivers/libtmp_rte_net_i40e.a.p/net_i40e_i40e_ethdev_vf.c.o
[1235/2736] Compiling C object drivers/libtmp_rte_net_i40e.a.p/net_i40e_i40e_tm.c.o
[1236/2736] Compiling C object drivers/libtmp_rte_net_fm10k.a.p/net_fm10k_fm10k_ethdev.c.o
[1237/2736] Compiling C object drivers/libtmp_rte_net_i40e.a.p/net_i40e_i40e_flow.c.o
[1238/2736] Compiling C object drivers/libtmp_rte_net_i40e.a.p/net_i40e_rte_pmd_i40e.c.o
[1239/2736] Compiling C object drivers/libtmp_rte_net_i40e.a.p/net_i40e_i40e_rxtx.c.o
[1240/2736] Compiling C object drivers/libtmp_rte_crypto_octeontx.a.p/crypto_octeontx_otx_cryptodev_ops.c.o
[1241/2736] Compiling C object drivers/libtmp_rte_net_i40e.a.p/net_i40e_i40e_ethdev.c.o
ninja: build stopped: subcommand failed




*Build Failed #4:
OS: CENTOS82-64
Target: x86_64-native-linuxapp-gcc+shared
FAILED: drivers/libtmp_rte_net_i40e.a.p/net_i40e_i40e_fdir.c.o 
gcc -Idrivers/libtmp_rte_net_i40e.a.p -Idrivers -I../drivers -Idrivers/net/i40e -I../drivers/net/i40e -Idrivers/net/i40e/base -I../drivers/net/i40e/base -Ilib/librte_ethdev -I../lib/librte_ethdev -I. -I.. -Iconfig -I../config -Ilib/librte_eal/include -I../lib/librte_eal/include -Ilib/librte_eal/linux/include -I../lib/librte_eal/linux/include -Ilib/librte_eal/x86/include -I../lib/librte_eal/x86/include -Ilib/librte_eal/common -I../lib/librte_eal/common -Ilib/librte_eal -I../lib/librte_eal -Ilib/librte_kvargs -I../lib/librte_kvargs -Ilib/librte_metrics -I../lib/librte_metrics -Ilib/librte_telemetry -I../lib/librte_telemetry -Ilib/librte_net -I../lib/librte_net -Ilib/librte_mbuf -I../lib/librte_mbuf -Ilib/librte_mempool -I../lib/librte_mempool -Ilib/librte_ring -I../lib/librte_ring -Ilib/librte_meter -I../lib/librte_meter -Idrivers/bus/pci -I../drivers/bus/pci -I../drivers/bus/pci/linux -Ilib/librte_pci -I../lib/librte_pci -Idrivers/bus/vdev -I../drivers/bus/vdev -Ilib/librte_hash -I../lib/librte_hash -Ilib/librte_rcu -I../lib/librte_rcu -fdiagnostics-color=always -pipe -D_FILE_OFFSET_BITS=64 -Wall -Winvalid-pch -Werror -O3 -include rte_config.h -Wextra -Wcast-qual -Wdeprecated -Wformat-nonliteral -Wformat-security -Wmissing-declarations -Wmissing-prototypes -Wnested-externs -Wold-style-definition -Wpointer-arith -Wsign-compare -Wstrict-prototypes -Wundef -Wwrite-strings -Wno-packed-not-aligned -Wno-missing-field-initializers -D_GNU_SOURCE -fPIC -march=native -mno-avx512f -DALLOW_EXPERIMENTAL_API -DALLOW_INTERNAL_API -Wno-format-truncation -DPF_DRIVER -DVF_DRIVER -DINTEGRATED_VF -DX722_A0_SUPPORT -DCC_AVX2_SUPPORT -MD -MQ drivers/libtmp_rte_net_i40e.a.p/net_i40e_i40e_fdir.c.o -MF drivers/libtmp_rte_net_i40e.a.p/net_i40e_i40e_fdir.c.o.d -o drivers/libtmp_rte_net_i40e.a.p/net_i40e_i40e_fdir.c.o -c ../drivers/net/i40e/i40e_fdir.c
../drivers/net/i40e/i40e_fdir.c:1593:1: error: redefinition of ‘i40e_flow_store_flex_pit’
 i40e_flow_store_flex_pit(struct i40e_pf *pf,
 ^~~~~~~~~~~~~~~~~~~~~~~~
../drivers/net/i40e/i40e_fdir.c:1446:1: note: previous definition of ‘i40e_flow_store_flex_pit’ was here
 i40e_flow_store_flex_pit(struct i40e_pf *pf,
 ^~~~~~~~~~~~~~~~~~~~~~~~
../drivers/net/i40e/i40e_fdir.c:1626:1: error: redefinition of ‘i40e_flow_set_fdir_flex_pit’
 i40e_flow_set_fdir_flex_pit(struct i40e_pf *pf,
 ^~~~~~~~~~~~~~~~~~~~~~~~~~~
../drivers/net/i40e/i40e_fdir.c:1479:1: note: previous definition of ‘i40e_flow_set_fdir_flex_pit’ was here
 i40e_flow_set_fdir_flex_pit(struct i40e_pf *pf,
 ^~~~~~~~~~~~~~~~~~~~~~~~~~~
../drivers/net/i40e/i40e_fdir.c:1668:1: error: redefinition of ‘i40e_flow_store_flex_mask’
 i40e_flow_store_flex_mask(struct i40e_pf *pf,
 ^~~~~~~~~~~~~~~~~~~~~~~~~
../drivers/net/i40e/i40e_fdir.c:1521:1: note: previous definition of ‘i40e_flow_store_flex_mask’ was here
 i40e_flow_store_flex_mask(struct i40e_pf *pf,
 ^~~~~~~~~~~~~~~~~~~~~~~~~
../drivers/net/i40e/i40e_fdir.c:1710:1: error: redefinition of ‘i40e_flow_set_fdir_flex_msk’
 i40e_flow_set_fdir_flex_msk(struct i40e_pf *pf,
 ^~~~~~~~~~~~~~~~~~~~~~~~~~~
../drivers/net/i40e/i40e_fdir.c:1563:1: note: previous definition of ‘i40e_flow_set_fdir_flex_msk’ was here
 i40e_flow_set_fdir_flex_msk(struct i40e_pf *pf,
 ^~~~~~~~~~~~~~~~~~~~~~~~~~~
../drivers/net/i40e/i40e_fdir.c:1563:1: error: ‘i40e_flow_set_fdir_flex_msk’ defined but not used [-Werror=unused-function]
../drivers/net/i40e/i40e_fdir.c:1521:1: error: ‘i40e_flow_store_flex_mask’ defined but not used [-Werror=unused-function]
 i40e_flow_store_flex_mask(struct i40e_pf *pf,
 ^~~~~~~~~~~~~~~~~~~~~~~~~
../drivers/net/i40e/i40e_fdir.c:1479:1: error: ‘i40e_flow_set_fdir_flex_pit’ defined but not used [-Werror=unused-function]
 i40e_flow_set_fdir_flex_pit(struct i40e_pf *pf,
 ^~~~~~~~~~~~~~~~~~~~~~~~~~~
../drivers/net/i40e/i40e_fdir.c:1446:1: error: ‘i40e_flow_store_flex_pit’ defined but not used [-Werror=unused-function]
 i40e_flow_store_flex_pit(struct i40e_pf *pf,
 ^~~~~~~~~~~~~~~~~~~~~~~~
cc1: all warnings being treated as errors
[1266/2570] Generating rte_net_enic.sym_chk with a meson_exe.py custom command
[1267/2570] Compiling C object drivers/libtmp_rte_net_i40e.a.p/net_i40e_i40e_pf.c.o
[1268/2570] Compiling C object drivers/libtmp_rte_net_i40e.a.p/net_i40e_i40e_rxtx.c.o
[1269/2570] Compiling C object drivers/libtmp_rte_net_i40e.a.p/net_i40e_i40e_flow.c.o
[1270/2570] Compiling C object drivers/libtmp_rte_net_i40e.a.p/net_i40e_i40e_ethdev.c.o
ninja: build stopped: subcommand failed




*Build Failed #5:
OS: CENTOS82-64
Target: x86_64-native-linuxapp-gcc+debug
FAILED: drivers/libtmp_rte_net_i40e.a.p/net_i40e_i40e_fdir.c.o 
gcc -Idrivers/libtmp_rte_net_i40e.a.p -Idrivers -I../drivers -Idrivers/net/i40e -I../drivers/net/i40e -Idrivers/net/i40e/base -I../drivers/net/i40e/base -Ilib/librte_ethdev -I../lib/librte_ethdev -I. -I.. -Iconfig -I../config -Ilib/librte_eal/include -I../lib/librte_eal/include -Ilib/librte_eal/linux/include -I../lib/librte_eal/linux/include -Ilib/librte_eal/x86/include -I../lib/librte_eal/x86/include -Ilib/librte_eal/common -I../lib/librte_eal/common -Ilib/librte_eal -I../lib/librte_eal -Ilib/librte_kvargs -I../lib/librte_kvargs -Ilib/librte_metrics -I../lib/librte_metrics -Ilib/librte_telemetry -I../lib/librte_telemetry -Ilib/librte_net -I../lib/librte_net -Ilib/librte_mbuf -I../lib/librte_mbuf -Ilib/librte_mempool -I../lib/librte_mempool -Ilib/librte_ring -I../lib/librte_ring -Ilib/librte_meter -I../lib/librte_meter -Idrivers/bus/pci -I../drivers/bus/pci -I../drivers/bus/pci/linux -Ilib/librte_pci -I../lib/librte_pci -Idrivers/bus/vdev -I../drivers/bus/vdev -Ilib/librte_hash -I../lib/librte_hash -Ilib/librte_rcu -I../lib/librte_rcu -fdiagnostics-color=always -pipe -D_FILE_OFFSET_BITS=64 -Wall -Winvalid-pch -Werror -O2 -g -include rte_config.h -Wextra -Wcast-qual -Wdeprecated -Wformat-nonliteral -Wformat-security -Wmissing-declarations -Wmissing-prototypes -Wnested-externs -Wold-style-definition -Wpointer-arith -Wsign-compare -Wstrict-prototypes -Wundef -Wwrite-strings -Wno-packed-not-aligned -Wno-missing-field-initializers -D_GNU_SOURCE -fPIC -march=native -mno-avx512f -DALLOW_EXPERIMENTAL_API -DALLOW_INTERNAL_API -Wno-format-truncation -DPF_DRIVER -DVF_DRIVER -DINTEGRATED_VF -DX722_A0_SUPPORT -DCC_AVX2_SUPPORT -MD -MQ drivers/libtmp_rte_net_i40e.a.p/net_i40e_i40e_fdir.c.o -MF drivers/libtmp_rte_net_i40e.a.p/net_i40e_i40e_fdir.c.o.d -o drivers/libtmp_rte_net_i40e.a.p/net_i40e_i40e_fdir.c.o -c ../drivers/net/i40e/i40e_fdir.c
../drivers/net/i40e/i40e_fdir.c:1593:1: error: redefinition of ‘i40e_flow_store_flex_pit’
 i40e_flow_store_flex_pit(struct i40e_pf *pf,
 ^~~~~~~~~~~~~~~~~~~~~~~~
../drivers/net/i40e/i40e_fdir.c:1446:1: note: previous definition of ‘i40e_flow_store_flex_pit’ was here
 i40e_flow_store_flex_pit(struct i40e_pf *pf,
 ^~~~~~~~~~~~~~~~~~~~~~~~
../drivers/net/i40e/i40e_fdir.c:1626:1: error: redefinition of ‘i40e_flow_set_fdir_flex_pit’
 i40e_flow_set_fdir_flex_pit(struct i40e_pf *pf,
 ^~~~~~~~~~~~~~~~~~~~~~~~~~~
../drivers/net/i40e/i40e_fdir.c:1479:1: note: previous definition of ‘i40e_flow_set_fdir_flex_pit’ was here
 i40e_flow_set_fdir_flex_pit(struct i40e_pf *pf,
 ^~~~~~~~~~~~~~~~~~~~~~~~~~~
../drivers/net/i40e/i40e_fdir.c:1668:1: error: redefinition of ‘i40e_flow_store_flex_mask’
 i40e_flow_store_flex_mask(struct i40e_pf *pf,
 ^~~~~~~~~~~~~~~~~~~~~~~~~
../drivers/net/i40e/i40e_fdir.c:1521:1: note: previous definition of ‘i40e_flow_store_flex_mask’ was here
 i40e_flow_store_flex_mask(struct i40e_pf *pf,
 ^~~~~~~~~~~~~~~~~~~~~~~~~
../drivers/net/i40e/i40e_fdir.c:1710:1: error: redefinition of ‘i40e_flow_set_fdir_flex_msk’
 i40e_flow_set_fdir_flex_msk(struct i40e_pf *pf,
 ^~~~~~~~~~~~~~~~~~~~~~~~~~~
../drivers/net/i40e/i40e_fdir.c:1563:1: note: previous definition of ‘i40e_flow_set_fdir_flex_msk’ was here
 i40e_flow_set_fdir_flex_msk(struct i40e_pf *pf,
 ^~~~~~~~~~~~~~~~~~~~~~~~~~~
../drivers/net/i40e/i40e_fdir.c:1563:1: error: ‘i40e_flow_set_fdir_flex_msk’ defined but not used [-Werror=unused-function]
../drivers/net/i40e/i40e_fdir.c:1521:1: error: ‘i40e_flow_store_flex_mask’ defined but not used [-Werror=unused-function]
 i40e_flow_store_flex_mask(struct i40e_pf *pf,
 ^~~~~~~~~~~~~~~~~~~~~~~~~
../drivers/net/i40e/i40e_fdir.c:1479:1: error: ‘i40e_flow_set_fdir_flex_pit’ defined but not used [-Werror=unused-function]
 i40e_flow_set_fdir_flex_pit(struct i40e_pf *pf,
 ^~~~~~~~~~~~~~~~~~~~~~~~~~~
../drivers/net/i40e/i40e_fdir.c:1446:1: error: ‘i40e_flow_store_flex_pit’ defined but not used [-Werror=unused-function]
 i40e_flow_store_flex_pit(struct i40e_pf *pf,
 ^~~~~~~~~~~~~~~~~~~~~~~~
cc1: all warnings being treated as errors
[1247/2736] Compiling C object drivers/libtmp_rte_net_i40e.a.p/net_i40e_i40e_pf.c.o
[1248/2736] Generating rte_net_failsafe.sym_chk with a meson_exe.py custom command
[1249/2736] Compiling C object drivers/libtmp_rte_net_i40e.a.p/net_i40e_i40e_ethdev_vf.c.o
[1250/2736] Compiling C object drivers/libtmp_rte_net_i40e.a.p/net_i40e_i40e_rxtx.c.o
[1251/2736] Compiling C object drivers/libtmp_rte_net_i40e.a.p/net_i40e_i40e_ethdev.c.o
ninja: build stopped: subcommand failed




*Build Failed #6:
OS: FC33-64
Target: x86_64-native-linuxapp-gcc
FAILED: drivers/libtmp_rte_net_i40e.a.p/net_i40e_i40e_fdir.c.o 
gcc -Idrivers/libtmp_rte_net_i40e.a.p -Idrivers -I../drivers -Idrivers/net/i40e -I../drivers/net/i40e -Idrivers/net/i40e/base -I../drivers/net/i40e/base -Ilib/librte_ethdev -I../lib/librte_ethdev -I. -I.. -Iconfig -I../config -Ilib/librte_eal/include -I../lib/librte_eal/include -Ilib/librte_eal/linux/include -I../lib/librte_eal/linux/include -Ilib/librte_eal/x86/include -I../lib/librte_eal/x86/include -Ilib/librte_eal/common -I../lib/librte_eal/common -Ilib/librte_eal -I../lib/librte_eal -Ilib/librte_kvargs -I../lib/librte_kvargs -Ilib/librte_metrics -I../lib/librte_metrics -Ilib/librte_telemetry -I../lib/librte_telemetry -Ilib/librte_net -I../lib/librte_net -Ilib/librte_mbuf -I../lib/librte_mbuf -Ilib/librte_mempool -I../lib/librte_mempool -Ilib/librte_ring -I../lib/librte_ring -Ilib/librte_meter -I../lib/librte_meter -Idrivers/bus/pci -I../drivers/bus/pci -I../drivers/bus/pci/linux -Ilib/librte_pci -I../lib/librte_pci -Idrivers/bus/vdev -I../drivers/bus/vdev -Ilib/librte_hash -I../lib/librte_hash -Ilib/librte_rcu -I../lib/librte_rcu -fdiagnostics-color=always -pipe -D_FILE_OFFSET_BITS=64 -Wall -Winvalid-pch -Werror -O3 -include rte_config.h -Wextra -Wcast-qual -Wdeprecated -Wformat-nonliteral -Wformat-security -Wmissing-declarations -Wmissing-prototypes -Wnested-externs -Wold-style-definition -Wpointer-arith -Wsign-compare -Wstrict-prototypes -Wundef -Wwrite-strings -Wno-address-of-packed-member -Wno-packed-not-aligned -Wno-missing-field-initializers -Wno-zero-length-bounds -D_GNU_SOURCE -fPIC -march=native -DALLOW_EXPERIMENTAL_API -DALLOW_INTERNAL_API -Wno-format-truncation -DPF_DRIVER -DVF_DRIVER -DINTEGRATED_VF -DX722_A0_SUPPORT -DCC_AVX2_SUPPORT -MD -MQ drivers/libtmp_rte_net_i40e.a.p/net_i40e_i40e_fdir.c.o -MF drivers/libtmp_rte_net_i40e.a.p/net_i40e_i40e_fdir.c.o.d -o drivers/libtmp_rte_net_i40e.a.p/net_i40e_i40e_fdir.c.o -c ../drivers/net/i40e/i40e_fdir.c
../drivers/net/i40e/i40e_fdir.c:1593:1: error: redefinition of ‘i40e_flow_store_flex_pit’
 1593 | i40e_flow_store_flex_pit(struct i40e_pf *pf,
      | ^~~~~~~~~~~~~~~~~~~~~~~~
../drivers/net/i40e/i40e_fdir.c:1446:1: note: previous definition of ‘i40e_flow_store_flex_pit’ was here
 1446 | i40e_flow_store_flex_pit(struct i40e_pf *pf,
      | ^~~~~~~~~~~~~~~~~~~~~~~~
../drivers/net/i40e/i40e_fdir.c:1626:1: error: redefinition of ‘i40e_flow_set_fdir_flex_pit’
 1626 | i40e_flow_set_fdir_flex_pit(struct i40e_pf *pf,
      | ^~~~~~~~~~~~~~~~~~~~~~~~~~~
../drivers/net/i40e/i40e_fdir.c:1479:1: note: previous definition of ‘i40e_flow_set_fdir_flex_pit’ was here
 1479 | i40e_flow_set_fdir_flex_pit(struct i40e_pf *pf,
      | ^~~~~~~~~~~~~~~~~~~~~~~~~~~
../drivers/net/i40e/i40e_fdir.c:1668:1: error: redefinition of ‘i40e_flow_store_flex_mask’
 1668 | i40e_flow_store_flex_mask(struct i40e_pf *pf,
      | ^~~~~~~~~~~~~~~~~~~~~~~~~
../drivers/net/i40e/i40e_fdir.c:1521:1: note: previous definition of ‘i40e_flow_store_flex_mask’ was here
 1521 | i40e_flow_store_flex_mask(struct i40e_pf *pf,
      | ^~~~~~~~~~~~~~~~~~~~~~~~~
../drivers/net/i40e/i40e_fdir.c:1710:1: error: redefinition of ‘i40e_flow_set_fdir_flex_msk’
 1710 | i40e_flow_set_fdir_flex_msk(struct i40e_pf *pf,
      | ^~~~~~~~~~~~~~~~~~~~~~~~~~~
../drivers/net/i40e/i40e_fdir.c:1563:1: note: previous definition of ‘i40e_flow_set_fdir_flex_msk’ was here
 1563 | i40e_flow_set_fdir_flex_msk(struct i40e_pf *pf,
      | ^~~~~~~~~~~~~~~~~~~~~~~~~~~
../drivers/net/i40e/i40e_fdir.c:1563:1: error: ‘i40e_flow_set_fdir_flex_msk’ defined but not used [-Werror=unused-function]
../drivers/net/i40e/i40e_fdir.c:1521:1: error: ‘i40e_flow_store_flex_mask’ defined but not used [-Werror=unused-function]
 1521 | i40e_flow_store_flex_mask(struct i40e_pf *pf,
      | ^~~~~~~~~~~~~~~~~~~~~~~~~
../drivers/net/i40e/i40e_fdir.c:1479:1: error: ‘i40e_flow_set_fdir_flex_pit’ defined but not used [-Werror=unused-function]
 1479 | i40e_flow_set_fdir_flex_pit(struct i40e_pf *pf,
      | ^~~~~~~~~~~~~~~~~~~~~~~~~~~
../drivers/net/i40e/i40e_fdir.c:1446:1: error: ‘i40e_flow_store_flex_pit’ defined but not used [-Werror=unused-function]
 1446 | i40e_flow_store_flex_pit(struct i40e_pf *pf,
      | ^~~~~~~~~~~~~~~~~~~~~~~~
cc1: all warnings being treated as errors
[1240/2795] Generating rte_net_fm10k.pmd.c with a custom command
[1241/2795] Compiling C object drivers/net/i40e/base/libi40e_base.a.p/i40e_nvm.c.o
[1242/2795] Generating rte_net_failsafe.sym_chk with a meson_exe.py custom command
[1243/2795] Compiling C object drivers/libtmp_rte_net_i40e.a.p/net_i40e_i40e_tm.c.o
[1244/2795] Compiling C object drivers/libtmp_rte_net_i40e.a.p/net_i40e_i40e_pf.c.o
[1245/2795] Compiling C object drivers/libtmp_rte_net_i40e.a.p/net_i40e_i40e_ethdev_vf.c.o
[1246/2795] Compiling C object drivers/net/i40e/base/libi40e_base.a.p/i40e_common.c.o
[1247/2795] Compiling C object drivers/libtmp_rte_net_i40e.a.p/net_i40e_i40e_flow.c.o
[1248/2795] Compiling C object drivers/libtmp_rte_net_i40e.a.p/net_i40e_rte_pmd_i40e.c.o
[1249/2795] Compiling C object drivers/libtmp_rte_net_i40e.a.p/net_i40e_i40e_rxtx.c.o
[1250/2795] Compiling C object drivers/libtmp_rte_net_i40e.a.p/net_i40e_i40e_ethdev.c.o
ninja: build stopped: subcommand failed




*Build Failed #7:
OS: FC33-64
Target: x86_64-native-linuxapp-clang
FAILED: drivers/libtmp_rte_net_i40e.a.p/net_i40e_i40e_fdir.c.o 
clang -Idrivers/libtmp_rte_net_i40e.a.p -Idrivers -I../drivers -Idrivers/net/i40e -I../drivers/net/i40e -Idrivers/net/i40e/base -I../drivers/net/i40e/base -Ilib/librte_ethdev -I../lib/librte_ethdev -I. -I.. -Iconfig -I../config -Ilib/librte_eal/include -I../lib/librte_eal/include -Ilib/librte_eal/linux/include -I../lib/librte_eal/linux/include -Ilib/librte_eal/x86/include -I../lib/librte_eal/x86/include -Ilib/librte_eal/common -I../lib/librte_eal/common -Ilib/librte_eal -I../lib/librte_eal -Ilib/librte_kvargs -I../lib/librte_kvargs -Ilib/librte_metrics -I../lib/librte_metrics -Ilib/librte_telemetry -I../lib/librte_telemetry -Ilib/librte_net -I../lib/librte_net -Ilib/librte_mbuf -I../lib/librte_mbuf -Ilib/librte_mempool -I../lib/librte_mempool -Ilib/librte_ring -I../lib/librte_ring -Ilib/librte_meter -I../lib/librte_meter -Idrivers/bus/pci -I../drivers/bus/pci -I../drivers/bus/pci/linux -Ilib/librte_pci -I../lib/librte_pci -Idrivers/bus/vdev -I../drivers/bus/vdev -Ilib/librte_hash -I../lib/librte_hash -Ilib/librte_rcu -I../lib/librte_rcu -Xclang -fcolor-diagnostics -pipe -D_FILE_OFFSET_BITS=64 -Wall -Winvalid-pch -Werror -O3 -include rte_config.h -Wextra -Wcast-qual -Wdeprecated -Wformat-nonliteral -Wformat-security -Wmissing-declarations -Wmissing-prototypes -Wnested-externs -Wold-style-definition -Wpointer-arith -Wsign-compare -Wstrict-prototypes -Wundef -Wwrite-strings -Wno-address-of-packed-member -Wno-missing-field-initializers -D_GNU_SOURCE -fPIC -march=native -DALLOW_EXPERIMENTAL_API -DALLOW_INTERNAL_API -DPF_DRIVER -DVF_DRIVER -DINTEGRATED_VF -DX722_A0_SUPPORT -DCC_AVX2_SUPPORT -MD -MQ drivers/libtmp_rte_net_i40e.a.p/net_i40e_i40e_fdir.c.o -MF drivers/libtmp_rte_net_i40e.a.p/net_i40e_i40e_fdir.c.o.d -o drivers/libtmp_rte_net_i40e.a.p/net_i40e_i40e_fdir.c.o -c ../drivers/net/i40e/i40e_fdir.c
../drivers/net/i40e/i40e_fdir.c:1593:1: error: redefinition of 'i40e_flow_store_flex_pit'
i40e_flow_store_flex_pit(struct i40e_pf *pf,
^
../drivers/net/i40e/i40e_fdir.c:1446:1: note: previous definition is here
i40e_flow_store_flex_pit(struct i40e_pf *pf,
^
../drivers/net/i40e/i40e_fdir.c:1626:1: error: redefinition of 'i40e_flow_set_fdir_flex_pit'
i40e_flow_set_fdir_flex_pit(struct i40e_pf *pf,
^
../drivers/net/i40e/i40e_fdir.c:1479:1: note: previous definition is here
i40e_flow_set_fdir_flex_pit(struct i40e_pf *pf,
^
../drivers/net/i40e/i40e_fdir.c:1668:1: error: redefinition of 'i40e_flow_store_flex_mask'
i40e_flow_store_flex_mask(struct i40e_pf *pf,
^
../drivers/net/i40e/i40e_fdir.c:1521:1: note: previous definition is here
i40e_flow_store_flex_mask(struct i40e_pf *pf,
^
../drivers/net/i40e/i40e_fdir.c:1710:1: error: redefinition of 'i40e_flow_set_fdir_flex_msk'
i40e_flow_set_fdir_flex_msk(struct i40e_pf *pf,
^
../drivers/net/i40e/i40e_fdir.c:1563:1: note: previous definition is here
i40e_flow_set_fdir_flex_msk(struct i40e_pf *pf,
^
4 errors generated.
[1254/2795] Compiling C object drivers/libtmp_rte_net_i40e.a.p/net_i40e_i40e_ethdev_vf.c.o
[1255/2795] Compiling C object drivers/libtmp_rte_net_i40e.a.p/net_i40e_i40e_pf.c.o
[1256/2795] Compiling C object drivers/libtmp_rte_net_i40e.a.p/net_i40e_i40e_vf_representor.c.o
[1257/2795] Compiling C object drivers/libtmp_rte_net_i40e.a.p/net_i40e_i40e_tm.c.o
[1258/2795] Compiling C object drivers/libtmp_rte_net_i40e.a.p/net_i40e_i40e_rxtx.c.o
[1259/2795] Compiling C object drivers/libtmp_rte_net_i40e.a.p/net_i40e_i40e_flow.c.o
[1260/2795] Compiling C object drivers/libtmp_rte_net_i40e.a.p/net_i40e_i40e_rxtx_vec_sse.c.o
[1261/2795] Compiling C object drivers/libtmp_rte_net_i40e.a.p/net_i40e_rte_pmd_i40e.c.o
[1262/2795] Compiling C object drivers/libtmp_rte_net_i40e.a.p/net_i40e_i40e_ethdev.c.o
ninja: build stopped: subcommand failed




*Build Failed #8:
OS: FreeBSD1201-64
Target: x86_64-native-bsdapp-gcc
FAILED: drivers/libtmp_rte_net_i40e.a.p/net_i40e_i40e_fdir.c.o 
gcc -Idrivers/libtmp_rte_net_i40e.a.p -Idrivers -I../drivers -Idrivers/net/i40e -I../drivers/net/i40e -Idrivers/net/i40e/base -I../drivers/net/i40e/base -Ilib/librte_ethdev -I../lib/librte_ethdev -I. -I.. -Iconfig -I../config -Ilib/librte_eal/include -I../lib/librte_eal/include -Ilib/librte_eal/freebsd/include -I../lib/librte_eal/freebsd/include -Ilib/librte_eal/x86/include -I../lib/librte_eal/x86/include -Ilib/librte_eal/common -I../lib/librte_eal/common -Ilib/librte_eal -I../lib/librte_eal -Ilib/librte_kvargs -I../lib/librte_kvargs -Ilib/librte_metrics -I../lib/librte_metrics -Ilib/librte_telemetry -I../lib/librte_telemetry -Ilib/librte_net -I../lib/librte_net -Ilib/librte_mbuf -I../lib/librte_mbuf -Ilib/librte_mempool -I../lib/librte_mempool -Ilib/librte_ring -I../lib/librte_ring -Ilib/librte_meter -I../lib/librte_meter -Idrivers/bus/pci -I../drivers/bus/pci -I../drivers/bus/pci/bsd -Ilib/librte_pci -I../lib/librte_pci -Idrivers/bus/vdev -I../drivers/bus/vdev -Ilib/librte_hash -I../lib/librte_hash -Ilib/librte_rcu -I../lib/librte_rcu -fdiagnostics-color=always -pipe -D_FILE_OFFSET_BITS=64 -Wall -Winvalid-pch -Werror -O3 -include rte_config.h -Wextra -Wcast-qual -Wdeprecated -Wformat-nonliteral -Wformat-security -Wmissing-declarations -Wmissing-prototypes -Wnested-externs -Wold-style-definition -Wpointer-arith -Wsign-compare -Wstrict-prototypes -Wundef -Wwrite-strings -Wno-address-of-packed-member -Wno-packed-not-aligned -Wno-missing-field-initializers -D_GNU_SOURCE -D__BSD_VISIBLE -fPIC -march=native -mno-avx512f -DALLOW_EXPERIMENTAL_API -DALLOW_INTERNAL_API -Wno-format-truncation -DPF_DRIVER -DVF_DRIVER -DINTEGRATED_VF -DX722_A0_SUPPORT -DCC_AVX2_SUPPORT -MD -MQ drivers/libtmp_rte_net_i40e.a.p/net_i40e_i40e_fdir.c.o -MF drivers/libtmp_rte_net_i40e.a.p/net_i40e_i40e_fdir.c.o.d -o drivers/libtmp_rte_net_i40e.a.p/net_i40e_i40e_fdir.c.o -c ../drivers/net/i40e/i40e_fdir.c
../drivers/net/i40e/i40e_fdir.c:1593:1: error: redefinition of 'i40e_flow_store_flex_pit'
 1593 | i40e_flow_store_flex_pit(struct i40e_pf *pf,
      | ^~~~~~~~~~~~~~~~~~~~~~~~
../drivers/net/i40e/i40e_fdir.c:1446:1: note: previous definition of 'i40e_flow_store_flex_pit' was here
 1446 | i40e_flow_store_flex_pit(struct i40e_pf *pf,
      | ^~~~~~~~~~~~~~~~~~~~~~~~
../drivers/net/i40e/i40e_fdir.c:1626:1: error: redefinition of 'i40e_flow_set_fdir_flex_pit'
 1626 | i40e_flow_set_fdir_flex_pit(struct i40e_pf *pf,
      | ^~~~~~~~~~~~~~~~~~~~~~~~~~~
../drivers/net/i40e/i40e_fdir.c:1479:1: note: previous definition of 'i40e_flow_set_fdir_flex_pit' was here
 1479 | i40e_flow_set_fdir_flex_pit(struct i40e_pf *pf,
      | ^~~~~~~~~~~~~~~~~~~~~~~~~~~
../drivers/net/i40e/i40e_fdir.c:1668:1: error: redefinition of 'i40e_flow_store_flex_mask'
 1668 | i40e_flow_store_flex_mask(struct i40e_pf *pf,
      | ^~~~~~~~~~~~~~~~~~~~~~~~~
../drivers/net/i40e/i40e_fdir.c:1521:1: note: previous definition of 'i40e_flow_store_flex_mask' was here
 1521 | i40e_flow_store_flex_mask(struct i40e_pf *pf,
      | ^~~~~~~~~~~~~~~~~~~~~~~~~
../drivers/net/i40e/i40e_fdir.c:1710:1: error: redefinition of 'i40e_flow_set_fdir_flex_msk'
 1710 | i40e_flow_set_fdir_flex_msk(struct i40e_pf *pf,
      | ^~~~~~~~~~~~~~~~~~~~~~~~~~~
../drivers/net/i40e/i40e_fdir.c:1563:1: note: previous definition of 'i40e_flow_set_fdir_flex_msk' was here
 1563 | i40e_flow_set_fdir_flex_msk(struct i40e_pf *pf,
      | ^~~~~~~~~~~~~~~~~~~~~~~~~~~
../drivers/net/i40e/i40e_fdir.c:1563:1: error: 'i40e_flow_set_fdir_flex_msk' defined but not used [-Werror=unused-function]
../drivers/net/i40e/i40e_fdir.c:1521:1: error: 'i40e_flow_store_flex_mask' defined but not used [-Werror=unused-function]
 1521 | i40e_flow_store_flex_mask(struct i40e_pf *pf,
      | ^~~~~~~~~~~~~~~~~~~~~~~~~
../drivers/net/i40e/i40e_fdir.c:1479:1: error: 'i40e_flow_set_fdir_flex_pit' defined but not used [-Werror=unused-function]
 1479 | i40e_flow_set_fdir_flex_pit(struct i40e_pf *pf,
      | ^~~~~~~~~~~~~~~~~~~~~~~~~~~
../drivers/net/i40e/i40e_fdir.c:1446:1: error: 'i40e_flow_store_flex_pit' defined but not used [-Werror=unused-function]
 1446 | i40e_flow_store_flex_pit(struct i40e_pf *pf,
      | ^~~~~~~~~~~~~~~~~~~~~~~~
cc1: all warnings being treated as errors
[999/2010] Compiling C object drivers/libtmp_rte_net_i40e.a.p/net_i40e_i40e_pf.c.o
[1000/2010] Compiling C object drivers/libtmp_rte_net_i40e.a.p/net_i40e_i40e_ethdev_vf.c.o
[1001/2010] Compiling C object drivers/libtmp_rte_net_i40e.a.p/net_i40e_i40e_rxtx.c.o
[1002/2010] Compiling C object drivers/libtmp_rte_net_i40e.a.p/net_i40e_i40e_flow.c.o
[1003/2010] Compiling C object drivers/libtmp_rte_net_i40e.a.p/net_i40e_i40e_ethdev.c.o
ninja: build stopped: subcommand failed




*Build Failed #9:
OS: FreeBSD1201-64
Target: x86_64-native-bsdapp-clang
FAILED: drivers/libtmp_rte_net_i40e.a.p/net_i40e_i40e_fdir.c.o 
clang -Idrivers/libtmp_rte_net_i40e.a.p -Idrivers -I../drivers -Idrivers/net/i40e -I../drivers/net/i40e -Idrivers/net/i40e/base -I../drivers/net/i40e/base -Ilib/librte_ethdev -I../lib/librte_ethdev -I. -I.. -Iconfig -I../config -Ilib/librte_eal/include -I../lib/librte_eal/include -Ilib/librte_eal/freebsd/include -I../lib/librte_eal/freebsd/include -Ilib/librte_eal/x86/include -I../lib/librte_eal/x86/include -Ilib/librte_eal/common -I../lib/librte_eal/common -Ilib/librte_eal -I../lib/librte_eal -Ilib/librte_kvargs -I../lib/librte_kvargs -Ilib/librte_metrics -I../lib/librte_metrics -Ilib/librte_telemetry -I../lib/librte_telemetry -Ilib/librte_net -I../lib/librte_net -Ilib/librte_mbuf -I../lib/librte_mbuf -Ilib/librte_mempool -I../lib/librte_mempool -Ilib/librte_ring -I../lib/librte_ring -Ilib/librte_meter -I../lib/librte_meter -Idrivers/bus/pci -I../drivers/bus/pci -I../drivers/bus/pci/bsd -Ilib/librte_pci -I../lib/librte_pci -Idrivers/bus/vdev -I../drivers/bus/vdev -Ilib/librte_hash -I../lib/librte_hash -Ilib/librte_rcu -I../lib/librte_rcu -Xclang -fcolor-diagnostics -pipe -D_FILE_OFFSET_BITS=64 -Wall -Winvalid-pch -Werror -O3 -include rte_config.h -Wextra -Wcast-qual -Wdeprecated -Wformat-nonliteral -Wformat-security -Wmissing-declarations -Wmissing-prototypes -Wnested-externs -Wold-style-definition -Wpointer-arith -Wsign-compare -Wstrict-prototypes -Wundef -Wwrite-strings -Wno-address-of-packed-member -Wno-missing-field-initializers -D_GNU_SOURCE -D__BSD_VISIBLE -fPIC -march=native -mno-avx512f -DALLOW_EXPERIMENTAL_API -DALLOW_INTERNAL_API -DPF_DRIVER -DVF_DRIVER -DINTEGRATED_VF -DX722_A0_SUPPORT -DCC_AVX2_SUPPORT -MD -MQ drivers/libtmp_rte_net_i40e.a.p/net_i40e_i40e_fdir.c.o -MF drivers/libtmp_rte_net_i40e.a.p/net_i40e_i40e_fdir.c.o.d -o drivers/libtmp_rte_net_i40e.a.p/net_i40e_i40e_fdir.c.o -c ../drivers/net/i40e/i40e_fdir.c
../drivers/net/i40e/i40e_fdir.c:1593:1: error: redefinition of 'i40e_flow_store_flex_pit'
i40e_flow_store_flex_pit(struct i40e_pf *pf,
^
../drivers/net/i40e/i40e_fdir.c:1446:1: note: previous definition is here
i40e_flow_store_flex_pit(struct i40e_pf *pf,
^
../drivers/net/i40e/i40e_fdir.c:1626:1: error: redefinition of 'i40e_flow_set_fdir_flex_pit'
i40e_flow_set_fdir_flex_pit(struct i40e_pf *pf,
^
../drivers/net/i40e/i40e_fdir.c:1479:1: note: previous definition is here
i40e_flow_set_fdir_flex_pit(struct i40e_pf *pf,
^
../drivers/net/i40e/i40e_fdir.c:1668:1: error: redefinition of 'i40e_flow_store_flex_mask'
i40e_flow_store_flex_mask(struct i40e_pf *pf,
^
../drivers/net/i40e/i40e_fdir.c:1521:1: note: previous definition is here
i40e_flow_store_flex_mask(struct i40e_pf *pf,
^
../drivers/net/i40e/i40e_fdir.c:1710:1: error: redefinition of 'i40e_flow_set_fdir_flex_msk'
i40e_flow_set_fdir_flex_msk(struct i40e_pf *pf,
^
../drivers/net/i40e/i40e_fdir.c:1563:1: note: previous definition is here
i40e_flow_set_fdir_flex_msk(struct i40e_pf *pf,
^
4 errors generated.
[999/2010] Compiling C object drivers/libtmp_rte_net_i40e.a.p/net_i40e_i40e_pf.c.o
[1000/2010] Compiling C object drivers/libtmp_rte_net_i40e.a.p/net_i40e_i40e_ethdev_vf.c.o
[1001/2010] Compiling C object drivers/libtmp_rte_net_i40e.a.p/net_i40e_i40e_rxtx.c.o
[1002/2010] Compiling C object drivers/libtmp_rte_net_i40e.a.p/net_i40e_i40e_flow.c.o
[1003/2010] Compiling C object drivers/libtmp_rte_net_i40e.a.p/net_i40e_i40e_ethdev.c.o
ninja: build stopped: subcommand failed




*Build Failed #10:
OS: FreeBSD1201-64
Target: x86_64-native-bsdapp-gcc+shared
FAILED: drivers/libtmp_rte_net_i40e.a.p/net_i40e_i40e_fdir.c.o 
gcc -Idrivers/libtmp_rte_net_i40e.a.p -Idrivers -I../drivers -Idrivers/net/i40e -I../drivers/net/i40e -Idrivers/net/i40e/base -I../drivers/net/i40e/base -Ilib/librte_ethdev -I../lib/librte_ethdev -I. -I.. -Iconfig -I../config -Ilib/librte_eal/include -I../lib/librte_eal/include -Ilib/librte_eal/freebsd/include -I../lib/librte_eal/freebsd/include -Ilib/librte_eal/x86/include -I../lib/librte_eal/x86/include -Ilib/librte_eal/common -I../lib/librte_eal/common -Ilib/librte_eal -I../lib/librte_eal -Ilib/librte_kvargs -I../lib/librte_kvargs -Ilib/librte_metrics -I../lib/librte_metrics -Ilib/librte_telemetry -I../lib/librte_telemetry -Ilib/librte_net -I../lib/librte_net -Ilib/librte_mbuf -I../lib/librte_mbuf -Ilib/librte_mempool -I../lib/librte_mempool -Ilib/librte_ring -I../lib/librte_ring -Ilib/librte_meter -I../lib/librte_meter -Idrivers/bus/pci -I../drivers/bus/pci -I../drivers/bus/pci/bsd -Ilib/librte_pci -I../lib/librte_pci -Idrivers/bus/vdev -I../drivers/bus/vdev -Ilib/librte_hash -I../lib/librte_hash -Ilib/librte_rcu -I../lib/librte_rcu -fdiagnostics-color=always -pipe -D_FILE_OFFSET_BITS=64 -Wall -Winvalid-pch -Werror -O3 -include rte_config.h -Wextra -Wcast-qual -Wdeprecated -Wformat-nonliteral -Wformat-security -Wmissing-declarations -Wmissing-prototypes -Wnested-externs -Wold-style-definition -Wpointer-arith -Wsign-compare -Wstrict-prototypes -Wundef -Wwrite-strings -Wno-address-of-packed-member -Wno-packed-not-aligned -Wno-missing-field-initializers -D_GNU_SOURCE -D__BSD_VISIBLE -fPIC -march=native -mno-avx512f -DALLOW_EXPERIMENTAL_API -DALLOW_INTERNAL_API -Wno-format-truncation -DPF_DRIVER -DVF_DRIVER -DINTEGRATED_VF -DX722_A0_SUPPORT -DCC_AVX2_SUPPORT -MD -MQ drivers/libtmp_rte_net_i40e.a.p/net_i40e_i40e_fdir.c.o -MF drivers/libtmp_rte_net_i40e.a.p/net_i40e_i40e_fdir.c.o.d -o drivers/libtmp_rte_net_i40e.a.p/net_i40e_i40e_fdir.c.o -c ../drivers/net/i40e/i40e_fdir.c
../drivers/net/i40e/i40e_fdir.c:1593:1: error: redefinition of 'i40e_flow_store_flex_pit'
 1593 | i40e_flow_store_flex_pit(struct i40e_pf *pf,
      | ^~~~~~~~~~~~~~~~~~~~~~~~
../drivers/net/i40e/i40e_fdir.c:1446:1: note: previous definition of 'i40e_flow_store_flex_pit' was here
 1446 | i40e_flow_store_flex_pit(struct i40e_pf *pf,
      | ^~~~~~~~~~~~~~~~~~~~~~~~
../drivers/net/i40e/i40e_fdir.c:1626:1: error: redefinition of 'i40e_flow_set_fdir_flex_pit'
 1626 | i40e_flow_set_fdir_flex_pit(struct i40e_pf *pf,
      | ^~~~~~~~~~~~~~~~~~~~~~~~~~~
../drivers/net/i40e/i40e_fdir.c:1479:1: note: previous definition of 'i40e_flow_set_fdir_flex_pit' was here
 1479 | i40e_flow_set_fdir_flex_pit(struct i40e_pf *pf,
      | ^~~~~~~~~~~~~~~~~~~~~~~~~~~
../drivers/net/i40e/i40e_fdir.c:1668:1: error: redefinition of 'i40e_flow_store_flex_mask'
 1668 | i40e_flow_store_flex_mask(struct i40e_pf *pf,
      | ^~~~~~~~~~~~~~~~~~~~~~~~~
../drivers/net/i40e/i40e_fdir.c:1521:1: note: previous definition of 'i40e_flow_store_flex_mask' was here
 1521 | i40e_flow_store_flex_mask(struct i40e_pf *pf,
      | ^~~~~~~~~~~~~~~~~~~~~~~~~
../drivers/net/i40e/i40e_fdir.c:1710:1: error: redefinition of 'i40e_flow_set_fdir_flex_msk'
 1710 | i40e_flow_set_fdir_flex_msk(struct i40e_pf *pf,
      | ^~~~~~~~~~~~~~~~~~~~~~~~~~~
../drivers/net/i40e/i40e_fdir.c:1563:1: note: previous definition of 'i40e_flow_set_fdir_flex_msk' was here
 1563 | i40e_flow_set_fdir_flex_msk(struct i40e_pf *pf,
      | ^~~~~~~~~~~~~~~~~~~~~~~~~~~
../drivers/net/i40e/i40e_fdir.c:1563:1: error: 'i40e_flow_set_fdir_flex_msk' defined but not used [-Werror=unused-function]
../drivers/net/i40e/i40e_fdir.c:1521:1: error: 'i40e_flow_store_flex_mask' defined but not used [-Werror=unused-function]
 1521 | i40e_flow_store_flex_mask(struct i40e_pf *pf,
      | ^~~~~~~~~~~~~~~~~~~~~~~~~
../drivers/net/i40e/i40e_fdir.c:1479:1: error: 'i40e_flow_set_fdir_flex_pit' defined but not used [-Werror=unused-function]
 1479 | i40e_flow_set_fdir_flex_pit(struct i40e_pf *pf,
      | ^~~~~~~~~~~~~~~~~~~~~~~~~~~
../drivers/net/i40e/i40e_fdir.c:1446:1: error: 'i40e_flow_store_flex_pit' defined but not used [-Werror=unused-function]
 1446 | i40e_flow_store_flex_pit(struct i40e_pf *pf,
      | ^~~~~~~~~~~~~~~~~~~~~~~~
cc1: all warnings being treated as errors
[1024/1892] Compiling C object drivers/libtmp_rte_net_i40e.a.p/net_i40e_i40e_rxtx.c.o
[1025/1892] Compiling C object drivers/libtmp_rte_net_i40e.a.p/net_i40e_i40e_flow.c.o
[1026/1892] Compiling C object drivers/libtmp_rte_net_i40e.a.p/net_i40e_i40e_rxtx_vec_sse.c.o
[1027/1892] Compiling C object drivers/libtmp_rte_net_i40e.a.p/net_i40e_rte_pmd_i40e.c.o
[1028/1892] Compiling C object drivers/libtmp_rte_net_i40e.a.p/net_i40e_i40e_ethdev.c.o
ninja: build stopped: subcommand failed




*Build Failed #11:
OS: FreeBSD1201-64
Target: x86_64-native-bsdapp-gcc+debug
FAILED: drivers/libtmp_rte_net_i40e.a.p/net_i40e_i40e_fdir.c.o 
gcc -Idrivers/libtmp_rte_net_i40e.a.p -Idrivers -I../drivers -Idrivers/net/i40e -I../drivers/net/i40e -Idrivers/net/i40e/base -I../drivers/net/i40e/base -Ilib/librte_ethdev -I../lib/librte_ethdev -I. -I.. -Iconfig -I../config -Ilib/librte_eal/include -I../lib/librte_eal/include -Ilib/librte_eal/freebsd/include -I../lib/librte_eal/freebsd/include -Ilib/librte_eal/x86/include -I../lib/librte_eal/x86/include -Ilib/librte_eal/common -I../lib/librte_eal/common -Ilib/librte_eal -I../lib/librte_eal -Ilib/librte_kvargs -I../lib/librte_kvargs -Ilib/librte_metrics -I../lib/librte_metrics -Ilib/librte_telemetry -I../lib/librte_telemetry -Ilib/librte_net -I../lib/librte_net -Ilib/librte_mbuf -I../lib/librte_mbuf -Ilib/librte_mempool -I../lib/librte_mempool -Ilib/librte_ring -I../lib/librte_ring -Ilib/librte_meter -I../lib/librte_meter -Idrivers/bus/pci -I../drivers/bus/pci -I../drivers/bus/pci/bsd -Ilib/librte_pci -I../lib/librte_pci -Idrivers/bus/vdev -I../drivers/bus/vdev -Ilib/librte_hash -I../lib/librte_hash -Ilib/librte_rcu -I../lib/librte_rcu -fdiagnostics-color=always -pipe -D_FILE_OFFSET_BITS=64 -Wall -Winvalid-pch -Werror -O2 -g -include rte_config.h -Wextra -Wcast-qual -Wdeprecated -Wformat-nonliteral -Wformat-security -Wmissing-declarations -Wmissing-prototypes -Wnested-externs -Wold-style-definition -Wpointer-arith -Wsign-compare -Wstrict-prototypes -Wundef -Wwrite-strings -Wno-address-of-packed-member -Wno-packed-not-aligned -Wno-missing-field-initializers -D_GNU_SOURCE -D__BSD_VISIBLE -fPIC -march=native -mno-avx512f -DALLOW_EXPERIMENTAL_API -DALLOW_INTERNAL_API -Wno-format-truncation -DPF_DRIVER -DVF_DRIVER -DINTEGRATED_VF -DX722_A0_SUPPORT -DCC_AVX2_SUPPORT -MD -MQ drivers/libtmp_rte_net_i40e.a.p/net_i40e_i40e_fdir.c.o -MF drivers/libtmp_rte_net_i40e.a.p/net_i40e_i40e_fdir.c.o.d -o drivers/libtmp_rte_net_i40e.a.p/net_i40e_i40e_fdir.c.o -c ../drivers/net/i40e/i40e_fdir.c
../drivers/net/i40e/i40e_fdir.c:1593:1: error: redefinition of 'i40e_flow_store_flex_pit'
 1593 | i40e_flow_store_flex_pit(struct i40e_pf *pf,
      | ^~~~~~~~~~~~~~~~~~~~~~~~
../drivers/net/i40e/i40e_fdir.c:1446:1: note: previous definition of 'i40e_flow_store_flex_pit' was here
 1446 | i40e_flow_store_flex_pit(struct i40e_pf *pf,
      | ^~~~~~~~~~~~~~~~~~~~~~~~
../drivers/net/i40e/i40e_fdir.c:1626:1: error: redefinition of 'i40e_flow_set_fdir_flex_pit'
 1626 | i40e_flow_set_fdir_flex_pit(struct i40e_pf *pf,
      | ^~~~~~~~~~~~~~~~~~~~~~~~~~~
../drivers/net/i40e/i40e_fdir.c:1479:1: note: previous definition of 'i40e_flow_set_fdir_flex_pit' was here
 1479 | i40e_flow_set_fdir_flex_pit(struct i40e_pf *pf,
      | ^~~~~~~~~~~~~~~~~~~~~~~~~~~
../drivers/net/i40e/i40e_fdir.c:1668:1: error: redefinition of 'i40e_flow_store_flex_mask'
 1668 | i40e_flow_store_flex_mask(struct i40e_pf *pf,
      | ^~~~~~~~~~~~~~~~~~~~~~~~~
../drivers/net/i40e/i40e_fdir.c:1521:1: note: previous definition of 'i40e_flow_store_flex_mask' was here
 1521 | i40e_flow_store_flex_mask(struct i40e_pf *pf,
      | ^~~~~~~~~~~~~~~~~~~~~~~~~
../drivers/net/i40e/i40e_fdir.c:1710:1: error: redefinition of 'i40e_flow_set_fdir_flex_msk'
 1710 | i40e_flow_set_fdir_flex_msk(struct i40e_pf *pf,
      | ^~~~~~~~~~~~~~~~~~~~~~~~~~~
../drivers/net/i40e/i40e_fdir.c:1563:1: note: previous definition of 'i40e_flow_set_fdir_flex_msk' was here
 1563 | i40e_flow_set_fdir_flex_msk(struct i40e_pf *pf,
      | ^~~~~~~~~~~~~~~~~~~~~~~~~~~
../drivers/net/i40e/i40e_fdir.c:1563:1: error: 'i40e_flow_set_fdir_flex_msk' defined but not used [-Werror=unused-function]
../drivers/net/i40e/i40e_fdir.c:1521:1: error: 'i40e_flow_store_flex_mask' defined but not used [-Werror=unused-function]
 1521 | i40e_flow_store_flex_mask(struct i40e_pf *pf,
      | ^~~~~~~~~~~~~~~~~~~~~~~~~
../drivers/net/i40e/i40e_fdir.c:1479:1: error: 'i40e_flow_set_fdir_flex_pit' defined but not used [-Werror=unused-function]
 1479 | i40e_flow_set_fdir_flex_pit(struct i40e_pf *pf,
      | ^~~~~~~~~~~~~~~~~~~~~~~~~~~
../drivers/net/i40e/i40e_fdir.c:1446:1: error: 'i40e_flow_store_flex_pit' defined but not used [-Werror=unused-function]
 1446 | i40e_flow_store_flex_pit(struct i40e_pf *pf,
      | ^~~~~~~~~~~~~~~~~~~~~~~~
cc1: all warnings being treated as errors
[997/2010] Generating rte_net_fm10k.sym_chk with a meson_exe.py custom command
[998/2010] Compiling C object drivers/libtmp_rte_net_i40e.a.p/net_i40e_i40e_ethdev_vf.c.o
[999/2010] Compiling C object drivers/libtmp_rte_net_i40e.a.p/net_i40e_i40e_pf.c.o
[1000/2010] Compiling C object drivers/libtmp_rte_net_i40e.a.p/net_i40e_i40e_rxtx.c.o
[1001/2010] Compiling C object drivers/libtmp_rte_net_i40e.a.p/net_i40e_i40e_ethdev.c.o
ninja: build stopped: subcommand failed




*Build Failed #12:
OS: RHEL82-64
Target: x86_64-native-linuxapp-gcc
FAILED: drivers/libtmp_rte_net_i40e.a.p/net_i40e_i40e_fdir.c.o 
gcc -Idrivers/libtmp_rte_net_i40e.a.p -Idrivers -I../drivers -Idrivers/net/i40e -I../drivers/net/i40e -Idrivers/net/i40e/base -I../drivers/net/i40e/base -Ilib/librte_ethdev -I../lib/librte_ethdev -I. -I.. -Iconfig -I../config -Ilib/librte_eal/include -I../lib/librte_eal/include -Ilib/librte_eal/linux/include -I../lib/librte_eal/linux/include -Ilib/librte_eal/x86/include -I../lib/librte_eal/x86/include -Ilib/librte_eal/common -I../lib/librte_eal/common -Ilib/librte_eal -I../lib/librte_eal -Ilib/librte_kvargs -I../lib/librte_kvargs -Ilib/librte_metrics -I../lib/librte_metrics -Ilib/librte_telemetry -I../lib/librte_telemetry -Ilib/librte_net -I../lib/librte_net -Ilib/librte_mbuf -I../lib/librte_mbuf -Ilib/librte_mempool -I../lib/librte_mempool -Ilib/librte_ring -I../lib/librte_ring -Ilib/librte_meter -I../lib/librte_meter -Idrivers/bus/pci -I../drivers/bus/pci -I../drivers/bus/pci/linux -Ilib/librte_pci -I../lib/librte_pci -Idrivers/bus/vdev -I../drivers/bus/vdev -Ilib/librte_hash -I../lib/librte_hash -Ilib/librte_rcu -I../lib/librte_rcu -fdiagnostics-color=always -pipe -D_FILE_OFFSET_BITS=64 -Wall -Winvalid-pch -Werror -O3 -include rte_config.h -Wextra -Wcast-qual -Wdeprecated -Wformat-nonliteral -Wformat-security -Wmissing-declarations -Wmissing-prototypes -Wnested-externs -Wold-style-definition -Wpointer-arith -Wsign-compare -Wstrict-prototypes -Wundef -Wwrite-strings -Wno-packed-not-aligned -Wno-missing-field-initializers -D_GNU_SOURCE -fPIC -march=native -mno-avx512f -DALLOW_EXPERIMENTAL_API -DALLOW_INTERNAL_API -Wno-format-truncation -DPF_DRIVER -DVF_DRIVER -DINTEGRATED_VF -DX722_A0_SUPPORT -DCC_AVX2_SUPPORT -MD -MQ drivers/libtmp_rte_net_i40e.a.p/net_i40e_i40e_fdir.c.o -MF drivers/libtmp_rte_net_i40e.a.p/net_i40e_i40e_fdir.c.o.d -o drivers/libtmp_rte_net_i40e.a.p/net_i40e_i40e_fdir.c.o -c ../drivers/net/i40e/i40e_fdir.c
../drivers/net/i40e/i40e_fdir.c:1593:1: error: redefinition of ‘i40e_flow_store_flex_pit’
 i40e_flow_store_flex_pit(struct i40e_pf *pf,
 ^~~~~~~~~~~~~~~~~~~~~~~~
../drivers/net/i40e/i40e_fdir.c:1446:1: note: previous definition of ‘i40e_flow_store_flex_pit’ was here
 i40e_flow_store_flex_pit(struct i40e_pf *pf,
 ^~~~~~~~~~~~~~~~~~~~~~~~
../drivers/net/i40e/i40e_fdir.c:1626:1: error: redefinition of ‘i40e_flow_set_fdir_flex_pit’
 i40e_flow_set_fdir_flex_pit(struct i40e_pf *pf,
 ^~~~~~~~~~~~~~~~~~~~~~~~~~~
../drivers/net/i40e/i40e_fdir.c:1479:1: note: previous definition of ‘i40e_flow_set_fdir_flex_pit’ was here
 i40e_flow_set_fdir_flex_pit(struct i40e_pf *pf,
 ^~~~~~~~~~~~~~~~~~~~~~~~~~~
../drivers/net/i40e/i40e_fdir.c:1668:1: error: redefinition of ‘i40e_flow_store_flex_mask’
 i40e_flow_store_flex_mask(struct i40e_pf *pf,
 ^~~~~~~~~~~~~~~~~~~~~~~~~
../drivers/net/i40e/i40e_fdir.c:1521:1: note: previous definition of ‘i40e_flow_store_flex_mask’ was here
 i40e_flow_store_flex_mask(struct i40e_pf *pf,
 ^~~~~~~~~~~~~~~~~~~~~~~~~
../drivers/net/i40e/i40e_fdir.c:1710:1: error: redefinition of ‘i40e_flow_set_fdir_flex_msk’
 i40e_flow_set_fdir_flex_msk(struct i40e_pf *pf,
 ^~~~~~~~~~~~~~~~~~~~~~~~~~~
../drivers/net/i40e/i40e_fdir.c:1563:1: note: previous definition of ‘i40e_flow_set_fdir_flex_msk’ was here
 i40e_flow_set_fdir_flex_msk(struct i40e_pf *pf,
 ^~~~~~~~~~~~~~~~~~~~~~~~~~~
../drivers/net/i40e/i40e_fdir.c:1563:1: error: ‘i40e_flow_set_fdir_flex_msk’ defined but not used [-Werror=unused-function]
../drivers/net/i40e/i40e_fdir.c:1521:1: error: ‘i40e_flow_store_flex_mask’ defined but not used [-Werror=unused-function]
 i40e_flow_store_flex_mask(struct i40e_pf *pf,
 ^~~~~~~~~~~~~~~~~~~~~~~~~
../drivers/net/i40e/i40e_fdir.c:1479:1: error: ‘i40e_flow_set_fdir_flex_pit’ defined but not used [-Werror=unused-function]
 i40e_flow_set_fdir_flex_pit(struct i40e_pf *pf,
 ^~~~~~~~~~~~~~~~~~~~~~~~~~~
../drivers/net/i40e/i40e_fdir.c:1446:1: error: ‘i40e_flow_store_flex_pit’ defined but not used [-Werror=unused-function]
 i40e_flow_store_flex_pit(struct i40e_pf *pf,
 ^~~~~~~~~~~~~~~~~~~~~~~~
cc1: all warnings being treated as errors
[1241/2736] Compiling C object drivers/net/i40e/base/libi40e_base.a.p/i40e_common.c.o
[1242/2736] Generating rte_net_failsafe.sym_chk with a meson_exe.py custom command
[1243/2736] Compiling C object drivers/net/i40e/base/libi40e_base.a.p/i40e_nvm.c.o
[1244/2736] Generating rte_net_fm10k.sym_chk with a meson_exe.py custom command
[1245/2736] Compiling C object drivers/libtmp_rte_net_i40e.a.p/net_i40e_i40e_pf.c.o
[1246/2736] Compiling C object drivers/libtmp_rte_net_i40e.a.p/net_i40e_i40e_ethdev_vf.c.o
[1247/2736] Compiling C object drivers/libtmp_rte_net_i40e.a.p/net_i40e_i40e_flow.c.o
[1248/2736] Compiling C object drivers/libtmp_rte_net_i40e.a.p/net_i40e_i40e_rxtx.c.o
[1249/2736] Compiling C object drivers/libtmp_rte_net_i40e.a.p/net_i40e_i40e_ethdev.c.o
ninja: build stopped: subcommand failed




*Build Failed #13:
OS: SUSE15-64
Target: x86_64-native-linuxapp-clang
FAILED: drivers/libtmp_rte_net_i40e.a.p/net_i40e_i40e_fdir.c.o 
clang -Idrivers/libtmp_rte_net_i40e.a.p -Idrivers -I../drivers -Idrivers/net/i40e -I../drivers/net/i40e -Idrivers/net/i40e/base -I../drivers/net/i40e/base -Ilib/librte_ethdev -I../lib/librte_ethdev -I. -I.. -Iconfig -I../config -Ilib/librte_eal/include -I../lib/librte_eal/include -Ilib/librte_eal/linux/include -I../lib/librte_eal/linux/include -Ilib/librte_eal/x86/include -I../lib/librte_eal/x86/include -Ilib/librte_eal/common -I../lib/librte_eal/common -Ilib/librte_eal -I../lib/librte_eal -Ilib/librte_kvargs -I../lib/librte_kvargs -Ilib/librte_metrics -I../lib/librte_metrics -Ilib/librte_telemetry -I../lib/librte_telemetry -Ilib/librte_net -I../lib/librte_net -Ilib/librte_mbuf -I../lib/librte_mbuf -Ilib/librte_mempool -I../lib/librte_mempool -Ilib/librte_ring -I../lib/librte_ring -Ilib/librte_meter -I../lib/librte_meter -Idrivers/bus/pci -I../drivers/bus/pci -I../drivers/bus/pci/linux -Ilib/librte_pci -I../lib/librte_pci -Idrivers/bus/vdev -I../drivers/bus/vdev -Ilib/librte_hash -I../lib/librte_hash -Ilib/librte_rcu -I../lib/librte_rcu -Xclang -fcolor-diagnostics -pipe -D_FILE_OFFSET_BITS=64 -Wall -Winvalid-pch -Werror -O3 -include rte_config.h -Wextra -Wcast-qual -Wdeprecated -Wformat-nonliteral -Wformat-security -Wmissing-declarations -Wmissing-prototypes -Wnested-externs -Wold-style-definition -Wpointer-arith -Wsign-compare -Wstrict-prototypes -Wundef -Wwrite-strings -Wno-address-of-packed-member -Wno-missing-field-initializers -D_GNU_SOURCE -fPIC -march=native -DALLOW_EXPERIMENTAL_API -DALLOW_INTERNAL_API -DPF_DRIVER -DVF_DRIVER -DINTEGRATED_VF -DX722_A0_SUPPORT -DCC_AVX2_SUPPORT -MD -MQ drivers/libtmp_rte_net_i40e.a.p/net_i40e_i40e_fdir.c.o -MF drivers/libtmp_rte_net_i40e.a.p/net_i40e_i40e_fdir.c.o.d -o drivers/libtmp_rte_net_i40e.a.p/net_i40e_i40e_fdir.c.o -c ../drivers/net/i40e/i40e_fdir.c
../drivers/net/i40e/i40e_fdir.c:1593:1: error: redefinition of 'i40e_flow_store_flex_pit'
i40e_flow_store_flex_pit(struct i40e_pf *pf,
^
../drivers/net/i40e/i40e_fdir.c:1446:1: note: previous definition is here
i40e_flow_store_flex_pit(struct i40e_pf *pf,
^
../drivers/net/i40e/i40e_fdir.c:1626:1: error: redefinition of 'i40e_flow_set_fdir_flex_pit'
i40e_flow_set_fdir_flex_pit(struct i40e_pf *pf,
^
../drivers/net/i40e/i40e_fdir.c:1479:1: note: previous definition is here
i40e_flow_set_fdir_flex_pit(struct i40e_pf *pf,
^
../drivers/net/i40e/i40e_fdir.c:1668:1: error: redefinition of 'i40e_flow_store_flex_mask'
i40e_flow_store_flex_mask(struct i40e_pf *pf,
^
../drivers/net/i40e/i40e_fdir.c:1521:1: note: previous definition is here
i40e_flow_store_flex_mask(struct i40e_pf *pf,
^
../drivers/net/i40e/i40e_fdir.c:1710:1: error: redefinition of 'i40e_flow_set_fdir_flex_msk'
i40e_flow_set_fdir_flex_msk(struct i40e_pf *pf,
^
../drivers/net/i40e/i40e_fdir.c:1563:1: note: previous definition is here
i40e_flow_set_fdir_flex_msk(struct i40e_pf *pf,
^
4 errors generated.
[1245/2715] Compiling C object drivers/librte_net_fm10k.a.p/meson-generated_.._rte_net_fm10k.pmd.c.o
[1246/2715] Compiling C object drivers/libtmp_rte_net_i40e.a.p/net_i40e_i40e_tm.c.o
[1247/2715] Compiling C object drivers/libtmp_rte_net_i40e.a.p/net_i40e_i40e_vf_representor.c.o
[1248/2715] Compiling C object drivers/libtmp_rte_net_i40e.a.p/net_i40e_i40e_ethdev_vf.c.o
[1249/2715] Compiling C object drivers/libtmp_rte_net_i40e.a.p/net_i40e_i40e_pf.c.o
[1250/2715] Compiling C object drivers/libtmp_rte_net_i40e.a.p/net_i40e_rte_pmd_i40e.c.o
[1251/2715] Compiling C object drivers/libtmp_rte_net_i40e.a.p/net_i40e_i40e_flow.c.o
[1252/2715] Compiling C object drivers/libtmp_rte_net_i40e.a.p/net_i40e_i40e_rxtx.c.o
[1253/2715] Compiling C object drivers/libtmp_rte_net_i40e.a.p/net_i40e_i40e_ethdev.c.o
ninja: build stopped: subcommand failed




*Build Failed #14:
OS: SUSE15-64
Target: x86_64-native-linuxapp-gcc
FAILED: drivers/libtmp_rte_net_i40e.a.p/net_i40e_i40e_fdir.c.o 
gcc -Idrivers/libtmp_rte_net_i40e.a.p -Idrivers -I../drivers -Idrivers/net/i40e -I../drivers/net/i40e -Idrivers/net/i40e/base -I../drivers/net/i40e/base -Ilib/librte_ethdev -I../lib/librte_ethdev -I. -I.. -Iconfig -I../config -Ilib/librte_eal/include -I../lib/librte_eal/include -Ilib/librte_eal/linux/include -I../lib/librte_eal/linux/include -Ilib/librte_eal/x86/include -I../lib/librte_eal/x86/include -Ilib/librte_eal/common -I../lib/librte_eal/common -Ilib/librte_eal -I../lib/librte_eal -Ilib/librte_kvargs -I../lib/librte_kvargs -Ilib/librte_metrics -I../lib/librte_metrics -Ilib/librte_telemetry -I../lib/librte_telemetry -Ilib/librte_net -I../lib/librte_net -Ilib/librte_mbuf -I../lib/librte_mbuf -Ilib/librte_mempool -I../lib/librte_mempool -Ilib/librte_ring -I../lib/librte_ring -Ilib/librte_meter -I../lib/librte_meter -Idrivers/bus/pci -I../drivers/bus/pci -I../drivers/bus/pci/linux -Ilib/librte_pci -I../lib/librte_pci -Idrivers/bus/vdev -I../drivers/bus/vdev -Ilib/librte_hash -I../lib/librte_hash -Ilib/librte_rcu -I../lib/librte_rcu -fdiagnostics-color=always -pipe -D_FILE_OFFSET_BITS=64 -Wall -Winvalid-pch -Werror -O3 -include rte_config.h -Wextra -Wcast-qual -Wdeprecated -Wformat-nonliteral -Wformat-security -Wmissing-declarations -Wmissing-prototypes -Wnested-externs -Wold-style-definition -Wpointer-arith -Wsign-compare -Wstrict-prototypes -Wundef -Wwrite-strings -Wno-missing-field-initializers -D_GNU_SOURCE -fPIC -march=native -DALLOW_EXPERIMENTAL_API -DALLOW_INTERNAL_API -Wno-format-truncation -DPF_DRIVER -DVF_DRIVER -DINTEGRATED_VF -DX722_A0_SUPPORT -DCC_AVX2_SUPPORT -MD -MQ drivers/libtmp_rte_net_i40e.a.p/net_i40e_i40e_fdir.c.o -MF drivers/libtmp_rte_net_i40e.a.p/net_i40e_i40e_fdir.c.o.d -o drivers/libtmp_rte_net_i40e.a.p/net_i40e_i40e_fdir.c.o -c ../drivers/net/i40e/i40e_fdir.c
../drivers/net/i40e/i40e_fdir.c:1593:1: error: redefinition of ‘i40e_flow_store_flex_pit’
 i40e_flow_store_flex_pit(struct i40e_pf *pf,
 ^~~~~~~~~~~~~~~~~~~~~~~~
../drivers/net/i40e/i40e_fdir.c:1446:1: note: previous definition of ‘i40e_flow_store_flex_pit’ was here
 i40e_flow_store_flex_pit(struct i40e_pf *pf,
 ^~~~~~~~~~~~~~~~~~~~~~~~
../drivers/net/i40e/i40e_fdir.c:1626:1: error: redefinition of ‘i40e_flow_set_fdir_flex_pit’
 i40e_flow_set_fdir_flex_pit(struct i40e_pf *pf,
 ^~~~~~~~~~~~~~~~~~~~~~~~~~~
../drivers/net/i40e/i40e_fdir.c:1479:1: note: previous definition of ‘i40e_flow_set_fdir_flex_pit’ was here
 i40e_flow_set_fdir_flex_pit(struct i40e_pf *pf,
 ^~~~~~~~~~~~~~~~~~~~~~~~~~~
../drivers/net/i40e/i40e_fdir.c:1668:1: error: redefinition of ‘i40e_flow_store_flex_mask’
 i40e_flow_store_flex_mask(struct i40e_pf *pf,
 ^~~~~~~~~~~~~~~~~~~~~~~~~
../drivers/net/i40e/i40e_fdir.c:1521:1: note: previous definition of ‘i40e_flow_store_flex_mask’ was here
 i40e_flow_store_flex_mask(struct i40e_pf *pf,
 ^~~~~~~~~~~~~~~~~~~~~~~~~
../drivers/net/i40e/i40e_fdir.c:1710:1: error: redefinition of ‘i40e_flow_set_fdir_flex_msk’
 i40e_flow_set_fdir_flex_msk(struct i40e_pf *pf,
 ^~~~~~~~~~~~~~~~~~~~~~~~~~~
../drivers/net/i40e/i40e_fdir.c:1563:1: note: previous definition of ‘i40e_flow_set_fdir_flex_msk’ was here
 i40e_flow_set_fdir_flex_msk(struct i40e_pf *pf,
 ^~~~~~~~~~~~~~~~~~~~~~~~~~~
../drivers/net/i40e/i40e_fdir.c:1563:1: error: ‘i40e_flow_set_fdir_flex_msk’ defined but not used [-Werror=unused-function]
../drivers/net/i40e/i40e_fdir.c:1521:1: error: ‘i40e_flow_store_flex_mask’ defined but not used [-Werror=unused-function]
 i40e_flow_store_flex_mask(struct i40e_pf *pf,
 ^~~~~~~~~~~~~~~~~~~~~~~~~
../drivers/net/i40e/i40e_fdir.c:1479:1: error: ‘i40e_flow_set_fdir_flex_pit’ defined but not used [-Werror=unused-function]
 i40e_flow_set_fdir_flex_pit(struct i40e_pf *pf,
 ^~~~~~~~~~~~~~~~~~~~~~~~~~~
../drivers/net/i40e/i40e_fdir.c:1446:1: error: ‘i40e_flow_store_flex_pit’ defined but not used [-Werror=unused-function]
 i40e_flow_store_flex_pit(struct i40e_pf *pf,
 ^~~~~~~~~~~~~~~~~~~~~~~~
cc1: all warnings being treated as errors
[1238/2712] Compiling C object drivers/librte_net_fm10k.a.p/meson-generated_.._rte_net_fm10k.pmd.c.o
[1239/2712] Compiling C object drivers/librte_net_fm10k.so.21.0.p/meson-generated_.._rte_net_fm10k.pmd.c.o
[1240/2712] Generating rte_net_failsafe.sym_chk with a meson_exe.py custom command
[1241/2712] Compiling C object drivers/libtmp_rte_net_i40e.a.p/net_i40e_i40e_pf.c.o
[1242/2712] Compiling C object drivers/net/i40e/base/libi40e_base.a.p/i40e_common.c.o
[1243/2712] Compiling C object drivers/libtmp_rte_net_i40e.a.p/net_i40e_i40e_ethdev_vf.c.o
[1244/2712] Compiling C object drivers/libtmp_rte_net_i40e.a.p/net_i40e_i40e_flow.c.o
[1245/2712] Compiling C object drivers/libtmp_rte_net_i40e.a.p/net_i40e_i40e_rxtx.c.o
[1246/2712] Compiling C object drivers/libtmp_rte_net_i40e.a.p/net_i40e_i40e_ethdev.c.o
ninja: build stopped: subcommand failed




*Build Failed #15:
OS: UB1804-64
Target: x86_64-native-linuxapp-gcc
FAILED: drivers/libtmp_rte_net_i40e.a.p/net_i40e_i40e_fdir.c.o 
gcc -Idrivers/libtmp_rte_net_i40e.a.p -Idrivers -I../drivers -Idrivers/net/i40e -I../drivers/net/i40e -Idrivers/net/i40e/base -I../drivers/net/i40e/base -Ilib/librte_ethdev -I../lib/librte_ethdev -I. -I.. -Iconfig -I../config -Ilib/librte_eal/include -I../lib/librte_eal/include -Ilib/librte_eal/linux/include -I../lib/librte_eal/linux/include -Ilib/librte_eal/x86/include -I../lib/librte_eal/x86/include -Ilib/librte_eal/common -I../lib/librte_eal/common -Ilib/librte_eal -I../lib/librte_eal -Ilib/librte_kvargs -I../lib/librte_kvargs -Ilib/librte_metrics -I../lib/librte_metrics -Ilib/librte_telemetry -I../lib/librte_telemetry -Ilib/librte_net -I../lib/librte_net -Ilib/librte_mbuf -I../lib/librte_mbuf -Ilib/librte_mempool -I../lib/librte_mempool -Ilib/librte_ring -I../lib/librte_ring -Ilib/librte_meter -I../lib/librte_meter -Idrivers/bus/pci -I../drivers/bus/pci -I../drivers/bus/pci/linux -Ilib/librte_pci -I../lib/librte_pci -Idrivers/bus/vdev -I../drivers/bus/vdev -Ilib/librte_hash -I../lib/librte_hash -Ilib/librte_rcu -I../lib/librte_rcu -fdiagnostics-color=always -pipe -D_FILE_OFFSET_BITS=64 -Wall -Winvalid-pch -Werror -O3 -include rte_config.h -Wextra -Wcast-qual -Wdeprecated -Wformat-nonliteral -Wformat-security -Wmissing-declarations -Wmissing-prototypes -Wnested-externs -Wold-style-definition -Wpointer-arith -Wsign-compare -Wstrict-prototypes -Wundef -Wwrite-strings -Wno-packed-not-aligned -Wno-missing-field-initializers -D_GNU_SOURCE -fPIC -march=native -mno-avx512f -DALLOW_EXPERIMENTAL_API -DALLOW_INTERNAL_API -Wno-format-truncation -DPF_DRIVER -DVF_DRIVER -DINTEGRATED_VF -DX722_A0_SUPPORT -DCC_AVX2_SUPPORT -MD -MQ drivers/libtmp_rte_net_i40e.a.p/net_i40e_i40e_fdir.c.o -MF drivers/libtmp_rte_net_i40e.a.p/net_i40e_i40e_fdir.c.o.d -o drivers/libtmp_rte_net_i40e.a.p/net_i40e_i40e_fdir.c.o -c ../drivers/net/i40e/i40e_fdir.c
../drivers/net/i40e/i40e_fdir.c:1593:1: error: redefinition of ‘i40e_flow_store_flex_pit’
 i40e_flow_store_flex_pit(struct i40e_pf *pf,
 ^~~~~~~~~~~~~~~~~~~~~~~~
../drivers/net/i40e/i40e_fdir.c:1446:1: note: previous definition of ‘i40e_flow_store_flex_pit’ was here
 i40e_flow_store_flex_pit(struct i40e_pf *pf,
 ^~~~~~~~~~~~~~~~~~~~~~~~
../drivers/net/i40e/i40e_fdir.c:1626:1: error: redefinition of ‘i40e_flow_set_fdir_flex_pit’
 i40e_flow_set_fdir_flex_pit(struct i40e_pf *pf,
 ^~~~~~~~~~~~~~~~~~~~~~~~~~~
../drivers/net/i40e/i40e_fdir.c:1479:1: note: previous definition of ‘i40e_flow_set_fdir_flex_pit’ was here
 i40e_flow_set_fdir_flex_pit(struct i40e_pf *pf,
 ^~~~~~~~~~~~~~~~~~~~~~~~~~~
../drivers/net/i40e/i40e_fdir.c:1668:1: error: redefinition of ‘i40e_flow_store_flex_mask’
 i40e_flow_store_flex_mask(struct i40e_pf *pf,
 ^~~~~~~~~~~~~~~~~~~~~~~~~
../drivers/net/i40e/i40e_fdir.c:1521:1: note: previous definition of ‘i40e_flow_store_flex_mask’ was here
 i40e_flow_store_flex_mask(struct i40e_pf *pf,
 ^~~~~~~~~~~~~~~~~~~~~~~~~
../drivers/net/i40e/i40e_fdir.c:1710:1: error: redefinition of ‘i40e_flow_set_fdir_flex_msk’
 i40e_flow_set_fdir_flex_msk(struct i40e_pf *pf,
 ^~~~~~~~~~~~~~~~~~~~~~~~~~~
../drivers/net/i40e/i40e_fdir.c:1563:1: note: previous definition of ‘i40e_flow_set_fdir_flex_msk’ was here
 i40e_flow_set_fdir_flex_msk(struct i40e_pf *pf,
 ^~~~~~~~~~~~~~~~~~~~~~~~~~~
../drivers/net/i40e/i40e_fdir.c:1563:1: error: ‘i40e_flow_set_fdir_flex_msk’ defined but not used [-Werror=unused-function]
../drivers/net/i40e/i40e_fdir.c:1521:1: error: ‘i40e_flow_store_flex_mask’ defined but not used [-Werror=unused-function]
 i40e_flow_store_flex_mask(struct i40e_pf *pf,
 ^~~~~~~~~~~~~~~~~~~~~~~~~
../drivers/net/i40e/i40e_fdir.c:1479:1: error: ‘i40e_flow_set_fdir_flex_pit’ defined but not used [-Werror=unused-function]
 i40e_flow_set_fdir_flex_pit(struct i40e_pf *pf,
 ^~~~~~~~~~~~~~~~~~~~~~~~~~~
../drivers/net/i40e/i40e_fdir.c:1446:1: error: ‘i40e_flow_store_flex_pit’ defined but not used [-Werror=unused-function]
 i40e_flow_store_flex_pit(struct i40e_pf *pf,
 ^~~~~~~~~~~~~~~~~~~~~~~~
cc1: all warnings being treated as errors
[1235/2725] Compiling C object drivers/net/i40e/base/libi40e_base.a.p/i40e_nvm.c.o
[1236/2725] Compiling C object drivers/net/i40e/base/libi40e_base.a.p/i40e_common.c.o
[1237/2725] Generating rte_net_failsafe.sym_chk with a meson_exe.py custom command
[1238/2725] Generating rte_net_fm10k.sym_chk with a meson_exe.py custom command
[1239/2725] Compiling C object drivers/libtmp_rte_net_i40e.a.p/net_i40e_i40e_pf.c.o
[1240/2725] Compiling C object drivers/libtmp_rte_net_i40e.a.p/net_i40e_i40e_ethdev_vf.c.o
[1241/2725] Compiling C object drivers/libtmp_rte_net_i40e.a.p/net_i40e_i40e_flow.c.o
[1242/2725] Compiling C object drivers/libtmp_rte_net_i40e.a.p/net_i40e_i40e_rxtx.c.o
[1243/2725] Compiling C object drivers/libtmp_rte_net_i40e.a.p/net_i40e_i40e_ethdev.c.o
ninja: build stopped: subcommand failed




*Build Failed #16:
OS: UB2004-32
Target: i686-native-linuxapp-gcc
FAILED: drivers/libtmp_rte_net_i40e.a.p/net_i40e_i40e_fdir.c.o 
gcc -Idrivers/libtmp_rte_net_i40e.a.p -Idrivers -I../drivers -Idrivers/net/i40e -I../drivers/net/i40e -Idrivers/net/i40e/base -I../drivers/net/i40e/base -Ilib/librte_ethdev -I../lib/librte_ethdev -I. -I.. -Iconfig -I../config -Ilib/librte_eal/include -I../lib/librte_eal/include -Ilib/librte_eal/linux/include -I../lib/librte_eal/linux/include -Ilib/librte_eal/x86/include -I../lib/librte_eal/x86/include -Ilib/librte_eal/common -I../lib/librte_eal/common -Ilib/librte_eal -I../lib/librte_eal -Ilib/librte_kvargs -I../lib/librte_kvargs -Ilib/librte_metrics -I../lib/librte_metrics -Ilib/librte_telemetry -I../lib/librte_telemetry -Ilib/librte_net -I../lib/librte_net -Ilib/librte_mbuf -I../lib/librte_mbuf -Ilib/librte_mempool -I../lib/librte_mempool -Ilib/librte_ring -I../lib/librte_ring -Ilib/librte_meter -I../lib/librte_meter -Idrivers/bus/pci -I../drivers/bus/pci -I../drivers/bus/pci/linux -Ilib/librte_pci -I../lib/librte_pci -Idrivers/bus/vdev -I../drivers/bus/vdev -Ilib/librte_hash -I../lib/librte_hash -Ilib/librte_rcu -I../lib/librte_rcu -fdiagnostics-color=always -pipe -D_FILE_OFFSET_BITS=64 -Wall -Winvalid-pch -Werror -O3 -include rte_config.h -Wextra -Wcast-qual -Wdeprecated -Wformat-nonliteral -Wformat-security -Wmissing-declarations -Wmissing-prototypes -Wnested-externs -Wold-style-definition -Wpointer-arith -Wsign-compare -Wstrict-prototypes -Wundef -Wwrite-strings -Wno-address-of-packed-member -Wno-packed-not-aligned -Wno-missing-field-initializers -Wno-pointer-to-int-cast -D_GNU_SOURCE -m32 -fPIC -march=native -DALLOW_EXPERIMENTAL_API -DALLOW_INTERNAL_API -Wno-format-truncation -DPF_DRIVER -DVF_DRIVER -DINTEGRATED_VF -DX722_A0_SUPPORT -DCC_AVX2_SUPPORT -MD -MQ drivers/libtmp_rte_net_i40e.a.p/net_i40e_i40e_fdir.c.o -MF drivers/libtmp_rte_net_i40e.a.p/net_i40e_i40e_fdir.c.o.d -o drivers/libtmp_rte_net_i40e.a.p/net_i40e_i40e_fdir.c.o -c ../drivers/net/i40e/i40e_fdir.c
../drivers/net/i40e/i40e_fdir.c:1593:1: error: redefinition of ‘i40e_flow_store_flex_pit’
 1593 | i40e_flow_store_flex_pit(struct i40e_pf *pf,
      | ^~~~~~~~~~~~~~~~~~~~~~~~
../drivers/net/i40e/i40e_fdir.c:1446:1: note: previous definition of ‘i40e_flow_store_flex_pit’ was here
 1446 | i40e_flow_store_flex_pit(struct i40e_pf *pf,
      | ^~~~~~~~~~~~~~~~~~~~~~~~
../drivers/net/i40e/i40e_fdir.c:1626:1: error: redefinition of ‘i40e_flow_set_fdir_flex_pit’
 1626 | i40e_flow_set_fdir_flex_pit(struct i40e_pf *pf,
      | ^~~~~~~~~~~~~~~~~~~~~~~~~~~
../drivers/net/i40e/i40e_fdir.c:1479:1: note: previous definition of ‘i40e_flow_set_fdir_flex_pit’ was here
 1479 | i40e_flow_set_fdir_flex_pit(struct i40e_pf *pf,
      | ^~~~~~~~~~~~~~~~~~~~~~~~~~~
../drivers/net/i40e/i40e_fdir.c:1668:1: error: redefinition of ‘i40e_flow_store_flex_mask’
 1668 | i40e_flow_store_flex_mask(struct i40e_pf *pf,
      | ^~~~~~~~~~~~~~~~~~~~~~~~~
../drivers/net/i40e/i40e_fdir.c:1521:1: note: previous definition of ‘i40e_flow_store_flex_mask’ was here
 1521 | i40e_flow_store_flex_mask(struct i40e_pf *pf,
      | ^~~~~~~~~~~~~~~~~~~~~~~~~
../drivers/net/i40e/i40e_fdir.c:1710:1: error: redefinition of ‘i40e_flow_set_fdir_flex_msk’
 1710 | i40e_flow_set_fdir_flex_msk(struct i40e_pf *pf,
      | ^~~~~~~~~~~~~~~~~~~~~~~~~~~
../drivers/net/i40e/i40e_fdir.c:1563:1: note: previous definition of ‘i40e_flow_set_fdir_flex_msk’ was here
 1563 | i40e_flow_set_fdir_flex_msk(struct i40e_pf *pf,
      | ^~~~~~~~~~~~~~~~~~~~~~~~~~~
../drivers/net/i40e/i40e_fdir.c:1563:1: error: ‘i40e_flow_set_fdir_flex_msk’ defined but not used [-Werror=unused-function]
../drivers/net/i40e/i40e_fdir.c:1521:1: error: ‘i40e_flow_store_flex_mask’ defined but not used [-Werror=unused-function]
 1521 | i40e_flow_store_flex_mask(struct i40e_pf *pf,
      | ^~~~~~~~~~~~~~~~~~~~~~~~~
../drivers/net/i40e/i40e_fdir.c:1479:1: error: ‘i40e_flow_set_fdir_flex_pit’ defined but not used [-Werror=unused-function]
 1479 | i40e_flow_set_fdir_flex_pit(struct i40e_pf *pf,
      | ^~~~~~~~~~~~~~~~~~~~~~~~~~~
../drivers/net/i40e/i40e_fdir.c:1446:1: error: ‘i40e_flow_store_flex_pit’ defined but not used [-Werror=unused-function]
 1446 | i40e_flow_store_flex_pit(struct i40e_pf *pf,
      | ^~~~~~~~~~~~~~~~~~~~~~~~
cc1: all warnings being treated as errors
[1142/2429] Compiling C object drivers/librte_net_fm10k.a.p/meson-generated_.._rte_net_fm10k.pmd.c.o
[1143/2429] Compiling C object drivers/net/i40e/base/libi40e_base.a.p/i40e_nvm.c.o
[1144/2429] Generating rte_net_failsafe.sym_chk with a meson_exe.py custom command
[1145/2429] Compiling C object drivers/libtmp_rte_net_i40e.a.p/net_i40e_i40e_pf.c.o
[1146/2429] Compiling C object drivers/net/i40e/base/libi40e_base.a.p/i40e_common.c.o
[1147/2429] Compiling C object drivers/libtmp_rte_net_i40e.a.p/net_i40e_i40e_ethdev_vf.c.o
[1148/2429] Compiling C object drivers/libtmp_rte_net_i40e.a.p/net_i40e_i40e_flow.c.o
[1149/2429] Compiling C object drivers/libtmp_rte_net_i40e.a.p/net_i40e_i40e_rxtx.c.o
[1150/2429] Compiling C object drivers/libtmp_rte_net_i40e.a.p/net_i40e_i40e_ethdev.c.o
ninja: build stopped: subcommand failed




*Build Failed #17:
OS: UB2004-64
Target: x86_64-native-linuxapp-clang
FAILED: drivers/libtmp_rte_net_i40e.a.p/net_i40e_i40e_fdir.c.o 
clang -Idrivers/libtmp_rte_net_i40e.a.p -Idrivers -I../drivers -Idrivers/net/i40e -I../drivers/net/i40e -Idrivers/net/i40e/base -I../drivers/net/i40e/base -Ilib/librte_ethdev -I../lib/librte_ethdev -I. -I.. -Iconfig -I../config -Ilib/librte_eal/include -I../lib/librte_eal/include -Ilib/librte_eal/linux/include -I../lib/librte_eal/linux/include -Ilib/librte_eal/x86/include -I../lib/librte_eal/x86/include -Ilib/librte_eal/common -I../lib/librte_eal/common -Ilib/librte_eal -I../lib/librte_eal -Ilib/librte_kvargs -I../lib/librte_kvargs -Ilib/librte_metrics -I../lib/librte_metrics -Ilib/librte_telemetry -I../lib/librte_telemetry -Ilib/librte_net -I../lib/librte_net -Ilib/librte_mbuf -I../lib/librte_mbuf -Ilib/librte_mempool -I../lib/librte_mempool -Ilib/librte_ring -I../lib/librte_ring -Ilib/librte_meter -I../lib/librte_meter -Idrivers/bus/pci -I../drivers/bus/pci -I../drivers/bus/pci/linux -Ilib/librte_pci -I../lib/librte_pci -Idrivers/bus/vdev -I../drivers/bus/vdev -Ilib/librte_hash -I../lib/librte_hash -Ilib/librte_rcu -I../lib/librte_rcu -Xclang -fcolor-diagnostics -pipe -D_FILE_OFFSET_BITS=64 -Wall -Winvalid-pch -Werror -O3 -include rte_config.h -Wextra -Wcast-qual -Wdeprecated -Wformat-nonliteral -Wformat-security -Wmissing-declarations -Wmissing-prototypes -Wnested-externs -Wold-style-definition -Wpointer-arith -Wsign-compare -Wstrict-prototypes -Wundef -Wwrite-strings -Wno-address-of-packed-member -Wno-missing-field-initializers -D_GNU_SOURCE -fPIC -march=native -DALLOW_EXPERIMENTAL_API -DALLOW_INTERNAL_API -DPF_DRIVER -DVF_DRIVER -DINTEGRATED_VF -DX722_A0_SUPPORT -DCC_AVX2_SUPPORT -MD -MQ drivers/libtmp_rte_net_i40e.a.p/net_i40e_i40e_fdir.c.o -MF drivers/libtmp_rte_net_i40e.a.p/net_i40e_i40e_fdir.c.o.d -o drivers/libtmp_rte_net_i40e.a.p/net_i40e_i40e_fdir.c.o -c ../drivers/net/i40e/i40e_fdir.c
../drivers/net/i40e/i40e_fdir.c:1593:1: error: redefinition of 'i40e_flow_store_flex_pit'
i40e_flow_store_flex_pit(struct i40e_pf *pf,
^
../drivers/net/i40e/i40e_fdir.c:1446:1: note: previous definition is here
i40e_flow_store_flex_pit(struct i40e_pf *pf,
^
../drivers/net/i40e/i40e_fdir.c:1626:1: error: redefinition of 'i40e_flow_set_fdir_flex_pit'
i40e_flow_set_fdir_flex_pit(struct i40e_pf *pf,
^
../drivers/net/i40e/i40e_fdir.c:1479:1: note: previous definition is here
i40e_flow_set_fdir_flex_pit(struct i40e_pf *pf,
^
../drivers/net/i40e/i40e_fdir.c:1668:1: error: redefinition of 'i40e_flow_store_flex_mask'
i40e_flow_store_flex_mask(struct i40e_pf *pf,
^
../drivers/net/i40e/i40e_fdir.c:1521:1: note: previous definition is here
i40e_flow_store_flex_mask(struct i40e_pf *pf,
^
../drivers/net/i40e/i40e_fdir.c:1710:1: error: redefinition of 'i40e_flow_set_fdir_flex_msk'
i40e_flow_set_fdir_flex_msk(struct i40e_pf *pf,
^
../drivers/net/i40e/i40e_fdir.c:1563:1: note: previous definition is here
i40e_flow_set_fdir_flex_msk(struct i40e_pf *pf,
^
4 errors generated.
[1244/2736] Compiling C object drivers/net/i40e/base/libi40e_base.a.p/i40e_nvm.c.o
[1245/2736] Generating rte_net_failsafe.sym_chk with a meson_exe.py custom command
[1246/2736] Generating rte_net_fm10k.sym_chk with a meson_exe.py custom command
[1247/2736] Compiling C object drivers/libtmp_rte_net_i40e.a.p/net_i40e_i40e_pf.c.o
[1248/2736] Compiling C object drivers/libtmp_rte_net_i40e.a.p/net_i40e_i40e_ethdev_vf.c.o
[1249/2736] Compiling C object drivers/libtmp_rte_net_i40e.a.p/net_i40e_i40e_tm.c.o
[1250/2736] Compiling C object drivers/libtmp_rte_net_i40e.a.p/net_i40e_i40e_rxtx.c.o
[1251/2736] Compiling C object drivers/libtmp_rte_net_i40e.a.p/net_i40e_i40e_flow.c.o
[1252/2736] Compiling C object drivers/libtmp_rte_net_i40e.a.p/net_i40e_i40e_ethdev.c.o
ninja: build stopped: subcommand failed




*Build Failed #18:
OS: UB2004-64
Target: x86_64-native-linuxapp-gcc
FAILED: drivers/libtmp_rte_net_i40e.a.p/net_i40e_i40e_fdir.c.o 
gcc -Idrivers/libtmp_rte_net_i40e.a.p -Idrivers -I../drivers -Idrivers/net/i40e -I../drivers/net/i40e -Idrivers/net/i40e/base -I../drivers/net/i40e/base -Ilib/librte_ethdev -I../lib/librte_ethdev -I. -I.. -Iconfig -I../config -Ilib/librte_eal/include -I../lib/librte_eal/include -Ilib/librte_eal/linux/include -I../lib/librte_eal/linux/include -Ilib/librte_eal/x86/include -I../lib/librte_eal/x86/include -Ilib/librte_eal/common -I../lib/librte_eal/common -Ilib/librte_eal -I../lib/librte_eal -Ilib/librte_kvargs -I../lib/librte_kvargs -Ilib/librte_metrics -I../lib/librte_metrics -Ilib/librte_telemetry -I../lib/librte_telemetry -Ilib/librte_net -I../lib/librte_net -Ilib/librte_mbuf -I../lib/librte_mbuf -Ilib/librte_mempool -I../lib/librte_mempool -Ilib/librte_ring -I../lib/librte_ring -Ilib/librte_meter -I../lib/librte_meter -Idrivers/bus/pci -I../drivers/bus/pci -I../drivers/bus/pci/linux -Ilib/librte_pci -I../lib/librte_pci -Idrivers/bus/vdev -I../drivers/bus/vdev -Ilib/librte_hash -I../lib/librte_hash -Ilib/librte_rcu -I../lib/librte_rcu -fdiagnostics-color=always -pipe -D_FILE_OFFSET_BITS=64 -Wall -Winvalid-pch -Werror -O3 -include rte_config.h -Wextra -Wcast-qual -Wdeprecated -Wformat-nonliteral -Wformat-security -Wmissing-declarations -Wmissing-prototypes -Wnested-externs -Wold-style-definition -Wpointer-arith -Wsign-compare -Wstrict-prototypes -Wundef -Wwrite-strings -Wno-address-of-packed-member -Wno-packed-not-aligned -Wno-missing-field-initializers -Wno-zero-length-bounds -D_GNU_SOURCE -fPIC -march=native -DALLOW_EXPERIMENTAL_API -DALLOW_INTERNAL_API -Wno-format-truncation -DPF_DRIVER -DVF_DRIVER -DINTEGRATED_VF -DX722_A0_SUPPORT -DCC_AVX2_SUPPORT -MD -MQ drivers/libtmp_rte_net_i40e.a.p/net_i40e_i40e_fdir.c.o -MF drivers/libtmp_rte_net_i40e.a.p/net_i40e_i40e_fdir.c.o.d -o drivers/libtmp_rte_net_i40e.a.p/net_i40e_i40e_fdir.c.o -c ../drivers/net/i40e/i40e_fdir.c
../drivers/net/i40e/i40e_fdir.c:1593:1: error: redefinition of ‘i40e_flow_store_flex_pit’
 1593 | i40e_flow_store_flex_pit(struct i40e_pf *pf,
      | ^~~~~~~~~~~~~~~~~~~~~~~~
../drivers/net/i40e/i40e_fdir.c:1446:1: note: previous definition of ‘i40e_flow_store_flex_pit’ was here
 1446 | i40e_flow_store_flex_pit(struct i40e_pf *pf,
      | ^~~~~~~~~~~~~~~~~~~~~~~~
../drivers/net/i40e/i40e_fdir.c:1626:1: error: redefinition of ‘i40e_flow_set_fdir_flex_pit’
 1626 | i40e_flow_set_fdir_flex_pit(struct i40e_pf *pf,
      | ^~~~~~~~~~~~~~~~~~~~~~~~~~~
../drivers/net/i40e/i40e_fdir.c:1479:1: note: previous definition of ‘i40e_flow_set_fdir_flex_pit’ was here
 1479 | i40e_flow_set_fdir_flex_pit(struct i40e_pf *pf,
      | ^~~~~~~~~~~~~~~~~~~~~~~~~~~
../drivers/net/i40e/i40e_fdir.c:1668:1: error: redefinition of ‘i40e_flow_store_flex_mask’
 1668 | i40e_flow_store_flex_mask(struct i40e_pf *pf,
      | ^~~~~~~~~~~~~~~~~~~~~~~~~
../drivers/net/i40e/i40e_fdir.c:1521:1: note: previous definition of ‘i40e_flow_store_flex_mask’ was here
 1521 | i40e_flow_store_flex_mask(struct i40e_pf *pf,
      | ^~~~~~~~~~~~~~~~~~~~~~~~~
../drivers/net/i40e/i40e_fdir.c:1710:1: error: redefinition of ‘i40e_flow_set_fdir_flex_msk’
 1710 | i40e_flow_set_fdir_flex_msk(struct i40e_pf *pf,
      | ^~~~~~~~~~~~~~~~~~~~~~~~~~~
../drivers/net/i40e/i40e_fdir.c:1563:1: note: previous definition of ‘i40e_flow_set_fdir_flex_msk’ was here
 1563 | i40e_flow_set_fdir_flex_msk(struct i40e_pf *pf,
      | ^~~~~~~~~~~~~~~~~~~~~~~~~~~
../drivers/net/i40e/i40e_fdir.c:1563:1: error: ‘i40e_flow_set_fdir_flex_msk’ defined but not used [-Werror=unused-function]
../drivers/net/i40e/i40e_fdir.c:1521:1: error: ‘i40e_flow_store_flex_mask’ defined but not used [-Werror=unused-function]
 1521 | i40e_flow_store_flex_mask(struct i40e_pf *pf,
      | ^~~~~~~~~~~~~~~~~~~~~~~~~
../drivers/net/i40e/i40e_fdir.c:1479:1: error: ‘i40e_flow_set_fdir_flex_pit’ defined but not used [-Werror=unused-function]
 1479 | i40e_flow_set_fdir_flex_pit(struct i40e_pf *pf,
      | ^~~~~~~~~~~~~~~~~~~~~~~~~~~
../drivers/net/i40e/i40e_fdir.c:1446:1: error: ‘i40e_flow_store_flex_pit’ defined but not used [-Werror=unused-function]
 1446 | i40e_flow_store_flex_pit(struct i40e_pf *pf,
      | ^~~~~~~~~~~~~~~~~~~~~~~~
cc1: all warnings being treated as errors
[1239/2736] Linking static target drivers/libtmp_rte_net_fm10k.a
[1240/2736] Generating rte_net_failsafe.sym_chk with a meson_exe.py custom command
[1241/2736] Compiling C object drivers/libtmp_rte_net_i40e.a.p/net_i40e_i40e_pf.c.o
[1242/2736] Compiling C object drivers/libtmp_rte_net_i40e.a.p/net_i40e_i40e_tm.c.o
[1243/2736] Compiling C object drivers/net/i40e/base/libi40e_base.a.p/i40e_common.c.o
[1244/2736] Compiling C object drivers/libtmp_rte_net_i40e.a.p/net_i40e_i40e_ethdev_vf.c.o
[1245/2736] Compiling C object drivers/libtmp_rte_net_i40e.a.p/net_i40e_i40e_flow.c.o
[1246/2736] Compiling C object drivers/libtmp_rte_net_i40e.a.p/net_i40e_i40e_rxtx.c.o
[1247/2736] Compiling C object drivers/libtmp_rte_net_i40e.a.p/net_i40e_i40e_ethdev.c.o
ninja: build stopped: subcommand failed




*Build Failed #19:
OS: UB2004-64
Target: x86_64-native-linuxapp-icc
FAILED: drivers/libtmp_rte_net_i40e.a.p/net_i40e_i40e_fdir.c.o 
icc -Idrivers/libtmp_rte_net_i40e.a.p -Idrivers -I../drivers -Idrivers/net/i40e -I../drivers/net/i40e -Idrivers/net/i40e/base -I../drivers/net/i40e/base -Ilib/librte_ethdev -I../lib/librte_ethdev -I. -I.. -Iconfig -I../config -Ilib/librte_eal/include -I../lib/librte_eal/include -Ilib/librte_eal/linux/include -I../lib/librte_eal/linux/include -Ilib/librte_eal/x86/include -I../lib/librte_eal/x86/include -Ilib/librte_eal/common -I../lib/librte_eal/common -Ilib/librte_eal -I../lib/librte_eal -Ilib/librte_kvargs -I../lib/librte_kvargs -Ilib/librte_metrics -I../lib/librte_metrics -Ilib/librte_telemetry -I../lib/librte_telemetry -Ilib/librte_net -I../lib/librte_net -Ilib/librte_mbuf -I../lib/librte_mbuf -Ilib/librte_mempool -I../lib/librte_mempool -Ilib/librte_ring -I../lib/librte_ring -Ilib/librte_meter -I../lib/librte_meter -Idrivers/bus/pci -I../drivers/bus/pci -I../drivers/bus/pci/linux -Ilib/librte_pci -I../lib/librte_pci -Idrivers/bus/vdev -I../drivers/bus/vdev -Ilib/librte_hash -I../lib/librte_hash -Ilib/librte_rcu -I../lib/librte_rcu -pipe -D_FILE_OFFSET_BITS=64 -Wall -w3 -diag-disable:remark -Werror -O3 -include rte_config.h -Wextra -Wcast-qual -Wdeprecated -Wformat-security -Wmissing-declarations -Wmissing-prototypes -Wold-style-definition -Wpointer-arith -Wsign-compare -Wstrict-prototypes -Wundef -Wwrite-strings -Wno-missing-field-initializers -diag-disable=188 -diag-disable=2203 -diag-disable=2279 -diag-disable=2557 -diag-disable=3179 -diag-disable=3656 -D_GNU_SOURCE -fPIC -march=native -DALLOW_EXPERIMENTAL_API -DALLOW_INTERNAL_API -DPF_DRIVER -DVF_DRIVER -DINTEGRATED_VF -DX722_A0_SUPPORT -DCC_AVX2_SUPPORT -MD -MQ drivers/libtmp_rte_net_i40e.a.p/net_i40e_i40e_fdir.c.o -MF drivers/libtmp_rte_net_i40e.a.p/net_i40e_i40e_fdir.c.o.d -o drivers/libtmp_rte_net_i40e.a.p/net_i40e_i40e_fdir.c.o -c ../drivers/net/i40e/i40e_fdir.c
../drivers/net/i40e/i40e_fdir.c(1593): error: function "i40e_flow_store_flex_pit" has already been defined
  i40e_flow_store_flex_pit(struct i40e_pf *pf,
  ^

../drivers/net/i40e/i40e_fdir.c(1626): error: function "i40e_flow_set_fdir_flex_pit" has already been defined
  i40e_flow_set_fdir_flex_pit(struct i40e_pf *pf,
  ^

../drivers/net/i40e/i40e_fdir.c(1668): error: function "i40e_flow_store_flex_mask" has already been defined
  i40e_flow_store_flex_mask(struct i40e_pf *pf,
  ^

../drivers/net/i40e/i40e_fdir.c(1710): error: function "i40e_flow_set_fdir_flex_msk" has already been defined
  i40e_flow_set_fdir_flex_msk(struct i40e_pf *pf,
  ^

compilation aborted for ../drivers/net/i40e/i40e_fdir.c (code 2)
[1246/2736] Compiling C object drivers/libtmp_rte_net_i40e.a.p/net_i40e_i40e_pf.c.o
[1247/2736] Compiling C object drivers/libtmp_rte_net_i40e.a.p/net_i40e_i40e_tm.c.o
[1248/2736] Compiling C object drivers/libtmp_rte_net_i40e.a.p/net_i40e_i40e_ethdev_vf.c.o
[1249/2736] Compiling C object drivers/libtmp_rte_net_fm10k.a.p/net_fm10k_fm10k_ethdev.c.o
[1250/2736] Compiling C object drivers/libtmp_rte_net_i40e.a.p/net_i40e_i40e_flow.c.o
[1251/2736] Compiling C object drivers/libtmp_rte_net_i40e.a.p/net_i40e_rte_pmd_i40e.c.o
[1252/2736] Compiling C object drivers/libtmp_rte_net_i40e.a.p/net_i40e_i40e_rxtx.c.o
[1253/2736] Compiling C object drivers/libtmp_rte_net_i40e.a.p/net_i40e_i40e_ethdev.c.o
[1254/2736] Compiling C object drivers/libtmp_rte_crypto_octeontx.a.p/crypto_octeontx_otx_cryptodev_ops.c.o
ninja: build stopped: subcommand failed




*Build Failed #20:
OS: UB2004-64
Target: x86_64-native-linuxapp-doc
FAILED: drivers/libtmp_rte_net_i40e.a.p/net_i40e_i40e_fdir.c.o 
gcc -Idrivers/libtmp_rte_net_i40e.a.p -Idrivers -I../drivers -Idrivers/net/i40e -I../drivers/net/i40e -Idrivers/net/i40e/base -I../drivers/net/i40e/base -Ilib/librte_ethdev -I../lib/librte_ethdev -I. -I.. -Iconfig -I../config -Ilib/librte_eal/include -I../lib/librte_eal/include -Ilib/librte_eal/linux/include -I../lib/librte_eal/linux/include -Ilib/librte_eal/x86/include -I../lib/librte_eal/x86/include -Ilib/librte_eal/common -I../lib/librte_eal/common -Ilib/librte_eal -I../lib/librte_eal -Ilib/librte_kvargs -I../lib/librte_kvargs -Ilib/librte_metrics -I../lib/librte_metrics -Ilib/librte_telemetry -I../lib/librte_telemetry -Ilib/librte_net -I../lib/librte_net -Ilib/librte_mbuf -I../lib/librte_mbuf -Ilib/librte_mempool -I../lib/librte_mempool -Ilib/librte_ring -I../lib/librte_ring -Ilib/librte_meter -I../lib/librte_meter -Idrivers/bus/pci -I../drivers/bus/pci -I../drivers/bus/pci/linux -Ilib/librte_pci -I../lib/librte_pci -Idrivers/bus/vdev -I../drivers/bus/vdev -Ilib/librte_hash -I../lib/librte_hash -Ilib/librte_rcu -I../lib/librte_rcu -fdiagnostics-color=always -pipe -D_FILE_OFFSET_BITS=64 -Wall -Winvalid-pch -Werror -O3 -include rte_config.h -Wextra -Wcast-qual -Wdeprecated -Wformat-nonliteral -Wformat-security -Wmissing-declarations -Wmissing-prototypes -Wnested-externs -Wold-style-definition -Wpointer-arith -Wsign-compare -Wstrict-prototypes -Wundef -Wwrite-strings -Wno-address-of-packed-member -Wno-packed-not-aligned -Wno-missing-field-initializers -D_GNU_SOURCE -fPIC -march=native -DALLOW_EXPERIMENTAL_API -DALLOW_INTERNAL_API -Wno-format-truncation -DPF_DRIVER -DVF_DRIVER -DINTEGRATED_VF -DX722_A0_SUPPORT -DCC_AVX2_SUPPORT -MD -MQ drivers/libtmp_rte_net_i40e.a.p/net_i40e_i40e_fdir.c.o -MF drivers/libtmp_rte_net_i40e.a.p/net_i40e_i40e_fdir.c.o.d -o drivers/libtmp_rte_net_i40e.a.p/net_i40e_i40e_fdir.c.o -c ../drivers/net/i40e/i40e_fdir.c
../drivers/net/i40e/i40e_fdir.c:1593:1: error: redefinition of ‘i40e_flow_store_flex_pit’
 1593 | i40e_flow_store_flex_pit(struct i40e_pf *pf,
      | ^~~~~~~~~~~~~~~~~~~~~~~~
../drivers/net/i40e/i40e_fdir.c:1446:1: note: previous definition of ‘i40e_flow_store_flex_pit’ was here
 1446 | i40e_flow_store_flex_pit(struct i40e_pf *pf,
      | ^~~~~~~~~~~~~~~~~~~~~~~~
../drivers/net/i40e/i40e_fdir.c:1626:1: error: redefinition of ‘i40e_flow_set_fdir_flex_pit’
 1626 | i40e_flow_set_fdir_flex_pit(struct i40e_pf *pf,
      | ^~~~~~~~~~~~~~~~~~~~~~~~~~~
../drivers/net/i40e/i40e_fdir.c:1479:1: note: previous definition of ‘i40e_flow_set_fdir_flex_pit’ was here
 1479 | i40e_flow_set_fdir_flex_pit(struct i40e_pf *pf,
      | ^~~~~~~~~~~~~~~~~~~~~~~~~~~
../drivers/net/i40e/i40e_fdir.c:1668:1: error: redefinition of ‘i40e_flow_store_flex_mask’
 1668 | i40e_flow_store_flex_mask(struct i40e_pf *pf,
      | ^~~~~~~~~~~~~~~~~~~~~~~~~
../drivers/net/i40e/i40e_fdir.c:1521:1: note: previous definition of ‘i40e_flow_store_flex_mask’ was here
 1521 | i40e_flow_store_flex_mask(struct i40e_pf *pf,
      | ^~~~~~~~~~~~~~~~~~~~~~~~~
../drivers/net/i40e/i40e_fdir.c:1710:1: error: redefinition of ‘i40e_flow_set_fdir_flex_msk’
 1710 | i40e_flow_set_fdir_flex_msk(struct i40e_pf *pf,
      | ^~~~~~~~~~~~~~~~~~~~~~~~~~~
../drivers/net/i40e/i40e_fdir.c:1563:1: note: previous definition of ‘i40e_flow_set_fdir_flex_msk’ was here
 1563 | i40e_flow_set_fdir_flex_msk(struct i40e_pf *pf,
      | ^~~~~~~~~~~~~~~~~~~~~~~~~~~
../drivers/net/i40e/i40e_fdir.c:1563:1: error: ‘i40e_flow_set_fdir_flex_msk’ defined but not used [-Werror=unused-function]
../drivers/net/i40e/i40e_fdir.c:1521:1: error: ‘i40e_flow_store_flex_mask’ defined but not used [-Werror=unused-function]
 1521 | i40e_flow_store_flex_mask(struct i40e_pf *pf,
      | ^~~~~~~~~~~~~~~~~~~~~~~~~
../drivers/net/i40e/i40e_fdir.c:1479:1: error: ‘i40e_flow_set_fdir_flex_pit’ defined but not used [-Werror=unused-function]
 1479 | i40e_flow_set_fdir_flex_pit(struct i40e_pf *pf,
      | ^~~~~~~~~~~~~~~~~~~~~~~~~~~
../drivers/net/i40e/i40e_fdir.c:1446:1: error: ‘i40e_flow_store_flex_pit’ defined but not used [-Werror=unused-function]
 1446 | i40e_flow_store_flex_pit(struct i40e_pf *pf,
      | ^~~~~~~~~~~~~~~~~~~~~~~~
cc1: all warnings being treated as errors
[1228/2592] Compiling C object drivers/net/i40e/base/libi40e_base.a.p/i40e_nvm.c.o
[1229/2592] Compiling C object drivers/libtmp_rte_net_fm10k.a.p/net_fm10k_fm10k_ethdev.c.o
[1230/2592] Generating rte_net_failsafe.sym_chk with a meson_exe.py custom command
[1231/2592] Compiling C object drivers/libtmp_rte_net_i40e.a.p/net_i40e_i40e_pf.c.o
[1232/2592] Compiling C object drivers/libtmp_rte_net_i40e.a.p/net_i40e_i40e_ethdev_vf.c.o
[1233/2592] Compiling C object drivers/net/i40e/base/libi40e_base.a.p/i40e_common.c.o
[1234/2592] Compiling C object drivers/libtmp_rte_net_i40e.a.p/net_i40e_i40e_flow.c.o
[1235/2592] Compiling C object drivers/libtmp_rte_net_i40e.a.p/net_i40e_i40e_rxtx.c.o
[1236/2592] Compiling C object drivers/libtmp_rte_net_i40e.a.p/net_i40e_i40e_ethdev.c.o
ninja: build stopped: subcommand failed




*Build Failed #21:
OS: UB2010-64
Target: x86_64-native-linuxapp-gcc
FAILED: drivers/a715181@@tmp_rte_net_i40e at sta/net_i40e_i40e_fdir.c.o 
gcc -Idrivers/a715181@@tmp_rte_net_i40e at sta -Idrivers -I../drivers -Idrivers/net/i40e -I../drivers/net/i40e -Idrivers/net/i40e/base -I../drivers/net/i40e/base -Ilib/librte_ethdev -I../lib/librte_ethdev -I. -I../ -Iconfig -I../config -Ilib/librte_eal/include -I../lib/librte_eal/include -Ilib/librte_eal/linux/include -I../lib/librte_eal/linux/include -Ilib/librte_eal/x86/include -I../lib/librte_eal/x86/include -Ilib/librte_eal/common -I../lib/librte_eal/common -Ilib/librte_eal -I../lib/librte_eal -Ilib/librte_kvargs -I../lib/librte_kvargs -Ilib/librte_telemetry/../librte_metrics -I../lib/librte_telemetry/../librte_metrics -Ilib/librte_telemetry -I../lib/librte_telemetry -Ilib/librte_net -I../lib/librte_net -Ilib/librte_mbuf -I../lib/librte_mbuf -Ilib/librte_mempool -I../lib/librte_mempool -Ilib/librte_ring -I../lib/librte_ring -Ilib/librte_meter -I../lib/librte_meter -Idrivers/bus/pci -I../drivers/bus/pci -I../drivers/bus/pci/linux -Ilib/librte_pci -I../lib/librte_pci -Idrivers/bus/vdev -I../drivers/bus/vdev -Ilib/librte_hash -I../lib/librte_hash -Ilib/librte_rcu -I../lib/librte_rcu -fdiagnostics-color=always -pipe -D_FILE_OFFSET_BITS=64 -Wall -Winvalid-pch -Werror -O3 -include rte_config.h -Wextra -Wcast-qual -Wdeprecated -Wformat-nonliteral -Wformat-security -Wmissing-declarations -Wmissing-prototypes -Wnested-externs -Wold-style-definition -Wpointer-arith -Wsign-compare -Wstrict-prototypes -Wundef -Wwrite-strings -Wno-address-of-packed-member -Wno-packed-not-aligned -Wno-missing-field-initializers -Wno-zero-length-bounds -D_GNU_SOURCE -fPIC -march=native -DALLOW_EXPERIMENTAL_API -DALLOW_INTERNAL_API -Wno-format-truncation -DPF_DRIVER -DVF_DRIVER -DINTEGRATED_VF -DX722_A0_SUPPORT -DCC_AVX2_SUPPORT -MD -MQ 'drivers/a715181@@tmp_rte_net_i40e at sta/net_i40e_i40e_fdir.c.o' -MF 'drivers/a715181@@tmp_rte_net_i40e at sta/net_i40e_i40e_fdir.c.o.d' -o 'drivers/a715181@@tmp_rte_net_i40e at sta/net_i40e_i40e_fdir.c.o' -c ../drivers/net/i40e/i40e_fdir.c
../drivers/net/i40e/i40e_fdir.c:1593:1: error: redefinition of ‘i40e_flow_store_flex_pit’
 1593 | i40e_flow_store_flex_pit(struct i40e_pf *pf,
      | ^~~~~~~~~~~~~~~~~~~~~~~~
../drivers/net/i40e/i40e_fdir.c:1446:1: note: previous definition of ‘i40e_flow_store_flex_pit’ was here
 1446 | i40e_flow_store_flex_pit(struct i40e_pf *pf,
      | ^~~~~~~~~~~~~~~~~~~~~~~~
../drivers/net/i40e/i40e_fdir.c:1626:1: error: redefinition of ‘i40e_flow_set_fdir_flex_pit’
 1626 | i40e_flow_set_fdir_flex_pit(struct i40e_pf *pf,
      | ^~~~~~~~~~~~~~~~~~~~~~~~~~~
../drivers/net/i40e/i40e_fdir.c:1479:1: note: previous definition of ‘i40e_flow_set_fdir_flex_pit’ was here
 1479 | i40e_flow_set_fdir_flex_pit(struct i40e_pf *pf,
      | ^~~~~~~~~~~~~~~~~~~~~~~~~~~
../drivers/net/i40e/i40e_fdir.c:1668:1: error: redefinition of ‘i40e_flow_store_flex_mask’
 1668 | i40e_flow_store_flex_mask(struct i40e_pf *pf,
      | ^~~~~~~~~~~~~~~~~~~~~~~~~
../drivers/net/i40e/i40e_fdir.c:1521:1: note: previous definition of ‘i40e_flow_store_flex_mask’ was here
 1521 | i40e_flow_store_flex_mask(struct i40e_pf *pf,
      | ^~~~~~~~~~~~~~~~~~~~~~~~~
../drivers/net/i40e/i40e_fdir.c:1710:1: error: redefinition of ‘i40e_flow_set_fdir_flex_msk’
 1710 | i40e_flow_set_fdir_flex_msk(struct i40e_pf *pf,
      | ^~~~~~~~~~~~~~~~~~~~~~~~~~~
../drivers/net/i40e/i40e_fdir.c:1563:1: note: previous definition of ‘i40e_flow_set_fdir_flex_msk’ was here
 1563 | i40e_flow_set_fdir_flex_msk(struct i40e_pf *pf,
      | ^~~~~~~~~~~~~~~~~~~~~~~~~~~
../drivers/net/i40e/i40e_fdir.c:1563:1: error: ‘i40e_flow_set_fdir_flex_msk’ defined but not used [-Werror=unused-function]
../drivers/net/i40e/i40e_fdir.c:1521:1: error: ‘i40e_flow_store_flex_mask’ defined but not used [-Werror=unused-function]
 1521 | i40e_flow_store_flex_mask(struct i40e_pf *pf,
      | ^~~~~~~~~~~~~~~~~~~~~~~~~
../drivers/net/i40e/i40e_fdir.c:1479:1: error: ‘i40e_flow_set_fdir_flex_pit’ defined but not used [-Werror=unused-function]
 1479 | i40e_flow_set_fdir_flex_pit(struct i40e_pf *pf,
      | ^~~~~~~~~~~~~~~~~~~~~~~~~~~
../drivers/net/i40e/i40e_fdir.c:1446:1: error: ‘i40e_flow_store_flex_pit’ defined but not used [-Werror=unused-function]
 1446 | i40e_flow_store_flex_pit(struct i40e_pf *pf,
      | ^~~~~~~~~~~~~~~~~~~~~~~~
cc1: all warnings being treated as errors
[1251/2739] Compiling C object 'drivers/a715181@@tmp_rte_net_i40e at sta/net_i40e_i40e_pf.c.o'.
[1252/2739] Compiling C object 'drivers/net/i40e/base/3c1f984@@i40e_base at sta/i40e_common.c.o'.
[1253/2739] Generating rte_net_failsafe.sym_chk with a meson_exe.py custom command.
[1254/2739] Generating rte_net_fm10k.sym_chk with a meson_exe.py custom command.
[1255/2739] Compiling C object 'drivers/a715181@@tmp_rte_net_i40e at sta/net_i40e_i40e_ethdev_vf.c.o'.
[1256/2739] Compiling C object 'drivers/a715181@@tmp_rte_net_i40e at sta/net_i40e_i40e_tm.c.o'.
[1257/2739] Compiling C object 'drivers/a715181@@tmp_rte_net_i40e at sta/net_i40e_i40e_flow.c.o'.
[1258/2739] Compiling C object 'drivers/a715181@@tmp_rte_net_i40e at sta/net_i40e_i40e_rxtx.c.o'.
[1259/2739] Compiling C object 'drivers/a715181@@tmp_rte_net_i40e at sta/net_i40e_i40e_ethdev.c.o'.
ninja: build stopped: subcommand failed


DPDK STV team


More information about the test-report mailing list