[dpdk-test-report] |FAILURE| pw(77037) [v2, 2/2] doc: add l3fwd-regex application user guide

sys_stv at intel.com sys_stv at intel.com
Mon Sep 14 07:31:04 CEST 2020


Test-Label: Intel-compilation
Test-Status: FAILURE
http://dpdk.org/patch/77037

_Compilation issues_

Submitter: Guy Kaneti <guyk at marvell.com>
Date: 2020-09-09 12:08:53
Reply_mail: 20200909120853.11715-3-guyk at marvell.com

DPDK git baseline: Repo:dpdk, CommitID: 25efc61539603dbe634cd1a5b84c956c55893e41


Build Summary: 22 Builds Done, 21 Successful, 1 Failures, 0 Blocked

+----------------+------------+--------------+------------+------------+-----------+----------+
| os             | gcc-static | clang-static | icc-static | gcc-shared | gcc-debug | document |
+----------------+------------+--------------+------------+------------+-----------+----------+
| CENTOS82-64    | pass       | pass         | pass       | pass       | pass      |          |
| RHEL82-64      | pass       |              |            |            |           |          |
| UB1804-64      | pass       |              |            |            |           |          |
| FC32-64        | pass       | pass         |            |            |           |          |
| CENTOS77-64    | pass       |              |            |            |           |          |
| UB2004-64      | pass       | pass         | pass       |            |           | pass     |
| WIN10-64       |            | pass         |            |            |           |          |
| UB2004-32      | FAIL       |              |            |            |           |          |
| FreeBSD1201-64 | pass       | pass         |            | pass       | pass      |          |
| SUSE15-64      | pass       | pass         |            |            |           |          |
+----------------+------------+--------------+------------+------------+-----------+----------+
Test environment and configuration as below:
** Meson build **



OS: CENTOS82-64
	Kernel Version: 4.18.0-193.el8.x86_64
	CPU info: Intel(R) Xeon(R) Platinum 8280M CPU @ 2.70GHz
	GCC Version: gcc (GCC) 8.3.1 20191121 (Red Hat 8.3.1-5)
	Clang Version: 9.0.1 (Red Hat 9.0.1-2.module_el8.2.0+309+0c7b6b03)
	x86_64-gcc-static
	x86_64-clang-static
	x86_64-icc-static
	x86_64-gcc-shared
	x86_64-gcc-debug


OS: RHEL82-64
	Kernel Version: 4.18.0-193.el8.x86_64
	CPU info: Intel(R) Xeon(R) Platinum 8280M CPU @ 2.70GHz
	GCC Version: gcc (GCC) 8.3.1 20191121 (Red Hat 8.3.1-5)
	Clang Version: 8.0.1 (Red Hat 8.0.1-1.module_el8.1.0+215+a01033fb)
	x86_64-gcc-static


OS: UB1804-64
	Kernel Version: 5.3.0-59-generic
	CPU info: Intel(R) Xeon(R) Platinum 8180 CPU @ 2.50GHz
	GCC Version: gcc (Ubuntu 8.4.0-1ubuntu1~18.04) 8.4.0
	Clang Version: 6.0.0-1ubuntu2 (tags/RELEASE_600/final)
	x86_64-gcc-static


OS: FC32-64
	Kernel Version: 5.6.0-0.rc7.git0.2.fc32.x86_64
	CPU info: Intel(R) Xeon(R) Platinum 8280M CPU @ 2.70GHz
	GCC Version: gcc (GCC) 10.0.1 20200311 (Red Hat 10.0.1-0.9)
	Clang Version: 10.0.0 (Fedora 10.0.0-0.3.rc4.fc32)
	x86_64-gcc-static
	x86_64-clang-static


OS: CENTOS77-64
	Kernel Version: 3.10.0-1062.9.1.el7.x86_64
	CPU info: Intel(R) Xeon(R) Platinum 8280M CPU @ 2.70GHz
	GCC Version: gcc (GCC) 4.8.5 20150623 (Red Hat 4.8.5-39)
	Clang Version: 3.4.2 (tags/RELEASE_34/dot2-final)
	x86_64-gcc-static


OS: UB2004-64
	Kernel Version: 5.4.0-26-generic
	CPU info: Intel(R) Xeon(R) Platinum 8180 CPU @ 2.50GHz
	GCC Version: gcc (Ubuntu 10-20200416-0ubuntu1) 10.0.1 20200416 (experimental) [master revision 3c3f12e2a76:dcee354ce56:44b326839d864fc10c459916abcc97f35a9ac3de]
	Clang Version: 10.0.0-4ubuntu1
	x86_64-clang-static
	x86_64-gcc-static
	x86_64-icc-static
	x86_64-gcc-doc


OS: WIN10-64
	Kernel Version: N/A
	CPU info: N/A
	GCC Version: N/A
	Clang Version: Clang 8.0.0
	x86_64-windows-clang


OS: UB2004-32
	Kernel Version: 5.4.0-26-generic
	CPU info: Intel(R) Xeon(R) Platinum 8180 CPU @ 2.50GHz
	GCC Version: gcc (Ubuntu 9.3.0-10ubuntu2) 9.3.0
	Clang Version: 10.0.0-4ubuntu1
	i686-gcc-static


OS: FreeBSD1201-64
	Kernel Version: 12.1-RELEASE
	CPU info: Intel(R) Xeon(R) CPU E5-2699 v3 @ 2.30GHz (2294.74-MHz K8-class CPU)
	GCC Version: gcc (FreeBSD Ports Collection) 9.2.0
	Clang Version: 8.0.1 (tags/RELEASE_801/final 366581) (based on LLVM 8.0.1)
	x86_64-gcc-static
	x86_64-clang-static
	x86_64-gcc-shared
	x86_64-gcc-debug


OS: SUSE15-64
	Kernel Version: 4.12.14-lp150.11-default
	CPU info: Intel(R) Xeon(R) CPU E5-2699 v4 @ 2.20GHz
	GCC Version: gcc (SUSE Linux) 7.3.1 20180323 [gcc-7-branch revision 258812]
	Clang Version: 5.0.1 (tags/RELEASE_501/final 312548)
	x86_64-clang-static
	x86_64-gcc-static



*Build Failed #1:
OS: UB2004-32
Target: i686-gcc-static
FAILED: examples/c590b3c@@dpdk-l3fwd-regex at exe/l3fwd-regex_l3fwd_regex.c.o 
gcc -Iexamples/c590b3c@@dpdk-l3fwd-regex at exe -Iexamples -I../examples -Iexamples/l3fwd-regex -I../examples/l3fwd-regex -I. -I../ -Iconfig -I../config -Ilib/librte_eal/include -I../lib/librte_eal/include -Ilib/librte_eal/linux/include -I../lib/librte_eal/linux/include -Ilib/librte_eal/x86/include -I../lib/librte_eal/x86/include -Ilib/librte_eal/common -I../lib/librte_eal/common -Ilib/librte_eal -I../lib/librte_eal -Ilib/librte_kvargs -I../lib/librte_kvargs -Ilib/librte_telemetry/../librte_metrics -I../lib/librte_telemetry/../librte_metrics -Ilib/librte_telemetry -I../lib/librte_telemetry -Ilib/librte_mempool -I../lib/librte_mempool -Ilib/librte_ring -I../lib/librte_ring -Ilib/librte_net -I../lib/librte_net -Ilib/librte_mbuf -I../lib/librte_mbuf -Ilib/librte_ethdev -I../lib/librte_ethdev -Ilib/librte_meter -I../lib/librte_meter -Ilib/librte_cmdline -I../lib/librte_cmdline -Ilib/librte_lpm -I../lib/librte_lpm -Ilib/librte_hash -I../lib/librte_hash -Ilib/librte_rcu -I../lib/librte_rcu -Ilib/librte_regexdev -I../lib/librte_regexdev -fdiagnostics-color=always -pipe -D_FILE_OFFSET_BITS=64 -Wall -Winvalid-pch -Werror -O3 -include rte_config.h -Wextra -Wcast-qual -Wdeprecated -Wformat-nonliteral -Wformat-security -Wmissing-declarations -Wmissing-prototypes -Wnested-externs -Wold-style-definition -Wpointer-arith -Wsign-compare -Wstrict-prototypes -Wundef -Wwrite-strings -Wno-address-of-packed-member -Wno-packed-not-aligned -Wno-missing-field-initializers -Wno-pointer-to-int-cast -D_GNU_SOURCE -m32 -march=native -Wno-format-truncation -DALLOW_EXPERIMENTAL_API -MD -MQ 'examples/c590b3c@@dpdk-l3fwd-regex at exe/l3fwd-regex_l3fwd_regex.c.o' -MF 'examples/c590b3c@@dpdk-l3fwd-regex at exe/l3fwd-regex_l3fwd_regex.c.o.d' -o 'examples/c590b3c@@dpdk-l3fwd-regex at exe/l3fwd-regex_l3fwd_regex.c.o' -c ../examples/l3fwd-regex/l3fwd_regex.c
../examples/l3fwd-regex/l3fwd_regex.c: In function ‘regex_read_rule_db_file’:
../examples/l3fwd-regex/l3fwd_regex.c:139:15: error: comparison of integer expressions of different signedness: ‘uint32_t’ {aka ‘unsigned int’} and ‘long int’ [-Werror=sign-compare]
  139 |   if (new_len != buf_len)
      |               ^~
../examples/l3fwd-regex/l3fwd_regex.c: In function ‘regex_dev_init’:
../examples/l3fwd-regex/l3fwd_regex.c:405:35: error: format ‘%lx’ expects argument of type ‘long unsigned int’, but argument 2 has type ‘uint64_t’ {aka ‘long long unsigned int’} [-Werror=format=]
  405 |  printf("rule_flags           0x%lx\n", dev_info.rule_flags);
      |                                 ~~^     ~~~~~~~~~~~~~~~~~~~
      |                                   |             |
      |                                   |             uint64_t {aka long long unsigned int}
      |                                   long unsigned int
      |                                 %llx
cc1: all warnings being treated as errors
[2205/2332] Compiling C object 'examples/c590b3c@@dpdk-l3fwd at exe/l3fwd_l3fwd_event_generic.c.o'.
[2206/2332] Compiling C object 'examples/c590b3c@@dpdk-l3fwd at exe/l3fwd_main.c.o'.
[2207/2332] Compiling C object 'examples/c590b3c@@dpdk-l3fwd at exe/l3fwd_l3fwd_em.c.o'.
[2208/2332] Compiling C object 'examples/c590b3c@@dpdk-l3fwd-acl at exe/l3fwd-acl_main.c.o'.
[2209/2332] Compiling C object 'app/test/3062f5d@@dpdk-test at exe/test_ring_perf.c.o'.
[2210/2332] Compiling C object 'examples/c590b3c@@dpdk-l3fwd-power at exe/l3fwd-power_main.c.o'.
[2211/2332] Compiling C object 'app/test/3062f5d@@dpdk-test at exe/test_ring.c.o'.
[2212/2332] Compiling C object 'drivers/a715181@@tmp_rte_pmd_octeontx2_event at sta/event_octeontx2_otx2_worker.c.o'.
[2213/2332] Compiling C object 'drivers/a715181@@tmp_rte_pmd_octeontx2_event at sta/event_octeontx2_otx2_worker_dual.c.o'.
ninja: build stopped: subcommand failed


DPDK STV team


More information about the test-report mailing list