[dpdk-test-report] |FAILURE| pw78673 [PATCH] eal/windows: Switched to an external pthreads library, pulled in as a meson subproject

dpdklab at iol.unh.edu dpdklab at iol.unh.edu
Thu Sep 24 13:33:04 CEST 2020

Test-Label: Performance-Testing
Test-Status: FAILURE

_build patch failure_

Submitter: John Alexander <john.alexander at datapath.co.uk>
Date: Thursday, September 24 2020 11:12:15 
Applied on: CommitID:f0f5d844d138a1d6564ffe4eb0c56bf41a7cf7c3
Apply patch set 78673 failed:

ninja: error: loading 'build.ninja': No such file or directory


UNH-IOL DPDK Community Lab

More information about the test-report mailing list