[dpdk-test-report] |FAILURE| pw(87881) [RFC] pflock: add implementation of phase-fair locks

sys_stv at intel.com sys_stv at intel.com
Fri Feb 12 03:04:33 CET 2021


Test-Label: Intel-compilation
Test-Status: FAILURE
http://dpdk.org/patch/87881

_Compilation issues_

Submitter: Stephen Hemminger <stephen at networkplumber.org>
Date: 2021-02-12 01:38:38
Reply_mail: 20210212013838.312623-1-sthemmin at microsoft.com

DPDK git baseline: Repo:dpdk, CommitID: 9c345301722160eeb345c3363fa0de1520646465


Meson Build Summary: 22 Builds Done, 14 Successful, 8 Failures, 0 Blocked

+------------------+------------+--------------+------------+------------+-----------+----------+
| os               | gcc-static | clang-static | icc-static | gcc-shared | gcc-debug | document |
+------------------+------------+--------------+------------+------------+-----------+----------+
| UB2004-64        | pass       | FAIL         | FAIL       |            |           | FAIL     |
| RHEL83-64        | pass       |              |            |            |           |          |
| FC33-64          | pass       | FAIL         |            |            |           |          |
| CentOsStream8-64 | pass       |              |            |            |           |          |
| UB2010-64        | pass       |              |            |            |           |          |
| WIN10-64         |            | pass         |            |            |           |          |
| UB2004-32        | pass       |              |            |            |           |          |
| CENTOS83-64      | pass       | FAIL         | FAIL       | pass       | pass      |          |
| FreeBSD1201-64   | pass       | FAIL         |            | pass       | pass      |          |
| SUSE15-64        | pass       | FAIL         |            |            |           |          |
+------------------+------------+--------------+------------+------------+-----------+----------+
Test environment and configuration as below:


OS: UB2004-64
	Kernel Version: 5.6.0-050600-generic
	GCC Version: gcc (Ubuntu 10-20200416-0ubuntu1) 10.0.1 20200416 (experimental) [master revision 3c3f12e2a76:dcee354ce56:44b326839d864fc10c459916abcc97f35a9ac3de]
	Clang Version: 10.0.0-4ubuntu1
	x86_64-native-linuxapp-clang
	x86_64-native-linuxapp-gcc
	x86_64-native-linuxapp-icc
	x86_64-native-linuxapp-doc

OS: RHEL83-64
	Kernel Version: 4.18.0-240.el8.x86_64
	GCC Version: gcc (GCC) 8.3.1 20191121 (Red Hat 8.3.1-5)
	Clang Version: 10.0.1 (Red Hat 10.0.1-1.module+el8.3.0+7459+90c24896)
	x86_64-native-linuxapp-gcc

OS: FC33-64
	Kernel Version: 5.8.16-300.fc33.x86_64
	GCC Version: gcc (GCC) 10.2.1 20201005 (Red Hat 10.2.1-5)
	Clang Version: 11.0.0 (Fedora 11.0.0-1.fc33)
	x86_64-native-linuxapp-gcc
	x86_64-native-linuxapp-clang

OS: CentOsStream8-64
	Kernel Version: 4.18.0-257.el8.x86_64
	GCC Version: gcc (GCC) 8.4.1 20200928 (Red Hat 8.4.1-1)
	Clang Version: 11.0.0 (Red Hat 11.0.0-0.2.rc2.module_el8.4.0+533+50191577)
	x86_64-native-linuxapp-gcc

OS: UB2010-64
	Kernel Version: 5.8.0-25-generic
	GCC Version: gcc (Ubuntu 10.2.0-13ubuntu1) 10.2.0
	Clang Version: 11.0.0-2
	x86_64-native-linuxapp-gcc

OS: WIN10-64
	Kernel Version: N/A
	GCC Version: N/A
	Clang Version: Clang 8.0.0
	x86_64-windows-clang

OS: UB2004-32
	Kernel Version: 5.6.0-050600-generic
	GCC Version: gcc (Ubuntu 9.3.0-10ubuntu2) 9.3.0
	Clang Version: 10.0.0-4ubuntu1
	i686-native-linuxapp-gcc

OS: CENTOS83-64
	Kernel Version: 4.18.0-240.1.1.el8_3.x86_64
	GCC Version: gcc (GCC) 8.3.1 20191121 (Red Hat 8.3.1-5)
	Clang Version: 10.0.1 (Red Hat 10.0.1-1.module_el8.3.0+467+cb298d5b)
	x86_64-native-linuxapp-gcc
	x86_64-native-linuxapp-clang
	x86_64-native-linuxapp-icc
	x86_64-native-linuxapp-gcc+shared
	x86_64-native-linuxapp-gcc+debug

OS: FreeBSD1201-64
	Kernel Version: 12.1-RELEASE
	GCC Version: gcc (FreeBSD Ports Collection) 9.2.0
	Clang Version: 8.0.1 (tags/RELEASE_801/final 366581) (based on LLVM 8.0.1)
	x86_64-native-bsdapp-gcc
	x86_64-native-bsdapp-clang
	x86_64-native-bsdapp-gcc+shared
	x86_64-native-bsdapp-gcc+debug

OS: SUSE15-64
	Kernel Version: 5.3.18-lp152.57-default
	GCC Version: gcc (SUSE Linux) 7.5.0
	Clang Version: 9.0.1
	x86_64-native-linuxapp-clang
	x86_64-native-linuxapp-gcc



*Build Failed #1:
OS: CENTOS83-64
Target: x86_64-native-linuxapp-clang
FAILED: app/test/dpdk-test.p/test_pflock.c.o 
clang -Iapp/test/dpdk-test.p -Iapp/test -I../app/test -Ilib/librte_acl -I../lib/librte_acl -I. -I.. -Iconfig -I../config -Ilib/librte_eal/include -I../lib/librte_eal/include -Ilib/librte_eal/linux/include -I../lib/librte_eal/linux/include -Ilib/librte_eal/x86/include -I../lib/librte_eal/x86/include -Ilib/librte_eal/common -I../lib/librte_eal/common -Ilib/librte_eal -I../lib/librte_eal -Ilib/librte_kvargs -I../lib/librte_kvargs -Ilib/librte_metrics -I../lib/librte_metrics -Ilib/librte_telemetry -I../lib/librte_telemetry -Idrivers/bus/pci -I../drivers/bus/pci -I../drivers/bus/pci/linux -Ilib/librte_pci -I../lib/librte_pci -Idrivers/bus/vdev -I../drivers/bus/vdev -Ilib/librte_bitratestats -I../lib/librte_bitratestats -Ilib/librte_ethdev -I../lib/librte_ethdev -Ilib/librte_net -I../lib/librte_net -Ilib/librte_mbuf -I../lib/librte_mbuf -Ilib/librte_mempool -I../lib/librte_mempool -Ilib/librte_ring -I../lib/librte_ring -Ilib/librte_meter -I../lib/librte_meter -Ilib/librte_bpf -I../lib/librte_bpf -Ilib/librte_cfgfile -I../lib/librte_cfgfile -Ilib/librte_cmdline -I../lib/librte_cmdline -Ilib/librte_cryptodev -I../lib/librte_cryptodev -Ilib/librte_rcu -I../lib/librte_rcu -Ilib/librte_distributor -I../lib/librte_distributor -Ilib/librte_efd -I../lib/librte_efd -Ilib/librte_hash -I../lib/librte_hash -Ilib/librte_eventdev -I../lib/librte_eventdev -Ilib/librte_timer -I../lib/librte_timer -Ilib/librte_fib -I../lib/librte_fib -Ilib/librte_rib -I../lib/librte_rib -Ilib/librte_flow_classify -I../lib/librte_flow_classify -Ilib/librte_table -I../lib/librte_table -Ilib/librte_port -I../lib/librte_port -Ilib/librte_sched -I../lib/librte_sched -Ilib/librte_ip_frag -I../lib/librte_ip_frag -Ilib/librte_kni -I../lib/librte_kni -Ilib/librte_lpm -I../lib/librte_lpm -Ilib/librte_graph -I../lib/librte_graph -Ilib/librte_ipsec -I../lib/librte_ipsec -Ilib/librte_security -I../lib/librte_security -Ilib/librte_latencystats -I../lib/librte_latencystats -Ilib/librte_member -I../lib/librte_member -Ilib/librte_node -I../lib/librte_node -Ilib/librte_pipeline -I../lib/librte_pipeline -Ilib/librte_rawdev -I../lib/librte_rawdev -Ilib/librte_reorder -I../lib/librte_reorder -Ilib/librte_stack -I../lib/librte_stack -Idrivers/mempool/ring -I../drivers/mempool/ring -Idrivers/mempool/stack -I../drivers/mempool/stack -Idrivers/event/skeleton -I../drivers/event/skeleton -Idrivers/net/bonding -I../drivers/net/bonding -Idrivers/net/ring -I../drivers/net/ring -Ilib/librte_power -I../lib/librte_power -Ilib/librte_pdump -I../lib/librte_pdump -Ilib/librte_compressdev -I../lib/librte_compressdev -Idrivers/crypto/scheduler -I../drivers/crypto/scheduler -Xclang -fcolor-diagnostics -pipe -D_FILE_OFFSET_BITS=64 -Wall -Winvalid-pch -Werror -O3 -include rte_config.h -Wextra -Wcast-qual -Wdeprecated -Wformat -Wformat-nonliteral -Wformat-security -Wmissing-declarations -Wmissing-prototypes -Wnested-externs -Wold-style-definition -Wpointer-arith -Wsign-compare -Wstrict-prototypes -Wundef -Wwrite-strings -Wno-address-of-packed-member -Wno-missing-field-initializers -march=native -DALLOW_EXPERIMENTAL_API -D_GNU_SOURCE -fno-strict-aliasing -DALLOW_INTERNAL_API -MD -MQ app/test/dpdk-test.p/test_pflock.c.o -MF app/test/dpdk-test.p/test_pflock.c.o.d -o app/test/dpdk-test.p/test_pflock.c.o -c ../app/test/test_pflock.c
In file included from ../app/test/test_pflock.c:17:
In file included from ../lib/librte_eal/x86/include/rte_pflock.h:12:
../lib/librte_eal/include/generic/rte_pflock.h:215:33: error: implicit conversion from 'unsigned int' to 'uint16_t' (aka 'unsigned short') changes value from 4294967280 to 65520 [-Werror,-Wconstant-conversion]
        __atomic_fetch_and(&pf->rd.in, RTE_PFLOCK_LSB, __ATOMIC_RELEASE);
        ~~~~~~~~~~~~~~~~~~             ^~~~~~~~~~~~~~
../lib/librte_eal/include/generic/rte_pflock.h:57:26: note: expanded from macro 'RTE_PFLOCK_LSB'
#define RTE_PFLOCK_LSB   0xFFFFFFF0
                         ^~~~~~~~~~
1 error generated.
[2544/2830] Compiling C object app/test/dpdk-test.p/test_mcslock.c.o
[2545/2830] Compiling C object app/test/dpdk-test.p/test_member_perf.c.o
[2546/2830] Compiling C object app/test/dpdk-test.p/test_mempool_perf.c.o
[2547/2830] Compiling C object app/test/dpdk-test.p/test_mp_secondary.c.o
[2548/2830] Compiling C object app/test/dpdk-test.p/test_pmd_perf.c.o
[2549/2830] Compiling C object app/test/dpdk-test.p/test_mbuf.c.o
[2550/2830] Compiling C object app/test/dpdk-test.p/test_memcpy_perf.c.o
[2551/2830] Compiling C object drivers/libtmp_rte_event_octeontx2.a.p/event_octeontx2_otx2_worker_dual.c.o
[2552/2830] Compiling C object drivers/libtmp_rte_event_octeontx2.a.p/event_octeontx2_otx2_worker.c.o
ninja: build stopped




*Build Failed #2:
OS: CENTOS83-64
Target: x86_64-native-linuxapp-icc
FAILED: app/test/dpdk-test.p/test_pflock.c.o 
icc -Iapp/test/dpdk-test.p -Iapp/test -I../app/test -Ilib/librte_acl -I../lib/librte_acl -I. -I.. -Iconfig -I../config -Ilib/librte_eal/include -I../lib/librte_eal/include -Ilib/librte_eal/linux/include -I../lib/librte_eal/linux/include -Ilib/librte_eal/x86/include -I../lib/librte_eal/x86/include -Ilib/librte_eal/common -I../lib/librte_eal/common -Ilib/librte_eal -I../lib/librte_eal -Ilib/librte_kvargs -I../lib/librte_kvargs -Ilib/librte_metrics -I../lib/librte_metrics -Ilib/librte_telemetry -I../lib/librte_telemetry -Idrivers/bus/pci -I../drivers/bus/pci -I../drivers/bus/pci/linux -Ilib/librte_pci -I../lib/librte_pci -Idrivers/bus/vdev -I../drivers/bus/vdev -Ilib/librte_bitratestats -I../lib/librte_bitratestats -Ilib/librte_ethdev -I../lib/librte_ethdev -Ilib/librte_net -I../lib/librte_net -Ilib/librte_mbuf -I../lib/librte_mbuf -Ilib/librte_mempool -I../lib/librte_mempool -Ilib/librte_ring -I../lib/librte_ring -Ilib/librte_meter -I../lib/librte_meter -Ilib/librte_bpf -I../lib/librte_bpf -Ilib/librte_cfgfile -I../lib/librte_cfgfile -Ilib/librte_cmdline -I../lib/librte_cmdline -Ilib/librte_cryptodev -I../lib/librte_cryptodev -Ilib/librte_rcu -I../lib/librte_rcu -Ilib/librte_distributor -I../lib/librte_distributor -Ilib/librte_efd -I../lib/librte_efd -Ilib/librte_hash -I../lib/librte_hash -Ilib/librte_eventdev -I../lib/librte_eventdev -Ilib/librte_timer -I../lib/librte_timer -Ilib/librte_fib -I../lib/librte_fib -Ilib/librte_rib -I../lib/librte_rib -Ilib/librte_flow_classify -I../lib/librte_flow_classify -Ilib/librte_table -I../lib/librte_table -Ilib/librte_port -I../lib/librte_port -Ilib/librte_sched -I../lib/librte_sched -Ilib/librte_ip_frag -I../lib/librte_ip_frag -Ilib/librte_kni -I../lib/librte_kni -Ilib/librte_lpm -I../lib/librte_lpm -Ilib/librte_graph -I../lib/librte_graph -Ilib/librte_ipsec -I../lib/librte_ipsec -Ilib/librte_security -I../lib/librte_security -Ilib/librte_latencystats -I../lib/librte_latencystats -Ilib/librte_member -I../lib/librte_member -Ilib/librte_node -I../lib/librte_node -Ilib/librte_pipeline -I../lib/librte_pipeline -Ilib/librte_rawdev -I../lib/librte_rawdev -Ilib/librte_reorder -I../lib/librte_reorder -Ilib/librte_stack -I../lib/librte_stack -Idrivers/mempool/ring -I../drivers/mempool/ring -Idrivers/mempool/stack -I../drivers/mempool/stack -Idrivers/event/skeleton -I../drivers/event/skeleton -Idrivers/net/bonding -I../drivers/net/bonding -Idrivers/net/ring -I../drivers/net/ring -Ilib/librte_power -I../lib/librte_power -Ilib/librte_pdump -I../lib/librte_pdump -Ilib/librte_compressdev -I../lib/librte_compressdev -Idrivers/crypto/scheduler -I../drivers/crypto/scheduler -pipe -D_FILE_OFFSET_BITS=64 -Wall -w3 -diag-disable:remark -Werror -O3 -include rte_config.h -Wextra -Wcast-qual -Wdeprecated -Wformat -Wformat-security -Wmissing-declarations -Wmissing-prototypes -Wold-style-definition -Wpointer-arith -Wsign-compare -Wstrict-prototypes -Wundef -Wwrite-strings -Wno-missing-field-initializers -diag-disable=181 -diag-disable=188 -diag-disable=2203 -diag-disable=2279 -diag-disable=2557 -diag-disable=3179 -diag-disable=3656 -march=native -DALLOW_EXPERIMENTAL_API -D_GNU_SOURCE -fno-strict-aliasing -DALLOW_INTERNAL_API -MD -MQ app/test/dpdk-test.p/test_pflock.c.o -MF app/test/dpdk-test.p/test_pflock.c.o.d -o app/test/dpdk-test.p/test_pflock.c.o -c ../app/test/test_pflock.c
In file included from ../lib/librte_eal/x86/include/rte_pflock.h(12),
                 from ../app/test/test_pflock.c(17):
../lib/librte_eal/include/generic/rte_pflock.h(215): error #69: integer conversion resulted in truncation
  	__atomic_fetch_and(&pf->rd.in, RTE_PFLOCK_LSB, __ATOMIC_RELEASE);
  	                               ^

compilation aborted for ../app/test/test_pflock.c (code 2)
[2543/2830] Compiling C object app/test/dpdk-test.p/test_power.c.o
[2544/2830] Compiling C object app/test/dpdk-test.p/test_per_lcore.c.o
[2545/2830] Compiling C object app/test/dpdk-test.p/test_power_cpufreq.c.o
[2546/2830] Compiling C object app/test/dpdk-test.p/test_mp_secondary.c.o
[2547/2830] Compiling C object app/test/dpdk-test.p/test_ipsec.c.o
[2548/2830] Compiling C object app/test/dpdk-test.p/test_pmd_perf.c.o
[2549/2830] Compiling C object app/test/dpdk-test.p/test_mbuf.c.o
[2550/2830] Compiling C object app/test/dpdk-test.p/test_cryptodev.c.o
[2551/2830] Compiling C object app/test/dpdk-test.p/test_memcpy_perf.c.o
[2552/2830] Compiling C object drivers/libtmp_rte_event_octeontx2.a.p/event_octeontx2_otx2_worker_dual.c.o
[2553/2830] Compiling C object drivers/libtmp_rte_event_octeontx2.a.p/event_octeontx2_otx2_worker.c.o
ninja: build stopped




*Build Failed #3:
OS: FC33-64
Target: x86_64-native-linuxapp-clang
FAILED: app/test/dpdk-test.p/test_pflock.c.o 
clang -Iapp/test/dpdk-test.p -Iapp/test -I../app/test -Ilib/librte_acl -I../lib/librte_acl -I. -I.. -Iconfig -I../config -Ilib/librte_eal/include -I../lib/librte_eal/include -Ilib/librte_eal/linux/include -I../lib/librte_eal/linux/include -Ilib/librte_eal/x86/include -I../lib/librte_eal/x86/include -Ilib/librte_eal/common -I../lib/librte_eal/common -Ilib/librte_eal -I../lib/librte_eal -Ilib/librte_kvargs -I../lib/librte_kvargs -Ilib/librte_metrics -I../lib/librte_metrics -Ilib/librte_telemetry -I../lib/librte_telemetry -Idrivers/bus/pci -I../drivers/bus/pci -I../drivers/bus/pci/linux -Ilib/librte_pci -I../lib/librte_pci -Idrivers/bus/vdev -I../drivers/bus/vdev -Ilib/librte_bitratestats -I../lib/librte_bitratestats -Ilib/librte_ethdev -I../lib/librte_ethdev -Ilib/librte_net -I../lib/librte_net -Ilib/librte_mbuf -I../lib/librte_mbuf -Ilib/librte_mempool -I../lib/librte_mempool -Ilib/librte_ring -I../lib/librte_ring -Ilib/librte_meter -I../lib/librte_meter -Ilib/librte_bpf -I../lib/librte_bpf -Ilib/librte_cfgfile -I../lib/librte_cfgfile -Ilib/librte_cmdline -I../lib/librte_cmdline -Ilib/librte_cryptodev -I../lib/librte_cryptodev -Ilib/librte_rcu -I../lib/librte_rcu -Ilib/librte_distributor -I../lib/librte_distributor -Ilib/librte_efd -I../lib/librte_efd -Ilib/librte_hash -I../lib/librte_hash -Ilib/librte_eventdev -I../lib/librte_eventdev -Ilib/librte_timer -I../lib/librte_timer -Ilib/librte_fib -I../lib/librte_fib -Ilib/librte_rib -I../lib/librte_rib -Ilib/librte_flow_classify -I../lib/librte_flow_classify -Ilib/librte_table -I../lib/librte_table -Ilib/librte_port -I../lib/librte_port -Ilib/librte_sched -I../lib/librte_sched -Ilib/librte_ip_frag -I../lib/librte_ip_frag -Ilib/librte_kni -I../lib/librte_kni -Ilib/librte_lpm -I../lib/librte_lpm -Ilib/librte_graph -I../lib/librte_graph -Ilib/librte_ipsec -I../lib/librte_ipsec -Ilib/librte_security -I../lib/librte_security -Ilib/librte_latencystats -I../lib/librte_latencystats -Ilib/librte_member -I../lib/librte_member -Ilib/librte_node -I../lib/librte_node -Ilib/librte_pipeline -I../lib/librte_pipeline -Ilib/librte_rawdev -I../lib/librte_rawdev -Ilib/librte_reorder -I../lib/librte_reorder -Ilib/librte_stack -I../lib/librte_stack -Idrivers/mempool/ring -I../drivers/mempool/ring -Idrivers/mempool/stack -I../drivers/mempool/stack -Idrivers/event/skeleton -I../drivers/event/skeleton -Idrivers/net/bonding -I../drivers/net/bonding -Idrivers/net/ring -I../drivers/net/ring -Ilib/librte_power -I../lib/librte_power -Ilib/librte_pdump -I../lib/librte_pdump -Ilib/librte_compressdev -I../lib/librte_compressdev -Idrivers/crypto/scheduler -I../drivers/crypto/scheduler -Xclang -fcolor-diagnostics -pipe -D_FILE_OFFSET_BITS=64 -Wall -Winvalid-pch -Werror -O3 -include rte_config.h -Wextra -Wcast-qual -Wdeprecated -Wformat -Wformat-nonliteral -Wformat-security -Wmissing-declarations -Wmissing-prototypes -Wnested-externs -Wold-style-definition -Wpointer-arith -Wsign-compare -Wstrict-prototypes -Wundef -Wwrite-strings -Wno-address-of-packed-member -Wno-missing-field-initializers -march=native -DALLOW_EXPERIMENTAL_API -D_GNU_SOURCE -fno-strict-aliasing -DALLOW_INTERNAL_API -MD -MQ app/test/dpdk-test.p/test_pflock.c.o -MF app/test/dpdk-test.p/test_pflock.c.o.d -o app/test/dpdk-test.p/test_pflock.c.o -c ../app/test/test_pflock.c
In file included from ../app/test/test_pflock.c:17:
In file included from ../lib/librte_eal/x86/include/rte_pflock.h:12:
../lib/librte_eal/include/generic/rte_pflock.h:215:33: error: implicit conversion from 'unsigned int' to 'uint16_t' (aka 'unsigned short') changes value from 4294967280 to 65520 [-Werror,-Wconstant-conversion]
        __atomic_fetch_and(&pf->rd.in, RTE_PFLOCK_LSB, __ATOMIC_RELEASE);
        ~~~~~~~~~~~~~~~~~~             ^~~~~~~~~~~~~~
../lib/librte_eal/include/generic/rte_pflock.h:57:26: note: expanded from macro 'RTE_PFLOCK_LSB'
#define RTE_PFLOCK_LSB   0xFFFFFFF0
                         ^~~~~~~~~~
1 error generated.
[2557/2839] Compiling C object app/test/dpdk-test.p/test_power_kvm_vm.c.o
[2558/2839] Compiling C object app/test/dpdk-test.p/test_prefetch.c.o
[2559/2839] Compiling C object app/test/dpdk-test.p/test_power_cpufreq.c.o
[2560/2839] Compiling C object app/test/dpdk-test.p/test_mp_secondary.c.o
[2561/2839] Compiling C object app/test/dpdk-test.p/test_mbuf.c.o
[2562/2839] Compiling C object app/test/dpdk-test.p/test_pmd_perf.c.o
[2563/2839] Compiling C object app/test/dpdk-test.p/test_memcpy_perf.c.o
[2564/2839] Compiling C object drivers/libtmp_rte_event_octeontx2.a.p/event_octeontx2_otx2_worker.c.o
[2565/2839] Compiling C object drivers/libtmp_rte_event_octeontx2.a.p/event_octeontx2_otx2_worker_dual.c.o
ninja: build stopped




*Build Failed #4:
OS: FreeBSD1201-64
Target: x86_64-native-bsdapp-clang
FAILED: app/test/dpdk-test.p/test_pflock.c.o 
clang -Iapp/test/dpdk-test.p -Iapp/test -I../app/test -Ilib/librte_acl -I../lib/librte_acl -I. -I.. -Iconfig -I../config -Ilib/librte_eal/include -I../lib/librte_eal/include -Ilib/librte_eal/freebsd/include -I../lib/librte_eal/freebsd/include -Ilib/librte_eal/x86/include -I../lib/librte_eal/x86/include -Ilib/librte_eal/common -I../lib/librte_eal/common -Ilib/librte_eal -I../lib/librte_eal -Ilib/librte_kvargs -I../lib/librte_kvargs -Ilib/librte_metrics -I../lib/librte_metrics -Ilib/librte_telemetry -I../lib/librte_telemetry -Idrivers/bus/pci -I../drivers/bus/pci -I../drivers/bus/pci/bsd -Ilib/librte_pci -I../lib/librte_pci -Idrivers/bus/vdev -I../drivers/bus/vdev -Ilib/librte_bitratestats -I../lib/librte_bitratestats -Ilib/librte_ethdev -I../lib/librte_ethdev -Ilib/librte_net -I../lib/librte_net -Ilib/librte_mbuf -I../lib/librte_mbuf -Ilib/librte_mempool -I../lib/librte_mempool -Ilib/librte_ring -I../lib/librte_ring -Ilib/librte_meter -I../lib/librte_meter -Ilib/librte_bpf -I../lib/librte_bpf -Ilib/librte_cfgfile -I../lib/librte_cfgfile -Ilib/librte_cmdline -I../lib/librte_cmdline -Ilib/librte_cryptodev -I../lib/librte_cryptodev -Ilib/librte_rcu -I../lib/librte_rcu -Ilib/librte_distributor -I../lib/librte_distributor -Ilib/librte_efd -I../lib/librte_efd -Ilib/librte_hash -I../lib/librte_hash -Ilib/librte_eventdev -I../lib/librte_eventdev -Ilib/librte_timer -I../lib/librte_timer -Ilib/librte_fib -I../lib/librte_fib -Ilib/librte_rib -I../lib/librte_rib -Ilib/librte_flow_classify -I../lib/librte_flow_classify -Ilib/librte_table -I../lib/librte_table -Ilib/librte_port -I../lib/librte_port -Ilib/librte_sched -I../lib/librte_sched -Ilib/librte_ip_frag -I../lib/librte_ip_frag -Ilib/librte_lpm -I../lib/librte_lpm -Ilib/librte_graph -I../lib/librte_graph -Ilib/librte_ipsec -I../lib/librte_ipsec -Ilib/librte_security -I../lib/librte_security -Ilib/librte_latencystats -I../lib/librte_latencystats -Ilib/librte_member -I../lib/librte_member -Ilib/librte_node -I../lib/librte_node -Ilib/librte_pipeline -I../lib/librte_pipeline -Ilib/librte_rawdev -I../lib/librte_rawdev -Ilib/librte_reorder -I../lib/librte_reorder -Ilib/librte_stack -I../lib/librte_stack -Idrivers/mempool/ring -I../drivers/mempool/ring -Idrivers/mempool/stack -I../drivers/mempool/stack -Idrivers/event/skeleton -I../drivers/event/skeleton -Idrivers/net/bonding -I../drivers/net/bonding -Idrivers/net/ring -I../drivers/net/ring -Ilib/librte_pdump -I../lib/librte_pdump -Ilib/librte_compressdev -I../lib/librte_compressdev -Idrivers/crypto/scheduler -I../drivers/crypto/scheduler -Xclang -fcolor-diagnostics -pipe -D_FILE_OFFSET_BITS=64 -Wall -Winvalid-pch -Werror -O3 -include rte_config.h -Wextra -Wcast-qual -Wdeprecated -Wformat -Wformat-nonliteral -Wformat-security -Wmissing-declarations -Wmissing-prototypes -Wnested-externs -Wold-style-definition -Wpointer-arith -Wsign-compare -Wstrict-prototypes -Wundef -Wwrite-strings -Wno-address-of-packed-member -Wno-missing-field-initializers -D__BSD_VISIBLE -march=native -mno-avx512f -DALLOW_EXPERIMENTAL_API -D_GNU_SOURCE -fno-strict-aliasing -DALLOW_INTERNAL_API -MD -MQ app/test/dpdk-test.p/test_pflock.c.o -MF app/test/dpdk-test.p/test_pflock.c.o.d -o app/test/dpdk-test.p/test_pflock.c.o -c ../app/test/test_pflock.c
In file included from ../app/test/test_pflock.c:17:
In file included from ../lib/librte_eal/x86/include/rte_pflock.h:12:
../lib/librte_eal/include/generic/rte_pflock.h:215:33: error: implicit conversion from 'unsigned int' to 'uint16_t' (aka 'unsigned short') changes value from 4294967280 to 65520 [-Werror,-Wconstant-conversion]
        __atomic_fetch_and(&pf->rd.in, RTE_PFLOCK_LSB, __ATOMIC_RELEASE);
        ~~~~~~~~~~~~~~~~~~             ^~~~~~~~~~~~~~
../lib/librte_eal/include/generic/rte_pflock.h:57:26: note: expanded from macro 'RTE_PFLOCK_LSB'
#define RTE_PFLOCK_LSB   0xFFFFFFF0
                         ^~~~~~~~~~
1 error generated.
[1840/2050] Compiling C object app/test/dpdk-test.p/test_mp_secondary.c.o
[1841/2050] Compiling C object app/test/dpdk-test.p/test_rawdev.c.o
[1842/2050] Compiling C object app/test/dpdk-test.p/test_pmd_perf.c.o
[1843/2050] Compiling C object app/test/dpdk-test.p/test_rcu_qsbr.c.o
[1844/2050] Compiling C object app/test/dpdk-test.p/test_memcpy_perf.c.o
ninja: build stopped




*Build Failed #5:
OS: SUSE15-64
Target: x86_64-native-linuxapp-clang
FAILED: app/test/dpdk-test.p/test_pflock.c.o 
clang -Iapp/test/dpdk-test.p -Iapp/test -I../app/test -Ilib/librte_acl -I../lib/librte_acl -I. -I.. -Iconfig -I../config -Ilib/librte_eal/include -I../lib/librte_eal/include -Ilib/librte_eal/linux/include -I../lib/librte_eal/linux/include -Ilib/librte_eal/x86/include -I../lib/librte_eal/x86/include -Ilib/librte_eal/common -I../lib/librte_eal/common -Ilib/librte_eal -I../lib/librte_eal -Ilib/librte_kvargs -I../lib/librte_kvargs -Ilib/librte_metrics -I../lib/librte_metrics -Ilib/librte_telemetry -I../lib/librte_telemetry -Idrivers/bus/pci -I../drivers/bus/pci -I../drivers/bus/pci/linux -Ilib/librte_pci -I../lib/librte_pci -Idrivers/bus/vdev -I../drivers/bus/vdev -Ilib/librte_bitratestats -I../lib/librte_bitratestats -Ilib/librte_ethdev -I../lib/librte_ethdev -Ilib/librte_net -I../lib/librte_net -Ilib/librte_mbuf -I../lib/librte_mbuf -Ilib/librte_mempool -I../lib/librte_mempool -Ilib/librte_ring -I../lib/librte_ring -Ilib/librte_meter -I../lib/librte_meter -Ilib/librte_bpf -I../lib/librte_bpf -Ilib/librte_cfgfile -I../lib/librte_cfgfile -Ilib/librte_cmdline -I../lib/librte_cmdline -Ilib/librte_cryptodev -I../lib/librte_cryptodev -Ilib/librte_rcu -I../lib/librte_rcu -Ilib/librte_distributor -I../lib/librte_distributor -Ilib/librte_efd -I../lib/librte_efd -Ilib/librte_hash -I../lib/librte_hash -Ilib/librte_eventdev -I../lib/librte_eventdev -Ilib/librte_timer -I../lib/librte_timer -Ilib/librte_fib -I../lib/librte_fib -Ilib/librte_rib -I../lib/librte_rib -Ilib/librte_flow_classify -I../lib/librte_flow_classify -Ilib/librte_table -I../lib/librte_table -Ilib/librte_port -I../lib/librte_port -Ilib/librte_sched -I../lib/librte_sched -Ilib/librte_ip_frag -I../lib/librte_ip_frag -Ilib/librte_kni -I../lib/librte_kni -Ilib/librte_lpm -I../lib/librte_lpm -Ilib/librte_graph -I../lib/librte_graph -Ilib/librte_ipsec -I../lib/librte_ipsec -Ilib/librte_security -I../lib/librte_security -Ilib/librte_latencystats -I../lib/librte_latencystats -Ilib/librte_member -I../lib/librte_member -Ilib/librte_node -I../lib/librte_node -Ilib/librte_pipeline -I../lib/librte_pipeline -Ilib/librte_rawdev -I../lib/librte_rawdev -Ilib/librte_reorder -I../lib/librte_reorder -Ilib/librte_stack -I../lib/librte_stack -Idrivers/mempool/ring -I../drivers/mempool/ring -Idrivers/mempool/stack -I../drivers/mempool/stack -Idrivers/event/skeleton -I../drivers/event/skeleton -Idrivers/net/bonding -I../drivers/net/bonding -Idrivers/net/ring -I../drivers/net/ring -Ilib/librte_power -I../lib/librte_power -Ilib/librte_pdump -I../lib/librte_pdump -Ilib/librte_compressdev -I../lib/librte_compressdev -Idrivers/crypto/scheduler -I../drivers/crypto/scheduler -Xclang -fcolor-diagnostics -pipe -D_FILE_OFFSET_BITS=64 -Wall -Winvalid-pch -Werror -O3 -include rte_config.h -Wextra -Wcast-qual -Wdeprecated -Wformat -Wformat-nonliteral -Wformat-security -Wmissing-declarations -Wmissing-prototypes -Wnested-externs -Wold-style-definition -Wpointer-arith -Wsign-compare -Wstrict-prototypes -Wundef -Wwrite-strings -Wno-address-of-packed-member -Wno-missing-field-initializers -march=native -DALLOW_EXPERIMENTAL_API -D_GNU_SOURCE -fno-strict-aliasing -DALLOW_INTERNAL_API -MD -MQ app/test/dpdk-test.p/test_pflock.c.o -MF app/test/dpdk-test.p/test_pflock.c.o.d -o app/test/dpdk-test.p/test_pflock.c.o -c ../app/test/test_pflock.c
In file included from ../app/test/test_pflock.c:17:
In file included from ../lib/librte_eal/x86/include/rte_pflock.h:12:
../lib/librte_eal/include/generic/rte_pflock.h:215:33: error: implicit conversion from 'unsigned int' to 'uint16_t' (aka 'unsigned short') changes value from 4294967280 to 65520 [-Werror,-Wconstant-conversion]
        __atomic_fetch_and(&pf->rd.in, RTE_PFLOCK_LSB, __ATOMIC_RELEASE);
        ~~~~~~~~~~~~~~~~~~             ^~~~~~~~~~~~~~
../lib/librte_eal/include/generic/rte_pflock.h:57:26: note: expanded from macro 'RTE_PFLOCK_LSB'
#define RTE_PFLOCK_LSB   0xFFFFFFF0
                         ^~~~~~~~~~
1 error generated.
[2449/2733] Compiling C object app/test/dpdk-test.p/test_mp_secondary.c.o
[2450/2733] Compiling C object app/test/dpdk-test.p/test_power_cpufreq.c.o
[2451/2733] Compiling C object app/test/dpdk-test.p/test_power.c.o
[2452/2733] Compiling C object app/test/dpdk-test.p/test_power_kvm_vm.c.o
[2453/2733] Compiling C object app/test/dpdk-test.p/test_mbuf.c.o
[2454/2733] Compiling C object app/test/dpdk-test.p/test_pmd_perf.c.o
[2455/2733] Compiling C object app/test/dpdk-test.p/test_memcpy_perf.c.o
[2456/2733] Compiling C object drivers/libtmp_rte_event_octeontx2.a.p/event_octeontx2_otx2_worker_dual.c.o
[2457/2733] Compiling C object drivers/libtmp_rte_event_octeontx2.a.p/event_octeontx2_otx2_worker.c.o
ninja: build stopped




*Build Failed #6:
OS: UB2004-64
Target: x86_64-native-linuxapp-clang
FAILED: app/test/dpdk-test.p/test_pflock.c.o 
clang -Iapp/test/dpdk-test.p -Iapp/test -I../app/test -Ilib/librte_acl -I../lib/librte_acl -I. -I.. -Iconfig -I../config -Ilib/librte_eal/include -I../lib/librte_eal/include -Ilib/librte_eal/linux/include -I../lib/librte_eal/linux/include -Ilib/librte_eal/x86/include -I../lib/librte_eal/x86/include -Ilib/librte_eal/common -I../lib/librte_eal/common -Ilib/librte_eal -I../lib/librte_eal -Ilib/librte_kvargs -I../lib/librte_kvargs -Ilib/librte_metrics -I../lib/librte_metrics -Ilib/librte_telemetry -I../lib/librte_telemetry -Idrivers/bus/pci -I../drivers/bus/pci -I../drivers/bus/pci/linux -Ilib/librte_pci -I../lib/librte_pci -Idrivers/bus/vdev -I../drivers/bus/vdev -Ilib/librte_bitratestats -I../lib/librte_bitratestats -Ilib/librte_ethdev -I../lib/librte_ethdev -Ilib/librte_net -I../lib/librte_net -Ilib/librte_mbuf -I../lib/librte_mbuf -Ilib/librte_mempool -I../lib/librte_mempool -Ilib/librte_ring -I../lib/librte_ring -Ilib/librte_meter -I../lib/librte_meter -Ilib/librte_bpf -I../lib/librte_bpf -Ilib/librte_cfgfile -I../lib/librte_cfgfile -Ilib/librte_cmdline -I../lib/librte_cmdline -Ilib/librte_cryptodev -I../lib/librte_cryptodev -Ilib/librte_rcu -I../lib/librte_rcu -Ilib/librte_distributor -I../lib/librte_distributor -Ilib/librte_efd -I../lib/librte_efd -Ilib/librte_hash -I../lib/librte_hash -Ilib/librte_eventdev -I../lib/librte_eventdev -Ilib/librte_timer -I../lib/librte_timer -Ilib/librte_fib -I../lib/librte_fib -Ilib/librte_rib -I../lib/librte_rib -Ilib/librte_flow_classify -I../lib/librte_flow_classify -Ilib/librte_table -I../lib/librte_table -Ilib/librte_port -I../lib/librte_port -Ilib/librte_sched -I../lib/librte_sched -Ilib/librte_ip_frag -I../lib/librte_ip_frag -Ilib/librte_kni -I../lib/librte_kni -Ilib/librte_lpm -I../lib/librte_lpm -Ilib/librte_graph -I../lib/librte_graph -Ilib/librte_ipsec -I../lib/librte_ipsec -Ilib/librte_security -I../lib/librte_security -Ilib/librte_latencystats -I../lib/librte_latencystats -Ilib/librte_member -I../lib/librte_member -Ilib/librte_node -I../lib/librte_node -Ilib/librte_pipeline -I../lib/librte_pipeline -Ilib/librte_rawdev -I../lib/librte_rawdev -Ilib/librte_reorder -I../lib/librte_reorder -Ilib/librte_stack -I../lib/librte_stack -Idrivers/mempool/ring -I../drivers/mempool/ring -Idrivers/mempool/stack -I../drivers/mempool/stack -Idrivers/event/skeleton -I../drivers/event/skeleton -Idrivers/net/bonding -I../drivers/net/bonding -Idrivers/net/ring -I../drivers/net/ring -Ilib/librte_power -I../lib/librte_power -Ilib/librte_pdump -I../lib/librte_pdump -Ilib/librte_compressdev -I../lib/librte_compressdev -Idrivers/crypto/scheduler -I../drivers/crypto/scheduler -Xclang -fcolor-diagnostics -pipe -D_FILE_OFFSET_BITS=64 -Wall -Winvalid-pch -Werror -O3 -include rte_config.h -Wextra -Wcast-qual -Wdeprecated -Wformat -Wformat-nonliteral -Wformat-security -Wmissing-declarations -Wmissing-prototypes -Wnested-externs -Wold-style-definition -Wpointer-arith -Wsign-compare -Wstrict-prototypes -Wundef -Wwrite-strings -Wno-address-of-packed-member -Wno-missing-field-initializers -march=native -DALLOW_EXPERIMENTAL_API -D_GNU_SOURCE -fno-strict-aliasing -DALLOW_INTERNAL_API -MD -MQ app/test/dpdk-test.p/test_pflock.c.o -MF app/test/dpdk-test.p/test_pflock.c.o.d -o app/test/dpdk-test.p/test_pflock.c.o -c ../app/test/test_pflock.c
In file included from ../app/test/test_pflock.c:17:
In file included from ../lib/librte_eal/x86/include/rte_pflock.h:12:
../lib/librte_eal/include/generic/rte_pflock.h:215:33: error: implicit conversion from 'unsigned int' to 'uint16_t' (aka 'unsigned short') changes value from 4294967280 to 65520 [-Werror,-Wconstant-conversion]
        __atomic_fetch_and(&pf->rd.in, RTE_PFLOCK_LSB, __ATOMIC_RELEASE);
        ~~~~~~~~~~~~~~~~~~             ^~~~~~~~~~~~~~
../lib/librte_eal/include/generic/rte_pflock.h:57:26: note: expanded from macro 'RTE_PFLOCK_LSB'
#define RTE_PFLOCK_LSB   0xFFFFFFF0
                         ^~~~~~~~~~
1 error generated.
[2542/2826] Compiling C object app/test/dpdk-test.p/test_mempool.c.o
[2543/2826] Compiling C object app/test/dpdk-test.p/test_power_kvm_vm.c.o
[2544/2826] Compiling C object app/test/dpdk-test.p/test_power_cpufreq.c.o
[2545/2826] Compiling C object app/test/dpdk-test.p/test_mp_secondary.c.o
[2546/2826] Compiling C object app/test/dpdk-test.p/test_mbuf.c.o
[2547/2826] Compiling C object app/test/dpdk-test.p/test_pmd_perf.c.o
[2548/2826] Compiling C object app/test/dpdk-test.p/test_memcpy_perf.c.o
[2549/2826] Compiling C object drivers/libtmp_rte_event_octeontx2.a.p/event_octeontx2_otx2_worker.c.o
[2550/2826] Compiling C object drivers/libtmp_rte_event_octeontx2.a.p/event_octeontx2_otx2_worker_dual.c.o
ninja: build stopped




*Build Failed #7:
OS: UB2004-64
Target: x86_64-native-linuxapp-icc
FAILED: app/test/dpdk-test.p/test_pflock.c.o 
icc -Iapp/test/dpdk-test.p -Iapp/test -I../app/test -Ilib/librte_acl -I../lib/librte_acl -I. -I.. -Iconfig -I../config -Ilib/librte_eal/include -I../lib/librte_eal/include -Ilib/librte_eal/linux/include -I../lib/librte_eal/linux/include -Ilib/librte_eal/x86/include -I../lib/librte_eal/x86/include -Ilib/librte_eal/common -I../lib/librte_eal/common -Ilib/librte_eal -I../lib/librte_eal -Ilib/librte_kvargs -I../lib/librte_kvargs -Ilib/librte_metrics -I../lib/librte_metrics -Ilib/librte_telemetry -I../lib/librte_telemetry -Idrivers/bus/pci -I../drivers/bus/pci -I../drivers/bus/pci/linux -Ilib/librte_pci -I../lib/librte_pci -Idrivers/bus/vdev -I../drivers/bus/vdev -Ilib/librte_bitratestats -I../lib/librte_bitratestats -Ilib/librte_ethdev -I../lib/librte_ethdev -Ilib/librte_net -I../lib/librte_net -Ilib/librte_mbuf -I../lib/librte_mbuf -Ilib/librte_mempool -I../lib/librte_mempool -Ilib/librte_ring -I../lib/librte_ring -Ilib/librte_meter -I../lib/librte_meter -Ilib/librte_bpf -I../lib/librte_bpf -Ilib/librte_cfgfile -I../lib/librte_cfgfile -Ilib/librte_cmdline -I../lib/librte_cmdline -Ilib/librte_cryptodev -I../lib/librte_cryptodev -Ilib/librte_rcu -I../lib/librte_rcu -Ilib/librte_distributor -I../lib/librte_distributor -Ilib/librte_efd -I../lib/librte_efd -Ilib/librte_hash -I../lib/librte_hash -Ilib/librte_eventdev -I../lib/librte_eventdev -Ilib/librte_timer -I../lib/librte_timer -Ilib/librte_fib -I../lib/librte_fib -Ilib/librte_rib -I../lib/librte_rib -Ilib/librte_flow_classify -I../lib/librte_flow_classify -Ilib/librte_table -I../lib/librte_table -Ilib/librte_port -I../lib/librte_port -Ilib/librte_sched -I../lib/librte_sched -Ilib/librte_ip_frag -I../lib/librte_ip_frag -Ilib/librte_kni -I../lib/librte_kni -Ilib/librte_lpm -I../lib/librte_lpm -Ilib/librte_graph -I../lib/librte_graph -Ilib/librte_ipsec -I../lib/librte_ipsec -Ilib/librte_security -I../lib/librte_security -Ilib/librte_latencystats -I../lib/librte_latencystats -Ilib/librte_member -I../lib/librte_member -Ilib/librte_node -I../lib/librte_node -Ilib/librte_pipeline -I../lib/librte_pipeline -Ilib/librte_rawdev -I../lib/librte_rawdev -Ilib/librte_reorder -I../lib/librte_reorder -Ilib/librte_stack -I../lib/librte_stack -Idrivers/mempool/ring -I../drivers/mempool/ring -Idrivers/mempool/stack -I../drivers/mempool/stack -Idrivers/event/skeleton -I../drivers/event/skeleton -Idrivers/net/bonding -I../drivers/net/bonding -Idrivers/net/ring -I../drivers/net/ring -Ilib/librte_power -I../lib/librte_power -Ilib/librte_pdump -I../lib/librte_pdump -Ilib/librte_compressdev -I../lib/librte_compressdev -Idrivers/crypto/scheduler -I../drivers/crypto/scheduler -pipe -D_FILE_OFFSET_BITS=64 -Wall -w3 -diag-disable:remark -Werror -O3 -include rte_config.h -Wextra -Wcast-qual -Wdeprecated -Wformat -Wformat-security -Wmissing-declarations -Wmissing-prototypes -Wold-style-definition -Wpointer-arith -Wsign-compare -Wstrict-prototypes -Wundef -Wwrite-strings -Wno-missing-field-initializers -diag-disable=181 -diag-disable=188 -diag-disable=2203 -diag-disable=2279 -diag-disable=2557 -diag-disable=3179 -diag-disable=3656 -march=native -DALLOW_EXPERIMENTAL_API -D_GNU_SOURCE -fno-strict-aliasing -DALLOW_INTERNAL_API -MD -MQ app/test/dpdk-test.p/test_pflock.c.o -MF app/test/dpdk-test.p/test_pflock.c.o.d -o app/test/dpdk-test.p/test_pflock.c.o -c ../app/test/test_pflock.c
In file included from ../lib/librte_eal/x86/include/rte_pflock.h(12),
                 from ../app/test/test_pflock.c(17):
../lib/librte_eal/include/generic/rte_pflock.h(215): error #69: integer conversion resulted in truncation
  	__atomic_fetch_and(&pf->rd.in, RTE_PFLOCK_LSB, __ATOMIC_RELEASE);
  	                               ^

compilation aborted for ../app/test/test_pflock.c (code 2)
[2494/2780] Compiling C object app/test/dpdk-test.p/test_mcslock.c.o
[2495/2780] Compiling C object app/test/dpdk-test.p/test_per_lcore.c.o
[2496/2780] Compiling C object app/test/dpdk-test.p/test_mp_secondary.c.o
[2497/2780] Compiling C object app/test/dpdk-test.p/test_pmd_perf.c.o
[2498/2780] Compiling C object app/test/dpdk-test.p/test_mbuf.c.o
[2499/2780] Compiling C object app/test/dpdk-test.p/test_cryptodev.c.o
[2500/2780] Compiling C object app/test/dpdk-test.p/test_memcpy_perf.c.o
[2501/2780] Compiling C object drivers/libtmp_rte_event_octeontx2.a.p/event_octeontx2_otx2_worker.c.o
[2502/2780] Compiling C object drivers/libtmp_rte_event_octeontx2.a.p/event_octeontx2_otx2_worker_dual.c.o
ninja: build stopped




*Build Failed #8:
OS: UB2004-64
Target: x86_64-native-linuxapp-doc
FAILED: doc/api/html 
/root/UB2004-64_K5.4.0_GCC9.3.0/x86_64-native-linuxapp-doc/e41ec09c4c0c4c41a691dfabe70a77b2/dpdk/doc/api/generate_doxygen.sh doc/api/doxy-api.conf doc/api/html /root/UB2004-64_K5.4.0_GCC9.3.0/x86_64-native-linuxapp-doc/e41ec09c4c0c4c41a691dfabe70a77b2/dpdk/doc/api/doxy-html-custom.sh
/root/UB2004-64_K5.4.0_GCC9.3.0/x86_64-native-linuxapp-doc/e41ec09c4c0c4c41a691dfabe70a77b2/dpdk/lib/librte_eal/include/generic/rte_pflock.h:167: error: argument 'p' of command @param is not found in the argument list of rte_pflock_write_lock(rte_pflock_t *pf) (warning treated as error, aborting now)
[2609/2636] Compiling C object app/test/dpdk-test.p/test_trace_perf.c.o
[2610/2636] Compiling C object app/test/dpdk-test.p/test_ring_perf.c.o
[2611/2636] Compiling C object app/test/dpdk-test.p/test_ring.c.o
[2612/2636] Generating html_guides with a custom command
Install the sphinx ReadTheDocs theme for improved html documentation layout: https://sphinx-rtd-theme.readthedocs.io/
[2613/2636] Compiling C object drivers/libtmp_rte_event_octeontx2.a.p/event_octeontx2_otx2_worker.c.o
[2614/2636] Compiling C object drivers/libtmp_rte_event_octeontx2.a.p/event_octeontx2_otx2_worker_dual.c.o
ninja: build stopped


DPDK STV team


More information about the test-report mailing list