[dpdk-test-report] |FAILURE| pw88393 [PATCH] net/bnxt: fix Rx descriptor status

dpdklab at iol.unh.edu dpdklab at iol.unh.edu
Tue Mar 2 18:21:45 CET 2021


Test-Label: Performance-Testing
Test-Status: FAILURE
http://dpdk.org/patch/88393

_build patch failure_

Submitter: Lance Richardson <lance.richardson at broadcom.com>
Date: Tuesday, March 02 2021 14:29:27 
Applied on: CommitID:03713d0b2882a11bc742f2e29945d6c4a810cd53
Apply patch set 88393 failed:

[1/1553] Linking static target lib/librte_pipeline.a.
[2/1553] Linking static target drivers/libtmp_rte_net_dpaa.a.
[3/1553] Linking static target drivers/libtmp_rte_net_dpaa2.a.
[4/1553] Compiling C object 'drivers/a715181@@rte_net_bnx2x at sta/meson-generated_.._rte_net_bnx2x.pmd.c.o'.
[5/1553] Compiling C object 'drivers/a715181@@rte_net_bnx2x at sha/meson-generated_.._rte_net_bnx2x.pmd.c.o'.
[6/1553] Linking target drivers/librte_net_cxgbe.so.21.2.
[7/1553] Generating rte_net_e1000_def with a custom command.
[8/1553] Generating rte_net_e1000_mingw with a custom command.
[9/1553] Linking static target drivers/librte_net_bnx2x.a.
[10/1553] Compiling C object 'drivers/net/e1000/base/8e1fdff@@e1000_base at sta/e1000_osdep.c.o'.
[11/1553] Linking target drivers/librte_net_bnxt.so.21.2.
FAILED: drivers/librte_net_bnxt.so.21.2 
cc  -o drivers/librte_net_bnxt.so.21.2 'drivers/a715181@@rte_net_bnxt at sha/meson-generated_.._rte_net_bnxt.pmd.c.o' 'drivers/a715181@@tmp_rte_net_bnxt at sta/net_bnxt_bnxt_cpr.c.o' 'drivers/a715181@@tmp_rte_net_bnxt at sta/net_bnxt_bnxt_ethdev.c.o' 'drivers/a715181@@tmp_rte_net_bnxt at sta/net_bnxt_bnxt_filter.c.o' 'drivers/a715181@@tmp_rte_net_bnxt at sta/net_bnxt_bnxt_flow.c.o' 'drivers/a715181@@tmp_rte_net_bnxt at sta/net_bnxt_bnxt_hwrm.c.o' 'drivers/a715181@@tmp_rte_net_bnxt at sta/net_bnxt_bnxt_irq.c.o' 'drivers/a715181@@tmp_rte_net_bnxt at sta/net_bnxt_bnxt_ring.c.o' 'drivers/a715181@@tmp_rte_net_bnxt at sta/net_bnxt_bnxt_rxq.c.o' 'drivers/a715181@@tmp_rte_net_bnxt at sta/net_bnxt_bnxt_rxr.c.o' 'drivers/a715181@@tmp_rte_net_bnxt at sta/net_bnxt_bnxt_stats.c.o' 'drivers/a715181@@tmp_rte_net_bnxt at sta/net_bnxt_bnxt_txq.c.o' 'drivers/a715181@@tmp_rte_net_bnxt at sta/net_bnxt_bnxt_txr.c.o' 'drivers/a715181@@tmp_rte_net_bnxt at sta/net_bnxt_bnxt_util.c.o' 'drivers/a715181@@tmp_rte_net_bnxt at sta/net_bnxt_bnxt_vnic.c.o' 'drivers/a715181@@tmp_rte_net_bnxt at sta/net_bnxt_bnxt_reps.c.o' 'drivers/a715181@@tmp_rte_net_bnxt at sta/net_bnxt_tf_core_tf_core.c.o' 'drivers/a715181@@tmp_rte_net_bnxt at sta/net_bnxt_tf_core_bitalloc.c.o' 'drivers/a715181@@tmp_rte_net_bnxt at sta/net_bnxt_tf_core_tf_msg.c.o' 'drivers/a715181@@tmp_rte_net_bnxt at sta/net_bnxt_tf_core_rand.c.o' 'drivers/a715181@@tmp_rte_net_bnxt at sta/net_bnxt_tf_core_stack.c.o' 'drivers/a715181@@tmp_rte_net_bnxt at sta/net_bnxt_tf_core_tf_em_common.c.o' 'drivers/a715181@@tmp_rte_net_bnxt at sta/net_bnxt_tf_core_tf_em_internal.c.o' 'drivers/a715181@@tmp_rte_net_bnxt at sta/net_bnxt_tf_core_tf_rm.c.o' 'drivers/a715181@@tmp_rte_net_bnxt at sta/net_bnxt_tf_core_tf_tbl.c.o' 'drivers/a715181@@tmp_rte_net_bnxt at sta/net_bnxt_tf_core_tfp.c.o' 'drivers/a715181@@tmp_rte_net_bnxt at sta/net_bnxt_tf_core_tf_session.c.o' 'drivers/a715181@@tmp_rte_net_bnxt at sta/net_bnxt_tf_core_tf_device.c.o' 'drivers/a715181@@tmp_rte_net_bnxt at sta/net_bnxt_tf_core_tf_device_p4.c.o' 'drivers/a715181@@tmp_rte_net_bnxt at sta/net_bnxt_tf_core_tf_identifier.c.o' 'drivers/a715181@@tmp_rte_net_bnxt at sta/net_bnxt_tf_core_tf_shadow_tbl.c.o' 'drivers/a715181@@tmp_rte_net_bnxt at sta/net_bnxt_tf_core_tf_shadow_tcam.c.o' 'drivers/a715181@@tmp_rte_net_bnxt at sta/net_bnxt_tf_core_tf_tcam.c.o' 'drivers/a715181@@tmp_rte_net_bnxt at sta/net_bnxt_tf_core_tf_util.c.o' 'drivers/a715181@@tmp_rte_net_bnxt at sta/net_bnxt_tf_core_tf_if_tbl.c.o' 'drivers/a715181@@tmp_rte_net_bnxt at sta/net_bnxt_tf_core_ll.c.o' 'drivers/a715181@@tmp_rte_net_bnxt at sta/net_bnxt_tf_core_tf_global_cfg.c.o' 'drivers/a715181@@tmp_rte_net_bnxt at sta/net_bnxt_tf_core_tf_em_host.c.o' 'drivers/a715181@@tmp_rte_net_bnxt at sta/net_bnxt_tf_core_tf_shadow_identifier.c.o' 'drivers/a715181@@tmp_rte_net_bnxt at sta/net_bnxt_tf_core_tf_hash.c.o' 'drivers/a715181@@tmp_rte_net_bnxt at sta/net_bnxt_hcapi_hcapi_cfa_p4.c.o' 'drivers/a715181@@tmp_rte_net_bnxt at sta/net_bnxt_tf_ulp_bnxt_ulp.c.o' 'drivers/a715181@@tmp_rte_net_bnxt at sta/net_bnxt_tf_ulp_ulp_mark_mgr.c.o' 'drivers/a715181@@tmp_rte_net_bnxt at sta/net_bnxt_tf_ulp_ulp_flow_db.c.o' 'drivers/a715181@@tmp_rte_net_bnxt at sta/net_bnxt_tf_ulp_ulp_template_db_tbl.c.o' 'drivers/a715181@@tmp_rte_net_bnxt at sta/net_bnxt_tf_ulp_ulp_template_db_class.c.o' 'drivers/a715181@@tmp_rte_net_bnxt at sta/net_bnxt_tf_ulp_ulp_template_db_act.c.o' 'drivers/a715181@@tmp_rte_net_bnxt at sta/net_bnxt_tf_ulp_ulp_utils.c.o' 'drivers/a715181@@tmp_rte_net_bnxt at sta/net_bnxt_tf_ulp_ulp_mapper.c.o' 'drivers/a715181@@tmp_rte_net_bnxt at sta/net_bnxt_tf_ulp_ulp_matcher.c.o' 'drivers/a715181@@tmp_rte_net_bnxt at sta/net_bnxt_tf_ulp_ulp_rte_parser.c.o' 'drivers/a715181@@tmp_rte_net_bnxt at sta/net_bnxt_tf_ulp_bnxt_ulp_flow.c.o' 'drivers/a715181@@tmp_rte_net_bnxt at sta/net_bnxt_tf_ulp_ulp_port_db.c.o' 'drivers/a715181@@tmp_rte_net_bnxt at sta/net_bnxt_tf_ulp_ulp_def_rules.c.o' 'drivers/a715181@@tmp_rte_net_bnxt at sta/net_bnxt_tf_ulp_ulp_fc_mgr.c.o' 'drivers/a715181@@tmp_rte_net_bnxt at sta/net_bnxt_tf_ulp_ulp_tun.c.o' 'drivers/a715181@@tmp_rte_net_bnxt at sta/net_bnxt_tf_ulp_ulp_template_db_wh_plus_act.c.o' 'drivers/a715181@@tmp_rte_net_bnxt at sta/net_bnxt_tf_ulp_ulp_template_db_wh_plus_class.c.o' 'drivers/a715181@@tmp_rte_net_bnxt at sta/net_bnxt_tf_ulp_ulp_template_db_stingray_act.c.o' 'drivers/a715181@@tmp_rte_net_bnxt at sta/net_bnxt_tf_ulp_ulp_template_db_stingray_class.c.o' 'drivers/a715181@@tmp_rte_net_bnxt at sta/net_bnxt_rte_pmd_bnxt.c.o' 'drivers/a715181@@tmp_rte_net_bnxt at sta/net_bnxt_bnxt_rxtx_vec_sse.c.o' -Wl,--as-needed -Wl,--no-undefined -Wl,-O1 -shared -fPIC -Wl,--start-group -Wl,-soname,librte_net_bnxt.so.21 -Wl,--no-as-needed -pthread -lm -ldl -lnuma -lfdt lib/librte_ethdev.so.21.2 lib/librte_eal.so.21.2 lib/librte_kvargs.so.21.2 lib/librte_telemetry.so.21.2 lib/librte_net.so.21.2 lib/librte_mbuf.so.21.2 lib/librte_mempool.so.21.2 lib/librte_ring.so.21.2 lib/librte_meter.so.21.2 drivers/librte_bus_pci.so.21.2 lib/librte_pci.so.21.2 drivers/librte_bus_vdev.so.21.2 -Wl,--end-group -Wl,--version-script=/home-local/jenkins-local/jenkins-agent/workspace/Apply-Custom-Patch-Set/dpdk/drivers/net/bnxt/version.map '-Wl,-rpath,$ORIGIN/../lib:$ORIGIN/' -Wl,-rpath-link,/home-local/jenkins-local/jenkins-agent/workspace/Apply-Custom-Patch-Set/dpdk/build/lib -Wl,-rpath-link,/home-local/jenkins-local/jenkins-agent/workspace/Apply-Custom-Patch-Set/dpdk/build/drivers
drivers/a715181@@tmp_rte_net_bnxt at sta/net_bnxt_bnxt_ethdev.c.o: In function `bnxt_rx_descriptor_status_op':
bnxt_ethdev.c:(.text+0x4094): undefined reference to `CMP_LEN'
bnxt_ethdev.c:(.text+0x40af): undefined reference to `BNXT_RX_L2_AGG_BUFS'
bnxt_ethdev.c:(.text+0x40bd): undefined reference to `CMP_LEN'
bnxt_ethdev.c:(.text+0x40ff): undefined reference to `CMP_LEN'
bnxt_ethdev.c:(.text+0x4120): undefined reference to `CMP_LEN'
collect2: error: ld returned 1 exit status
[12/1553] Generating rte_net_ena_mingw with a custom command.
[13/1553] Generating rte_net_ena_def with a custom command.
[14/1553] Compiling C object 'drivers/net/e1000/base/8e1fdff@@e1000_base at sta/e1000_vf.c.o'.
[15/1553] Generating rte_net_dpaa.pmd.c with a custom command.
[16/1553] Generating rte_net_dpaa2.pmd.c with a custom command.
[17/1553] Compiling C object 'drivers/a715181@@tmp_rte_net_e1000 at sta/net_e1000_igb_pf.c.o'.
[18/1553] Generating rte_net_bnx2x.sym_chk with a meson_exe.py custom command.
[19/1553] Compiling C object 'drivers/a715181@@tmp_rte_net_enetc at sta/net_enetc_enetc_rxtx.c.o'.
[20/1553] Compiling C object 'drivers/a715181@@tmp_rte_net_e1000 at sta/net_e1000_em_ethdev.c.o'.
[21/1553] Compiling C object 'drivers/a715181@@tmp_rte_net_e1000 at sta/net_e1000_igb_flow.c.o'.
[22/1553] Compiling C object 'drivers/a715181@@tmp_rte_net_ena at sta/net_ena_base_ena_com.c.o'.
[23/1553] Compiling C object 'drivers/net/e1000/base/8e1fdff@@e1000_base at sta/e1000_phy.c.o'.
[24/1553] Generating pipeline.sym_chk with a meson_exe.py custom command.
[25/1553] Compiling C object 'drivers/a715181@@tmp_rte_net_e1000 at sta/net_e1000_em_rxtx.c.o'.
[26/1553] Compiling C object 'drivers/a715181@@tmp_rte_net_e1000 at sta/net_e1000_igb_rxtx.c.o'.
[27/1553] Compiling C object 'drivers/a715181@@tmp_rte_net_ena at sta/net_ena_ena_ethdev.c.o'.
[28/1553] Compiling C object 'drivers/a715181@@tmp_rte_net_e1000 at sta/net_e1000_igb_ethdev.c.o'.
ninja: build stopped: subcommand failed.

https://lab.dpdk.org/results/dashboard/patchsets/15779/

UNH-IOL DPDK Community Lab


More information about the test-report mailing list