[dpdk-test-report] |FAILURE| pw88393 [dpdk-dev] [PATCH] net/bnxt: fix Rx descriptor status

0-day Robot robot at bytheb.org
Tue Mar 2 21:59:10 CET 2021


From: robot at bytheb.org

Test-Label: github-robot
Test-Status: FAILURE
http://patchwork.dpdk.org/patch/88393/

_github build: failed_
Build URL: https://github.com/ovsrobot/dpdk/actions/runs/614436749
Build Logs:
-----------------------Summary of failed steps-----------------------
ubuntu-18.04-gcc-static failed at step "Build and test"
ubuntu-18.04-gcc-shared-abi+doc+tests failed at step "Build and test"
ubuntu-18.04-clang-static failed at step "Build and test"
ubuntu-18.04-clang-shared-doc+tests failed at step "Build and test"
ubuntu-18.04-gcc-static-i386 failed at step "Build and test"
ubuntu-18.04-gcc-static-aarch64 failed at step "Build and test"
ubuntu-18.04-gcc-shared-aarch64 failed at step "Build and test"
----------------------End summary of failed steps--------------------

-------------------------------BEGIN LOGS----------------------------
####################################################################################
#### [Begin job log] ubuntu-18.04-gcc-static at step "Build and test"
####################################################################################
[1107/3164] Compiling C object 'drivers/drivers@@tmp_rte_net_dpaa at sta/net_dpaa_dpaa_rxtx.c.o'.
[1108/3164] Compiling C object 'drivers/drivers@@tmp_rte_net_dpaa at sta/net_dpaa_dpaa_fmc.c.o'.
[1109/3164] Linking static target drivers/libtmp_rte_net_dpaa.a.
[1110/3164] Generating rte_net_cxgbe.pmd.c with a custom command.
[1111/3164] Compiling C object 'drivers/drivers@@rte_net_cxgbe at sta/meson-generated_.._rte_net_cxgbe.pmd.c.o'.
[1112/3164] Linking static target drivers/librte_net_cxgbe.a.
[1113/3164] Compiling C object 'drivers/drivers@@tmp_rte_net_bnxt at sta/net_bnxt_bnxt_ethdev.c.o'.
FAILED: drivers/drivers@@tmp_rte_net_bnxt at sta/net_bnxt_bnxt_ethdev.c.o 
ccache gcc -Idrivers/drivers@@tmp_rte_net_bnxt at sta -Idrivers -I../drivers -Idrivers/net/bnxt -I../drivers/net/bnxt -I../drivers/net/bnxt/tf_ulp -I../drivers/net/bnxt/tf_core -Ilib/librte_ethdev -I../lib/librte_ethdev -I. -I../ -Iconfig -I../config -Ilib/librte_eal/include -I../lib/librte_eal/include -Ilib/librte_eal/linux/include -I../lib/librte_eal/linux/include -Ilib/librte_eal/x86/include -I../lib/librte_eal/x86/include -Ilib/librte_eal/common -I../lib/librte_eal/common -Ilib/librte_eal -I../lib/librte_eal -Ilib/librte_kvargs -I../lib/librte_kvargs -Ilib/librte_telemetry/../librte_metrics -I../lib/librte_telemetry/../librte_metrics -Ilib/librte_telemetry -I../lib/librte_telemetry -Ilib/librte_net -I../lib/librte_net -Ilib/librte_mbuf -I../lib/librte_mbuf -Ilib/librte_mempool -I../lib/librte_mempool -Ilib/librte_ring -I../lib/librte_ring -Ilib/librte_meter -I../lib/librte_meter -Idrivers/bus/pci -I../drivers/bus/pci -I../drivers/bus/pci/linux -Ilib/librte_pci -I../lib/librte_pci -Idrivers/bus/vdev -I../drivers/bus/vdev -fdiagnostics-color=always -pipe -D_FILE_OFFSET_BITS=64 -Wall -Winvalid-pch -Werror -O2 -g -include rte_config.h -Wextra -Wcast-qual -Wdeprecated -Wformat -Wformat-nonliteral -Wformat-security -Wmissing-declarations -Wmissing-prototypes -Wnested-externs -Wold-style-definition -Wpointer-arith -Wsign-compare -Wstrict-prototypes -Wundef -Wwrite-strings -Wno-missing-field-initializers -D_GNU_SOURCE -fPIC -march=corei7 -DALLOW_EXPERIMENTAL_API -DALLOW_INTERNAL_API -Wno-format-truncation  -MD -MQ 'drivers/drivers@@tmp_rte_net_bnxt at sta/net_bnxt_bnxt_ethdev.c.o' -MF 'drivers/drivers@@tmp_rte_net_bnxt at sta/net_bnxt_bnxt_ethdev.c.o.d' -o 'drivers/drivers@@tmp_rte_net_bnxt at sta/net_bnxt_bnxt_ethdev.c.o' -c ../drivers/net/bnxt/bnxt_ethdev.c
../drivers/net/bnxt/bnxt_ethdev.c: In function ‘bnxt_rx_descriptor_status_op’:
../drivers/net/bnxt/bnxt_ethdev.c:3005:16: error: implicit declaration of function ‘CMP_LEN’; did you mean ‘CMSG_LEN’? [-Werror=implicit-function-declaration]
       offset * CMP_LEN(CMPL_BASE_TYPE_RX_L2);
                ^~~~~~~
                CMSG_LEN
../drivers/net/bnxt/bnxt_ethdev.c:3005:16: error: nested extern declaration of ‘CMP_LEN’ [-Werror=nested-externs]
../drivers/net/bnxt/bnxt_ethdev.c:3049:14: error: implicit declaration of function ‘BNXT_RX_L2_AGG_BUFS’; did you mean ‘BNXT_TPA_END_AGG_BUFS’? [-Werror=implicit-function-declaration]
    agg_cnt = BNXT_RX_L2_AGG_BUFS(rxcmp);
              ^~~~~~~~~~~~~~~~~~~
              BNXT_TPA_END_AGG_BUFS
../drivers/net/bnxt/bnxt_ethdev.c:3049:14: error: nested extern declaration of ‘BNXT_RX_L2_AGG_BUFS’ [-Werror=nested-externs]
cc1: all warnings being treated as errors
[1114/3164] Generating rte_net_dpaa.pmd.c with a custom command.
[1115/3164] Generating rte_net_cxgbe.sym_chk with a meson_exe.py custom command.
ninja: build stopped: subcommand failed.
##[error]Process completed with exit code 1.
####################################################################################
#### [End job log] ubuntu-18.04-gcc-static at step "Build and test"
####################################################################################




####################################################################################
#### [Begin job log] ubuntu-18.04-gcc-shared-abi+doc+tests at step "Build and test"
####################################################################################
[1142/3380] Compiling C object 'drivers/drivers@@rte_net_cxgbe at sta/meson-generated_.._rte_net_cxgbe.pmd.c.o'.
[1143/3380] Linking static target drivers/librte_net_cxgbe.a.
[1144/3380] Generating rte_net_dpaa.pmd.c with a custom command.
[1145/3380] Compiling C object 'drivers/drivers@@rte_net_cxgbe at sha/meson-generated_.._rte_net_cxgbe.pmd.c.o'.
[1146/3380] Compiling C object 'drivers/drivers@@rte_net_dpaa at sta/meson-generated_.._rte_net_dpaa.pmd.c.o'.
[1147/3380] Linking static target drivers/librte_net_dpaa.a.
[1148/3380] Compiling C object 'drivers/drivers@@tmp_rte_net_bnxt at sta/net_bnxt_bnxt_ethdev.c.o'.
FAILED: drivers/drivers@@tmp_rte_net_bnxt at sta/net_bnxt_bnxt_ethdev.c.o 
ccache gcc -Idrivers/drivers@@tmp_rte_net_bnxt at sta -Idrivers -I../drivers -Idrivers/net/bnxt -I../drivers/net/bnxt -I../drivers/net/bnxt/tf_ulp -I../drivers/net/bnxt/tf_core -Ilib/librte_ethdev -I../lib/librte_ethdev -I. -I../ -Iconfig -I../config -Ilib/librte_eal/include -I../lib/librte_eal/include -Ilib/librte_eal/linux/include -I../lib/librte_eal/linux/include -Ilib/librte_eal/x86/include -I../lib/librte_eal/x86/include -Ilib/librte_eal/common -I../lib/librte_eal/common -Ilib/librte_eal -I../lib/librte_eal -Ilib/librte_kvargs -I../lib/librte_kvargs -Ilib/librte_telemetry/../librte_metrics -I../lib/librte_telemetry/../librte_metrics -Ilib/librte_telemetry -I../lib/librte_telemetry -Ilib/librte_net -I../lib/librte_net -Ilib/librte_mbuf -I../lib/librte_mbuf -Ilib/librte_mempool -I../lib/librte_mempool -Ilib/librte_ring -I../lib/librte_ring -Ilib/librte_meter -I../lib/librte_meter -Idrivers/bus/pci -I../drivers/bus/pci -I../drivers/bus/pci/linux -Ilib/librte_pci -I../lib/librte_pci -Idrivers/bus/vdev -I../drivers/bus/vdev -fdiagnostics-color=always -pipe -D_FILE_OFFSET_BITS=64 -Wall -Winvalid-pch -Werror -O2 -g -include rte_config.h -Wextra -Wcast-qual -Wdeprecated -Wformat -Wformat-nonliteral -Wformat-security -Wmissing-declarations -Wmissing-prototypes -Wnested-externs -Wold-style-definition -Wpointer-arith -Wsign-compare -Wstrict-prototypes -Wundef -Wwrite-strings -Wno-missing-field-initializers -D_GNU_SOURCE -fPIC -march=corei7 -DALLOW_EXPERIMENTAL_API -DALLOW_INTERNAL_API -Wno-format-truncation  -MD -MQ 'drivers/drivers@@tmp_rte_net_bnxt at sta/net_bnxt_bnxt_ethdev.c.o' -MF 'drivers/drivers@@tmp_rte_net_bnxt at sta/net_bnxt_bnxt_ethdev.c.o.d' -o 'drivers/drivers@@tmp_rte_net_bnxt at sta/net_bnxt_bnxt_ethdev.c.o' -c ../drivers/net/bnxt/bnxt_ethdev.c
../drivers/net/bnxt/bnxt_ethdev.c: In function ‘bnxt_rx_descriptor_status_op’:
../drivers/net/bnxt/bnxt_ethdev.c:3005:16: error: implicit declaration of function ‘CMP_LEN’; did you mean ‘CMSG_LEN’? [-Werror=implicit-function-declaration]
       offset * CMP_LEN(CMPL_BASE_TYPE_RX_L2);
                ^~~~~~~
                CMSG_LEN
../drivers/net/bnxt/bnxt_ethdev.c:3005:16: error: nested extern declaration of ‘CMP_LEN’ [-Werror=nested-externs]
../drivers/net/bnxt/bnxt_ethdev.c:3049:14: error: implicit declaration of function ‘BNXT_RX_L2_AGG_BUFS’; did you mean ‘BNXT_TPA_END_AGG_BUFS’? [-Werror=implicit-function-declaration]
    agg_cnt = BNXT_RX_L2_AGG_BUFS(rxcmp);
              ^~~~~~~~~~~~~~~~~~~
              BNXT_TPA_END_AGG_BUFS
../drivers/net/bnxt/bnxt_ethdev.c:3049:14: error: nested extern declaration of ‘BNXT_RX_L2_AGG_BUFS’ [-Werror=nested-externs]
cc1: all warnings being treated as errors
[1149/3380] Generating rte_net_cxgbe.sym_chk with a meson_exe.py custom command.
[1150/3380] Generating rte_net_dpaa.sym_chk with a meson_exe.py custom command.
ninja: build stopped: subcommand failed.
##[error]Process completed with exit code 1.
####################################################################################
#### [End job log] ubuntu-18.04-gcc-shared-abi+doc+tests at step "Build and test"
####################################################################################




####################################################################################
#### [Begin job log] ubuntu-18.04-clang-static at step "Build and test"
####################################################################################
[1029/3166] Generating rte_raw_octeontx2_dma.pmd.c with a custom command.
[1030/3166] Compiling C object 'drivers/drivers@@rte_raw_octeontx2_dma at sta/meson-generated_.._rte_raw_octeontx2_dma.pmd.c.o'.
[1031/3166] Linking static target drivers/librte_raw_octeontx2_dma.a.
[1032/3166] Generating rte_net_bnx2x.sym_chk with a meson_exe.py custom command.
[1033/3166] Compiling C object 'drivers/drivers@@rte_raw_octeontx2_dma at sha/meson-generated_.._rte_raw_octeontx2_dma.pmd.c.o'.
[1034/3166] Compiling C object 'drivers/drivers@@tmp_rte_net_bnxt at sta/net_bnxt_bnxt_filter.c.o'.
[1035/3166] Compiling C object 'drivers/drivers@@tmp_rte_net_bnxt at sta/net_bnxt_bnxt_cpr.c.o'.
[1036/3166] Compiling C object 'drivers/drivers@@tmp_rte_net_bnxt at sta/net_bnxt_bnxt_hwrm.c.o'.
[1037/3166] Compiling C object 'drivers/drivers@@tmp_rte_net_bnxt at sta/net_bnxt_bnxt_ethdev.c.o'.
FAILED: drivers/drivers@@tmp_rte_net_bnxt at sta/net_bnxt_bnxt_ethdev.c.o 
ccache clang -Idrivers/drivers@@tmp_rte_net_bnxt at sta -Idrivers -I../drivers -Idrivers/net/bnxt -I../drivers/net/bnxt -I../drivers/net/bnxt/tf_ulp -I../drivers/net/bnxt/tf_core -Ilib/librte_ethdev -I../lib/librte_ethdev -I. -I../ -Iconfig -I../config -Ilib/librte_eal/include -I../lib/librte_eal/include -Ilib/librte_eal/linux/include -I../lib/librte_eal/linux/include -Ilib/librte_eal/x86/include -I../lib/librte_eal/x86/include -Ilib/librte_eal/common -I../lib/librte_eal/common -Ilib/librte_eal -I../lib/librte_eal -Ilib/librte_kvargs -I../lib/librte_kvargs -Ilib/librte_telemetry/../librte_metrics -I../lib/librte_telemetry/../librte_metrics -Ilib/librte_telemetry -I../lib/librte_telemetry -Ilib/librte_net -I../lib/librte_net -Ilib/librte_mbuf -I../lib/librte_mbuf -Ilib/librte_mempool -I../lib/librte_mempool -Ilib/librte_ring -I../lib/librte_ring -Ilib/librte_meter -I../lib/librte_meter -Idrivers/bus/pci -I../drivers/bus/pci -I../drivers/bus/pci/linux -Ilib/librte_pci -I../lib/librte_pci -Idrivers/bus/vdev -I../drivers/bus/vdev -Xclang -fcolor-diagnostics -pipe -D_FILE_OFFSET_BITS=64 -Wall -Winvalid-pch -Werror -O2 -g -include rte_config.h -Wextra -Wcast-qual -Wdeprecated -Wformat -Wformat-nonliteral -Wformat-security -Wmissing-declarations -Wmissing-prototypes -Wnested-externs -Wold-style-definition -Wpointer-arith -Wsign-compare -Wstrict-prototypes -Wundef -Wwrite-strings -Wno-address-of-packed-member -Wno-missing-field-initializers -D_GNU_SOURCE -fPIC -march=corei7 -DALLOW_EXPERIMENTAL_API -DALLOW_INTERNAL_API  -MD -MQ 'drivers/drivers@@tmp_rte_net_bnxt at sta/net_bnxt_bnxt_ethdev.c.o' -MF 'drivers/drivers@@tmp_rte_net_bnxt at sta/net_bnxt_bnxt_ethdev.c.o.d' -o 'drivers/drivers@@tmp_rte_net_bnxt at sta/net_bnxt_bnxt_ethdev.c.o' -c ../drivers/net/bnxt/bnxt_ethdev.c
../drivers/net/bnxt/bnxt_ethdev.c:3005:16: error: implicit declaration of function 'CMP_LEN' is invalid in C99 [-Werror,-Wimplicit-function-declaration]
                           offset * CMP_LEN(CMPL_BASE_TYPE_RX_L2);
                                    ^
../drivers/net/bnxt/bnxt_ethdev.c:3049:14: error: implicit declaration of function 'BNXT_RX_L2_AGG_BUFS' is invalid in C99 [-Werror,-Wimplicit-function-declaration]
                        agg_cnt = BNXT_RX_L2_AGG_BUFS(rxcmp);
                                  ^
../drivers/net/bnxt/bnxt_ethdev.c:3050:26: error: implicit declaration of function 'CMP_LEN' is invalid in C99 [-Werror,-Wimplicit-function-declaration]
                        raw_cons = raw_cons + CMP_LEN(cmpl_type) + agg_cnt;
                                              ^
3 errors generated.
[1038/3166] Generating rte_raw_octeontx2_dma.sym_chk with a meson_exe.py custom command.
[1039/3166] Linking target drivers/librte_net_bnx2x.so.21.2.
ninja: build stopped: subcommand failed.
##[error]Process completed with exit code 1.
####################################################################################
#### [End job log] ubuntu-18.04-clang-static at step "Build and test"
####################################################################################




####################################################################################
#### [Begin job log] ubuntu-18.04-clang-shared-doc+tests at step "Build and test"
####################################################################################
[1098/3382] Compiling C object 'drivers/drivers@@tmp_rte_net_bnxt at sta/net_bnxt_tf_ulp_ulp_def_rules.c.o'.
[1099/3382] Compiling C object 'drivers/drivers@@tmp_rte_net_bnxt at sta/net_bnxt_tf_ulp_ulp_fc_mgr.c.o'.
[1100/3382] Compiling C object 'drivers/drivers@@tmp_rte_net_bnxt at sta/net_bnxt_tf_ulp_ulp_port_db.c.o'.
[1101/3382] Compiling C object 'drivers/drivers@@tmp_rte_net_bnxt at sta/net_bnxt_tf_ulp_ulp_tun.c.o'.
[1102/3382] Compiling C object 'drivers/drivers@@tmp_rte_net_bnxt at sta/net_bnxt_tf_ulp_ulp_template_db_wh_plus_class.c.o'.
[1103/3382] Compiling C object 'drivers/drivers@@tmp_rte_net_bnxt at sta/net_bnxt_tf_ulp_ulp_template_db_wh_plus_act.c.o'.
[1104/3382] Compiling C object 'drivers/drivers@@tmp_rte_net_bnxt at sta/net_bnxt_tf_ulp_ulp_template_db_stingray_act.c.o'.
[1105/3382] Compiling C object 'drivers/drivers@@tmp_rte_net_bnxt at sta/net_bnxt_tf_ulp_ulp_template_db_stingray_class.c.o'.
[1106/3382] Compiling C object 'drivers/drivers@@tmp_rte_net_bnxt at sta/net_bnxt_bnxt_ethdev.c.o'.
FAILED: drivers/drivers@@tmp_rte_net_bnxt at sta/net_bnxt_bnxt_ethdev.c.o 
ccache clang -Idrivers/drivers@@tmp_rte_net_bnxt at sta -Idrivers -I../drivers -Idrivers/net/bnxt -I../drivers/net/bnxt -I../drivers/net/bnxt/tf_ulp -I../drivers/net/bnxt/tf_core -Ilib/librte_ethdev -I../lib/librte_ethdev -I. -I../ -Iconfig -I../config -Ilib/librte_eal/include -I../lib/librte_eal/include -Ilib/librte_eal/linux/include -I../lib/librte_eal/linux/include -Ilib/librte_eal/x86/include -I../lib/librte_eal/x86/include -Ilib/librte_eal/common -I../lib/librte_eal/common -Ilib/librte_eal -I../lib/librte_eal -Ilib/librte_kvargs -I../lib/librte_kvargs -Ilib/librte_telemetry/../librte_metrics -I../lib/librte_telemetry/../librte_metrics -Ilib/librte_telemetry -I../lib/librte_telemetry -Ilib/librte_net -I../lib/librte_net -Ilib/librte_mbuf -I../lib/librte_mbuf -Ilib/librte_mempool -I../lib/librte_mempool -Ilib/librte_ring -I../lib/librte_ring -Ilib/librte_meter -I../lib/librte_meter -Idrivers/bus/pci -I../drivers/bus/pci -I../drivers/bus/pci/linux -Ilib/librte_pci -I../lib/librte_pci -Idrivers/bus/vdev -I../drivers/bus/vdev -Xclang -fcolor-diagnostics -pipe -D_FILE_OFFSET_BITS=64 -Wall -Winvalid-pch -Werror -O2 -g -include rte_config.h -Wextra -Wcast-qual -Wdeprecated -Wformat -Wformat-nonliteral -Wformat-security -Wmissing-declarations -Wmissing-prototypes -Wnested-externs -Wold-style-definition -Wpointer-arith -Wsign-compare -Wstrict-prototypes -Wundef -Wwrite-strings -Wno-address-of-packed-member -Wno-missing-field-initializers -D_GNU_SOURCE -fPIC -march=corei7 -DALLOW_EXPERIMENTAL_API -DALLOW_INTERNAL_API  -MD -MQ 'drivers/drivers@@tmp_rte_net_bnxt at sta/net_bnxt_bnxt_ethdev.c.o' -MF 'drivers/drivers@@tmp_rte_net_bnxt at sta/net_bnxt_bnxt_ethdev.c.o.d' -o 'drivers/drivers@@tmp_rte_net_bnxt at sta/net_bnxt_bnxt_ethdev.c.o' -c ../drivers/net/bnxt/bnxt_ethdev.c
../drivers/net/bnxt/bnxt_ethdev.c:3005:16: error: implicit declaration of function 'CMP_LEN' is invalid in C99 [-Werror,-Wimplicit-function-declaration]
                           offset * CMP_LEN(CMPL_BASE_TYPE_RX_L2);
                                    ^
../drivers/net/bnxt/bnxt_ethdev.c:3049:14: error: implicit declaration of function 'BNXT_RX_L2_AGG_BUFS' is invalid in C99 [-Werror,-Wimplicit-function-declaration]
                        agg_cnt = BNXT_RX_L2_AGG_BUFS(rxcmp);
                                  ^
../drivers/net/bnxt/bnxt_ethdev.c:3050:26: error: implicit declaration of function 'CMP_LEN' is invalid in C99 [-Werror,-Wimplicit-function-declaration]
                        raw_cons = raw_cons + CMP_LEN(cmpl_type) + agg_cnt;
                                              ^
3 errors generated.
[1107/3382] Compiling C object 'drivers/drivers@@tmp_rte_net_bnxt at sta/net_bnxt_bnxt_rxtx_vec_sse.c.o'.
[1108/3382] Compiling C object 'drivers/drivers@@tmp_rte_net_bnxt at sta/net_bnxt_rte_pmd_bnxt.c.o'.
ninja: build stopped: subcommand failed.
##[error]Process completed with exit code 1.
####################################################################################
#### [End job log] ubuntu-18.04-clang-shared-doc+tests at step "Build and test"
####################################################################################




####################################################################################
#### [Begin job log] ubuntu-18.04-gcc-static-i386 at step "Build and test"
####################################################################################
[936/2571] Compiling C object 'drivers/drivers@@tmp_rte_net_cxgbe at sta/net_cxgbe_base_t4vf_hw.c.o'.
[937/2571] Compiling C object 'drivers/drivers@@tmp_rte_net_cxgbe at sta/net_cxgbe_smt.c.o'.
[938/2571] Linking static target drivers/libtmp_rte_net_cxgbe.a.
[939/2571] Compiling C object 'drivers/drivers@@tmp_rte_net_dpaa at sta/net_dpaa_dpaa_ethdev.c.o'.
[940/2571] Generating rte_net_cxgbe_def with a custom command.
[941/2571] Generating rte_net_cxgbe_mingw with a custom command.
[942/2571] Compiling C object 'drivers/drivers@@tmp_rte_net_bnxt at sta/net_bnxt_bnxt_ethdev.c.o'.
FAILED: drivers/drivers@@tmp_rte_net_bnxt at sta/net_bnxt_bnxt_ethdev.c.o 
ccache gcc -Idrivers/drivers@@tmp_rte_net_bnxt at sta -Idrivers -I../drivers -Idrivers/net/bnxt -I../drivers/net/bnxt -I../drivers/net/bnxt/tf_ulp -I../drivers/net/bnxt/tf_core -Ilib/librte_ethdev -I../lib/librte_ethdev -I. -I../ -Iconfig -I../config -Ilib/librte_eal/include -I../lib/librte_eal/include -Ilib/librte_eal/linux/include -I../lib/librte_eal/linux/include -Ilib/librte_eal/x86/include -I../lib/librte_eal/x86/include -Ilib/librte_eal/common -I../lib/librte_eal/common -Ilib/librte_eal -I../lib/librte_eal -Ilib/librte_kvargs -I../lib/librte_kvargs -Ilib/librte_telemetry/../librte_metrics -I../lib/librte_telemetry/../librte_metrics -Ilib/librte_telemetry -I../lib/librte_telemetry -Ilib/librte_net -I../lib/librte_net -Ilib/librte_mbuf -I../lib/librte_mbuf -Ilib/librte_mempool -I../lib/librte_mempool -Ilib/librte_ring -I../lib/librte_ring -Ilib/librte_meter -I../lib/librte_meter -Idrivers/bus/pci -I../drivers/bus/pci -I../drivers/bus/pci/linux -Ilib/librte_pci -I../lib/librte_pci -Idrivers/bus/vdev -I../drivers/bus/vdev -fdiagnostics-color=always -pipe -D_FILE_OFFSET_BITS=64 -Wall -Winvalid-pch -Werror -O2 -g -include rte_config.h -Wextra -Wcast-qual -Wdeprecated -Wformat -Wformat-nonliteral -Wformat-security -Wmissing-declarations -Wmissing-prototypes -Wnested-externs -Wold-style-definition -Wpointer-arith -Wsign-compare -Wstrict-prototypes -Wundef -Wwrite-strings -Wno-missing-field-initializers -Wno-pointer-to-int-cast -D_GNU_SOURCE -m32 -fPIC -march=corei7 -DALLOW_EXPERIMENTAL_API -DALLOW_INTERNAL_API -Wno-format-truncation  -MD -MQ 'drivers/drivers@@tmp_rte_net_bnxt at sta/net_bnxt_bnxt_ethdev.c.o' -MF 'drivers/drivers@@tmp_rte_net_bnxt at sta/net_bnxt_bnxt_ethdev.c.o.d' -o 'drivers/drivers@@tmp_rte_net_bnxt at sta/net_bnxt_bnxt_ethdev.c.o' -c ../drivers/net/bnxt/bnxt_ethdev.c
../drivers/net/bnxt/bnxt_ethdev.c: In function ‘bnxt_rx_descriptor_status_op’:
../drivers/net/bnxt/bnxt_ethdev.c:3005:16: error: implicit declaration of function ‘CMP_LEN’; did you mean ‘CMSG_LEN’? [-Werror=implicit-function-declaration]
       offset * CMP_LEN(CMPL_BASE_TYPE_RX_L2);
                ^~~~~~~
                CMSG_LEN
../drivers/net/bnxt/bnxt_ethdev.c:3005:16: error: nested extern declaration of ‘CMP_LEN’ [-Werror=nested-externs]
../drivers/net/bnxt/bnxt_ethdev.c:3049:14: error: implicit declaration of function ‘BNXT_RX_L2_AGG_BUFS’; did you mean ‘BNXT_TPA_END_AGG_BUFS’? [-Werror=implicit-function-declaration]
    agg_cnt = BNXT_RX_L2_AGG_BUFS(rxcmp);
              ^~~~~~~~~~~~~~~~~~~
              BNXT_TPA_END_AGG_BUFS
../drivers/net/bnxt/bnxt_ethdev.c:3049:14: error: nested extern declaration of ‘BNXT_RX_L2_AGG_BUFS’ [-Werror=nested-externs]
cc1: all warnings being treated as errors
[943/2571] Compiling C object 'drivers/drivers@@tmp_rte_net_dpaa at sta/net_dpaa_dpaa_rxtx.c.o'.
[944/2571] Generating rte_net_cxgbe.pmd.c with a custom command.
ninja: build stopped: subcommand failed.
##[error]Process completed with exit code 1.
####################################################################################
#### [End job log] ubuntu-18.04-gcc-static-i386 at step "Build and test"
####################################################################################




####################################################################################
#### [Begin job log] ubuntu-18.04-gcc-static-aarch64 at step "Build and test"
####################################################################################
[530/3164] Generating rte_graph_def with a custom command.
[531/3164] Compiling C object 'lib/lib@@rte_graph at sta/librte_graph_graph_debug.c.o'.
[532/3164] Compiling C object 'lib/lib@@rte_graph at sta/librte_graph_graph_stats.c.o'.
[533/3164] Compiling C object 'lib/lib@@rte_graph at sta/librte_graph_graph_populate.c.o'.
[534/3164] Linking static target lib/librte_graph.a.
[535/3164] Generating rte_graph_mingw with a custom command.
[536/3164] Compiling C object 'drivers/drivers@@tmp_rte_net_bnxt at sta/net_bnxt_bnxt_ethdev.c.o'.
FAILED: drivers/drivers@@tmp_rte_net_bnxt at sta/net_bnxt_bnxt_ethdev.c.o 
ccache gcc -Idrivers/drivers@@tmp_rte_net_bnxt at sta -Idrivers -I../drivers -Idrivers/net/bnxt -I../drivers/net/bnxt -I../drivers/net/bnxt/tf_ulp -I../drivers/net/bnxt/tf_core -Ilib/librte_ethdev -I../lib/librte_ethdev -I. -I../ -Iconfig -I../config -Ilib/librte_eal/include -I../lib/librte_eal/include -Ilib/librte_eal/linux/include -I../lib/librte_eal/linux/include -Ilib/librte_eal/x86/include -I../lib/librte_eal/x86/include -Ilib/librte_eal/common -I../lib/librte_eal/common -Ilib/librte_eal -I../lib/librte_eal -Ilib/librte_kvargs -I../lib/librte_kvargs -Ilib/librte_telemetry/../librte_metrics -I../lib/librte_telemetry/../librte_metrics -Ilib/librte_telemetry -I../lib/librte_telemetry -Ilib/librte_net -I../lib/librte_net -Ilib/librte_mbuf -I../lib/librte_mbuf -Ilib/librte_mempool -I../lib/librte_mempool -Ilib/librte_ring -I../lib/librte_ring -Ilib/librte_meter -I../lib/librte_meter -Idrivers/bus/pci -I../drivers/bus/pci -I../drivers/bus/pci/linux -Ilib/librte_pci -I../lib/librte_pci -Idrivers/bus/vdev -I../drivers/bus/vdev -fdiagnostics-color=always -pipe -D_FILE_OFFSET_BITS=64 -Wall -Winvalid-pch -Werror -O2 -g -include rte_config.h -Wextra -Wcast-qual -Wdeprecated -Wformat -Wformat-nonliteral -Wformat-security -Wmissing-declarations -Wmissing-prototypes -Wnested-externs -Wold-style-definition -Wpointer-arith -Wsign-compare -Wstrict-prototypes -Wundef -Wwrite-strings -Wno-missing-field-initializers -D_GNU_SOURCE -fPIC -march=corei7 -DALLOW_EXPERIMENTAL_API -DALLOW_INTERNAL_API -Wno-format-truncation  -MD -MQ 'drivers/drivers@@tmp_rte_net_bnxt at sta/net_bnxt_bnxt_ethdev.c.o' -MF 'drivers/drivers@@tmp_rte_net_bnxt at sta/net_bnxt_bnxt_ethdev.c.o.d' -o 'drivers/drivers@@tmp_rte_net_bnxt at sta/net_bnxt_bnxt_ethdev.c.o' -c ../drivers/net/bnxt/bnxt_ethdev.c
../drivers/net/bnxt/bnxt_ethdev.c: In function ‘bnxt_rx_descriptor_status_op’:
../drivers/net/bnxt/bnxt_ethdev.c:3005:16: error: implicit declaration of function ‘CMP_LEN’; did you mean ‘CMSG_LEN’? [-Werror=implicit-function-declaration]
       offset * CMP_LEN(CMPL_BASE_TYPE_RX_L2);
                ^~~~~~~
                CMSG_LEN
../drivers/net/bnxt/bnxt_ethdev.c:3005:16: error: nested extern declaration of ‘CMP_LEN’ [-Werror=nested-externs]
../drivers/net/bnxt/bnxt_ethdev.c:3049:14: error: implicit declaration of function ‘BNXT_RX_L2_AGG_BUFS’; did you mean ‘BNXT_TPA_END_AGG_BUFS’? [-Werror=implicit-function-declaration]
    agg_cnt = BNXT_RX_L2_AGG_BUFS(rxcmp);
              ^~~~~~~~~~~~~~~~~~~
              BNXT_TPA_END_AGG_BUFS
../drivers/net/bnxt/bnxt_ethdev.c:3049:14: error: nested extern declaration of ‘BNXT_RX_L2_AGG_BUFS’ [-Werror=nested-externs]
cc1: all warnings being treated as errors
[537/3164] Generating pipeline.sym_chk with a meson_exe.py custom command.
[538/3164] Generating graph.sym_chk with a meson_exe.py custom command.
ninja: build stopped: subcommand failed.
##[error]Process completed with exit code 1.
####################################################################################
#### [End job log] ubuntu-18.04-gcc-static-aarch64 at step "Build and test"
####################################################################################




####################################################################################
#### [Begin job log] ubuntu-18.04-gcc-shared-aarch64 at step "Build and test"
####################################################################################
[1140/3377] Compiling C object 'drivers/drivers@@rte_net_cxgbe at sha/meson-generated_.._rte_net_cxgbe.pmd.c.o'.
[1141/3377] Linking static target drivers/libtmp_rte_net_dpaa.a.
[1142/3377] Linking static target drivers/librte_net_cxgbe.a.
[1143/3377] Generating rte_net_dpaa.pmd.c with a custom command.
[1144/3377] Compiling C object 'drivers/drivers@@rte_net_dpaa at sta/meson-generated_.._rte_net_dpaa.pmd.c.o'.
[1145/3377] Linking static target drivers/librte_net_dpaa.a.
[1146/3377] Compiling C object 'drivers/drivers@@tmp_rte_net_bnxt at sta/net_bnxt_bnxt_ethdev.c.o'.
FAILED: drivers/drivers@@tmp_rte_net_bnxt at sta/net_bnxt_bnxt_ethdev.c.o 
ccache gcc -Idrivers/drivers@@tmp_rte_net_bnxt at sta -Idrivers -I../drivers -Idrivers/net/bnxt -I../drivers/net/bnxt -I../drivers/net/bnxt/tf_ulp -I../drivers/net/bnxt/tf_core -Ilib/librte_ethdev -I../lib/librte_ethdev -I. -I../ -Iconfig -I../config -Ilib/librte_eal/include -I../lib/librte_eal/include -Ilib/librte_eal/linux/include -I../lib/librte_eal/linux/include -Ilib/librte_eal/x86/include -I../lib/librte_eal/x86/include -Ilib/librte_eal/common -I../lib/librte_eal/common -Ilib/librte_eal -I../lib/librte_eal -Ilib/librte_kvargs -I../lib/librte_kvargs -Ilib/librte_telemetry/../librte_metrics -I../lib/librte_telemetry/../librte_metrics -Ilib/librte_telemetry -I../lib/librte_telemetry -Ilib/librte_net -I../lib/librte_net -Ilib/librte_mbuf -I../lib/librte_mbuf -Ilib/librte_mempool -I../lib/librte_mempool -Ilib/librte_ring -I../lib/librte_ring -Ilib/librte_meter -I../lib/librte_meter -Idrivers/bus/pci -I../drivers/bus/pci -I../drivers/bus/pci/linux -Ilib/librte_pci -I../lib/librte_pci -Idrivers/bus/vdev -I../drivers/bus/vdev -fdiagnostics-color=always -pipe -D_FILE_OFFSET_BITS=64 -Wall -Winvalid-pch -Werror -O2 -g -include rte_config.h -Wextra -Wcast-qual -Wdeprecated -Wformat -Wformat-nonliteral -Wformat-security -Wmissing-declarations -Wmissing-prototypes -Wnested-externs -Wold-style-definition -Wpointer-arith -Wsign-compare -Wstrict-prototypes -Wundef -Wwrite-strings -Wno-missing-field-initializers -D_GNU_SOURCE -fPIC -march=corei7 -DALLOW_EXPERIMENTAL_API -DALLOW_INTERNAL_API -Wno-format-truncation  -MD -MQ 'drivers/drivers@@tmp_rte_net_bnxt at sta/net_bnxt_bnxt_ethdev.c.o' -MF 'drivers/drivers@@tmp_rte_net_bnxt at sta/net_bnxt_bnxt_ethdev.c.o.d' -o 'drivers/drivers@@tmp_rte_net_bnxt at sta/net_bnxt_bnxt_ethdev.c.o' -c ../drivers/net/bnxt/bnxt_ethdev.c
../drivers/net/bnxt/bnxt_ethdev.c: In function ‘bnxt_rx_descriptor_status_op’:
../drivers/net/bnxt/bnxt_ethdev.c:3005:16: error: implicit declaration of function ‘CMP_LEN’; did you mean ‘CMSG_LEN’? [-Werror=implicit-function-declaration]
       offset * CMP_LEN(CMPL_BASE_TYPE_RX_L2);
                ^~~~~~~
                CMSG_LEN
../drivers/net/bnxt/bnxt_ethdev.c:3005:16: error: nested extern declaration of ‘CMP_LEN’ [-Werror=nested-externs]
../drivers/net/bnxt/bnxt_ethdev.c:3049:14: error: implicit declaration of function ‘BNXT_RX_L2_AGG_BUFS’; did you mean ‘BNXT_TPA_END_AGG_BUFS’? [-Werror=implicit-function-declaration]
    agg_cnt = BNXT_RX_L2_AGG_BUFS(rxcmp);
              ^~~~~~~~~~~~~~~~~~~
              BNXT_TPA_END_AGG_BUFS
../drivers/net/bnxt/bnxt_ethdev.c:3049:14: error: nested extern declaration of ‘BNXT_RX_L2_AGG_BUFS’ [-Werror=nested-externs]
cc1: all warnings being treated as errors
[1147/3377] Generating rte_net_cxgbe.sym_chk with a meson_exe.py custom command.
[1148/3377] Generating rte_net_dpaa.sym_chk with a meson_exe.py custom command.
ninja: build stopped: subcommand failed.
##[error]Process completed with exit code 1.
####################################################################################
#### [End job log] ubuntu-18.04-gcc-shared-aarch64 at step "Build and test"
####################################################################################
--------------------------------END LOGS-----------------------------


More information about the test-report mailing list