[dpdk-test-report] |FAILURE| pw(88517) crypto/qat: support Single-Pass GMAC on QAT GEN3

sys_stv at intel.com sys_stv at intel.com
Fri Mar 5 14:28:07 CET 2021


Test-Label: Intel-compilation
Test-Status: FAILURE
http://dpdk.org/patch/88517

_Compilation issues_

Submitter: Adam Dybkowski <adamx.dybkowski at intel.com>
Date: 2021-03-05 12:45:12
Reply_mail: 20210305124512.16286-1-adamx.dybkowski at intel.com

DPDK git baseline: Repo:dpdk-next-crypto, CommitID: 51fe32138c860992f228dbf19416ffd3b8e8baf4


Meson Build Summary: 22 Builds Done, 16 Successful, 6 Failures, 0 Blocked

+------------------+------------+--------------+------------+------------+-----------+----------+
| os               | gcc-static | clang-static | icc-static | gcc-shared | gcc-debug | document |
+------------------+------------+--------------+------------+------------+-----------+----------+
| UB2004-64        | pass       | pass         | pass       |            |           | pass     |
| RHEL83-64        | pass       |              |            |            |           |          |
| FC33-64          | pass       | pass         |            |            |           |          |
| CentOsStream8-64 | pass       |              |            |            |           |          |
| UB2010-64        | pass       |              |            |            |           |          |
| WIN10-64         |            | pass         |            |            |           |          |
| UB2004-32        | pass       |              |            |            |           |          |
| CENTOS83-64      | pass       | pass         | pass       | pass       | pass      |          |
| FreeBSD1201-64   | FAIL       | FAIL         |            | FAIL       | FAIL      |          |
| SUSE15-64        | FAIL       | FAIL         |            |            |           |          |
+------------------+------------+--------------+------------+------------+-----------+----------+
Test environment and configuration as below:


OS: UB2004-64
	Kernel Version: 5.6.0-050600-generic
	GCC Version: gcc (Ubuntu 10-20200416-0ubuntu1) 10.0.1 20200416 (experimental) [master revision 3c3f12e2a76:dcee354ce56:44b326839d864fc10c459916abcc97f35a9ac3de]
	Clang Version: 10.0.0-4ubuntu1
	x86_64-native-linuxapp-clang
	x86_64-native-linuxapp-gcc
	x86_64-native-linuxapp-icc
	x86_64-native-linuxapp-doc

OS: RHEL83-64
	Kernel Version: 4.18.0-240.el8.x86_64
	GCC Version: gcc (GCC) 8.3.1 20191121 (Red Hat 8.3.1-5)
	Clang Version: 10.0.1 (Red Hat 10.0.1-1.module+el8.3.0+7459+90c24896)
	x86_64-native-linuxapp-gcc

OS: FC33-64
	Kernel Version: 5.8.16-300.fc33.x86_64
	GCC Version: gcc (GCC) 10.2.1 20201005 (Red Hat 10.2.1-5)
	Clang Version: 11.0.0 (Fedora 11.0.0-1.fc33)
	x86_64-native-linuxapp-gcc
	x86_64-native-linuxapp-clang

OS: CentOsStream8-64
	Kernel Version: 4.18.0-257.el8.x86_64
	GCC Version: gcc (GCC) 8.4.1 20200928 (Red Hat 8.4.1-1)
	Clang Version: 11.0.0 (Red Hat 11.0.0-0.2.rc2.module_el8.4.0+533+50191577)
	x86_64-native-linuxapp-gcc

OS: UB2010-64
	Kernel Version: 5.8.0-25-generic
	GCC Version: gcc (Ubuntu 10.2.0-13ubuntu1) 10.2.0
	Clang Version: 11.0.0-2
	x86_64-native-linuxapp-gcc

OS: WIN10-64
	Kernel Version: N/A
	GCC Version: N/A
	Clang Version: Clang 8.0.0
	x86_64-windows-clang

OS: UB2004-32
	Kernel Version: 5.6.0-050600-generic
	GCC Version: gcc (Ubuntu 9.3.0-10ubuntu2) 9.3.0
	Clang Version: 10.0.0-4ubuntu1
	i686-native-linuxapp-gcc

OS: CENTOS83-64
	Kernel Version: 4.18.0-240.1.1.el8_3.x86_64
	GCC Version: gcc (GCC) 8.3.1 20191121 (Red Hat 8.3.1-5)
	Clang Version: 10.0.1 (Red Hat 10.0.1-1.module_el8.3.0+467+cb298d5b)
	x86_64-native-linuxapp-gcc
	x86_64-native-linuxapp-clang
	x86_64-native-linuxapp-icc
	x86_64-native-linuxapp-gcc+shared
	x86_64-native-linuxapp-gcc+debug

OS: FreeBSD1201-64
	Kernel Version: 12.1-RELEASE
	GCC Version: gcc (FreeBSD Ports Collection) 9.2.0
	Clang Version: 8.0.1 (tags/RELEASE_801/final 366581) (based on LLVM 8.0.1)
	x86_64-native-bsdapp-gcc
	x86_64-native-bsdapp-clang
	x86_64-native-bsdapp-gcc+shared
	x86_64-native-bsdapp-gcc+debug

OS: SUSE15-64
	Kernel Version: 5.3.18-lp152.57-default
	GCC Version: gcc (SUSE Linux) 7.5.0
	Clang Version: 9.0.1
	x86_64-native-linuxapp-clang
	x86_64-native-linuxapp-gcc



*Build Failed #1:
OS: FreeBSD1201-64
Target: x86_64-native-bsdapp-gcc
FAILED: drivers/libtmp_rte_common_qat.a.p/common_qat_qat_qp.c.o 
gcc -Idrivers/libtmp_rte_common_qat.a.p -Idrivers -I../drivers -Idrivers/common/qat -I../drivers/common/qat -I../drivers/common/qat/qat_adf -I../drivers/crypto/qat -I../drivers/compress/qat -Idrivers/bus/pci -I../drivers/bus/pci -I../drivers/bus/pci/bsd -I. -I.. -Iconfig -I../config -Ilib/librte_eal/include -I../lib/librte_eal/include -Ilib/librte_eal/freebsd/include -I../lib/librte_eal/freebsd/include -Ilib/librte_eal/x86/include -I../lib/librte_eal/x86/include -Ilib/librte_eal/common -I../lib/librte_eal/common -Ilib/librte_eal -I../lib/librte_eal -Ilib/librte_kvargs -I../lib/librte_kvargs -Ilib/librte_metrics -I../lib/librte_metrics -Ilib/librte_telemetry -I../lib/librte_telemetry -Ilib/librte_pci -I../lib/librte_pci -Ilib/librte_cryptodev -I../lib/librte_cryptodev -Ilib/librte_mbuf -I../lib/librte_mbuf -Ilib/librte_mempool -I../lib/librte_mempool -Ilib/librte_ring -I../lib/librte_ring -Ilib/librte_rcu -I../lib/librte_rcu -Ilib/librte_net -I../lib/librte_net -Ilib/librte_compressdev -I../lib/librte_compressdev -fdiagnostics-color=always -pipe -D_FILE_OFFSET_BITS=64 -Wall -Winvalid-pch -Werror -O3 -include rte_config.h -Wextra -Wcast-qual -Wdeprecated -Wformat -Wformat-nonliteral -Wformat-security -Wmissing-declarations -Wmissing-prototypes -Wnested-externs -Wold-style-definition -Wpointer-arith -Wsign-compare -Wstrict-prototypes -Wundef -Wwrite-strings -Wno-address-of-packed-member -Wno-packed-not-aligned -Wno-missing-field-initializers -D_GNU_SOURCE -D__BSD_VISIBLE -fPIC -march=native -mno-avx512f -DALLOW_EXPERIMENTAL_API -DALLOW_INTERNAL_API -Wno-format-truncation -MD -MQ drivers/libtmp_rte_common_qat.a.p/common_qat_qat_qp.c.o -MF drivers/libtmp_rte_common_qat.a.p/common_qat_qat_qp.c.o.d -o drivers/libtmp_rte_common_qat.a.p/common_qat_qat_qp.c.o -c ../drivers/common/qat/qat_qp.c
In file included from ../drivers/common/qat/qat_qp.c:18:
../drivers/crypto/qat/qat_sym.h: In function 'qat_sym_process_response':
../drivers/crypto/qat/qat_sym.h:307:8: error: unused parameter 'op_cookie' [-Werror=unused-parameter]
  307 |  void *op_cookie)
      |  ~~~~~~^~~~~~~~~
cc1: all warnings being treated as errors
[656/2049] Generating pipeline.sym_chk with a meson_exe.py custom command
[657/2049] Compiling C object drivers/libtmp_rte_common_qat.a.p/compress_qat_qat_comp_pmd.c.o
[658/2049] Compiling C object drivers/libtmp_rte_common_qat.a.p/compress_qat_qat_comp.c.o
[659/2049] Generating rte_common_sfc_efx.sym_chk with a meson_exe.py custom command
[660/2049] Compiling C object drivers/libtmp_rte_mempool_bucket.a.p/mempool_bucket_rte_mempool_bucket.c.o
ninja: build stopped




*Build Failed #2:
OS: FreeBSD1201-64
Target: x86_64-native-bsdapp-clang
FAILED: drivers/libtmp_rte_common_qat.a.p/common_qat_qat_qp.c.o 
clang -Idrivers/libtmp_rte_common_qat.a.p -Idrivers -I../drivers -Idrivers/common/qat -I../drivers/common/qat -I../drivers/common/qat/qat_adf -I../drivers/crypto/qat -I../drivers/compress/qat -Idrivers/bus/pci -I../drivers/bus/pci -I../drivers/bus/pci/bsd -I. -I.. -Iconfig -I../config -Ilib/librte_eal/include -I../lib/librte_eal/include -Ilib/librte_eal/freebsd/include -I../lib/librte_eal/freebsd/include -Ilib/librte_eal/x86/include -I../lib/librte_eal/x86/include -Ilib/librte_eal/common -I../lib/librte_eal/common -Ilib/librte_eal -I../lib/librte_eal -Ilib/librte_kvargs -I../lib/librte_kvargs -Ilib/librte_metrics -I../lib/librte_metrics -Ilib/librte_telemetry -I../lib/librte_telemetry -Ilib/librte_pci -I../lib/librte_pci -Ilib/librte_cryptodev -I../lib/librte_cryptodev -Ilib/librte_mbuf -I../lib/librte_mbuf -Ilib/librte_mempool -I../lib/librte_mempool -Ilib/librte_ring -I../lib/librte_ring -Ilib/librte_rcu -I../lib/librte_rcu -Ilib/librte_net -I../lib/librte_net -Ilib/librte_compressdev -I../lib/librte_compressdev -Xclang -fcolor-diagnostics -pipe -D_FILE_OFFSET_BITS=64 -Wall -Winvalid-pch -Werror -O3 -include rte_config.h -Wextra -Wcast-qual -Wdeprecated -Wformat -Wformat-nonliteral -Wformat-security -Wmissing-declarations -Wmissing-prototypes -Wnested-externs -Wold-style-definition -Wpointer-arith -Wsign-compare -Wstrict-prototypes -Wundef -Wwrite-strings -Wno-address-of-packed-member -Wno-missing-field-initializers -D_GNU_SOURCE -D__BSD_VISIBLE -fPIC -march=native -mno-avx512f -DALLOW_EXPERIMENTAL_API -DALLOW_INTERNAL_API -MD -MQ drivers/libtmp_rte_common_qat.a.p/common_qat_qat_qp.c.o -MF drivers/libtmp_rte_common_qat.a.p/common_qat_qat_qp.c.o.d -o drivers/libtmp_rte_common_qat.a.p/common_qat_qat_qp.c.o -c ../drivers/common/qat/qat_qp.c
In file included from ../drivers/common/qat/qat_qp.c:18:
../drivers/crypto/qat/qat_sym.h:307:8: error: unused parameter 'op_cookie' [-Werror,-Wunused-parameter]
        void *op_cookie)
              ^
1 error generated.
[647/2049] Linking target lib/librte_pipeline.so.21.2
[648/2049] Generating rte_bus_vdev.sym_chk with a meson_exe.py custom command
[649/2049] Generating rte_bus_pci.sym_chk with a meson_exe.py custom command
[650/2049] Compiling C object drivers/libtmp_rte_common_qat.a.p/common_qat_qat_device.c.o
[651/2049] Generating rte_common_sfc_efx.sym_chk with a meson_exe.py custom command
ninja: build stopped




*Build Failed #3:
OS: FreeBSD1201-64
Target: x86_64-native-bsdapp-gcc+shared
FAILED: drivers/libtmp_rte_common_qat.a.p/common_qat_qat_qp.c.o 
gcc -Idrivers/libtmp_rte_common_qat.a.p -Idrivers -I../drivers -Idrivers/common/qat -I../drivers/common/qat -I../drivers/common/qat/qat_adf -I../drivers/crypto/qat -I../drivers/compress/qat -Idrivers/bus/pci -I../drivers/bus/pci -I../drivers/bus/pci/bsd -I. -I.. -Iconfig -I../config -Ilib/librte_eal/include -I../lib/librte_eal/include -Ilib/librte_eal/freebsd/include -I../lib/librte_eal/freebsd/include -Ilib/librte_eal/x86/include -I../lib/librte_eal/x86/include -Ilib/librte_eal/common -I../lib/librte_eal/common -Ilib/librte_eal -I../lib/librte_eal -Ilib/librte_kvargs -I../lib/librte_kvargs -Ilib/librte_metrics -I../lib/librte_metrics -Ilib/librte_telemetry -I../lib/librte_telemetry -Ilib/librte_pci -I../lib/librte_pci -Ilib/librte_cryptodev -I../lib/librte_cryptodev -Ilib/librte_mbuf -I../lib/librte_mbuf -Ilib/librte_mempool -I../lib/librte_mempool -Ilib/librte_ring -I../lib/librte_ring -Ilib/librte_rcu -I../lib/librte_rcu -Ilib/librte_net -I../lib/librte_net -Ilib/librte_compressdev -I../lib/librte_compressdev -fdiagnostics-color=always -pipe -D_FILE_OFFSET_BITS=64 -Wall -Winvalid-pch -Werror -O3 -include rte_config.h -Wextra -Wcast-qual -Wdeprecated -Wformat -Wformat-nonliteral -Wformat-security -Wmissing-declarations -Wmissing-prototypes -Wnested-externs -Wold-style-definition -Wpointer-arith -Wsign-compare -Wstrict-prototypes -Wundef -Wwrite-strings -Wno-address-of-packed-member -Wno-packed-not-aligned -Wno-missing-field-initializers -D_GNU_SOURCE -D__BSD_VISIBLE -fPIC -march=native -mno-avx512f -DALLOW_EXPERIMENTAL_API -DALLOW_INTERNAL_API -Wno-format-truncation -MD -MQ drivers/libtmp_rte_common_qat.a.p/common_qat_qat_qp.c.o -MF drivers/libtmp_rte_common_qat.a.p/common_qat_qat_qp.c.o.d -o drivers/libtmp_rte_common_qat.a.p/common_qat_qat_qp.c.o -c ../drivers/common/qat/qat_qp.c
In file included from ../drivers/common/qat/qat_qp.c:18:
../drivers/crypto/qat/qat_sym.h: In function 'qat_sym_process_response':
../drivers/crypto/qat/qat_sym.h:307:8: error: unused parameter 'op_cookie' [-Werror=unused-parameter]
  307 |  void *op_cookie)
      |  ~~~~~~^~~~~~~~~
cc1: all warnings being treated as errors
[675/1931] Generating rte_mempool_bucket_def with a custom command
[676/1931] Compiling C object drivers/libtmp_rte_common_qat.a.p/compress_qat_qat_comp_pmd.c.o
[677/1931] Compiling C object drivers/libtmp_rte_common_qat.a.p/compress_qat_qat_comp.c.o
[678/1931] Generating rte_common_sfc_efx.sym_chk with a meson_exe.py custom command
[679/1931] Compiling C object drivers/libtmp_rte_mempool_bucket.a.p/mempool_bucket_rte_mempool_bucket.c.o
ninja: build stopped




*Build Failed #4:
OS: FreeBSD1201-64
Target: x86_64-native-bsdapp-gcc+debug
FAILED: drivers/libtmp_rte_common_qat.a.p/common_qat_qat_qp.c.o 
gcc -Idrivers/libtmp_rte_common_qat.a.p -Idrivers -I../drivers -Idrivers/common/qat -I../drivers/common/qat -I../drivers/common/qat/qat_adf -I../drivers/crypto/qat -I../drivers/compress/qat -Idrivers/bus/pci -I../drivers/bus/pci -I../drivers/bus/pci/bsd -I. -I.. -Iconfig -I../config -Ilib/librte_eal/include -I../lib/librte_eal/include -Ilib/librte_eal/freebsd/include -I../lib/librte_eal/freebsd/include -Ilib/librte_eal/x86/include -I../lib/librte_eal/x86/include -Ilib/librte_eal/common -I../lib/librte_eal/common -Ilib/librte_eal -I../lib/librte_eal -Ilib/librte_kvargs -I../lib/librte_kvargs -Ilib/librte_metrics -I../lib/librte_metrics -Ilib/librte_telemetry -I../lib/librte_telemetry -Ilib/librte_pci -I../lib/librte_pci -Ilib/librte_cryptodev -I../lib/librte_cryptodev -Ilib/librte_mbuf -I../lib/librte_mbuf -Ilib/librte_mempool -I../lib/librte_mempool -Ilib/librte_ring -I../lib/librte_ring -Ilib/librte_rcu -I../lib/librte_rcu -Ilib/librte_net -I../lib/librte_net -Ilib/librte_compressdev -I../lib/librte_compressdev -fdiagnostics-color=always -pipe -D_FILE_OFFSET_BITS=64 -Wall -Winvalid-pch -Werror -O2 -g -include rte_config.h -Wextra -Wcast-qual -Wdeprecated -Wformat -Wformat-nonliteral -Wformat-security -Wmissing-declarations -Wmissing-prototypes -Wnested-externs -Wold-style-definition -Wpointer-arith -Wsign-compare -Wstrict-prototypes -Wundef -Wwrite-strings -Wno-address-of-packed-member -Wno-packed-not-aligned -Wno-missing-field-initializers -D_GNU_SOURCE -D__BSD_VISIBLE -fPIC -march=native -mno-avx512f -DALLOW_EXPERIMENTAL_API -DALLOW_INTERNAL_API -Wno-format-truncation -MD -MQ drivers/libtmp_rte_common_qat.a.p/common_qat_qat_qp.c.o -MF drivers/libtmp_rte_common_qat.a.p/common_qat_qat_qp.c.o.d -o drivers/libtmp_rte_common_qat.a.p/common_qat_qat_qp.c.o -c ../drivers/common/qat/qat_qp.c
In file included from ../drivers/common/qat/qat_qp.c:18:
../drivers/crypto/qat/qat_sym.h: In function 'qat_sym_process_response':
../drivers/crypto/qat/qat_sym.h:307:8: error: unused parameter 'op_cookie' [-Werror=unused-parameter]
  307 |  void *op_cookie)
      |  ~~~~~~^~~~~~~~~
cc1: all warnings being treated as errors
[657/2049] Linking target lib/librte_pipeline.so.21.2
[658/2049] Compiling C object drivers/libtmp_rte_common_qat.a.p/compress_qat_qat_comp_pmd.c.o
[659/2049] Compiling C object drivers/libtmp_rte_common_qat.a.p/compress_qat_qat_comp.c.o
[660/2049] Generating rte_common_sfc_efx.sym_chk with a meson_exe.py custom command
[661/2049] Compiling C object drivers/libtmp_rte_mempool_bucket.a.p/mempool_bucket_rte_mempool_bucket.c.o
ninja: build stopped




*Build Failed #5:
OS: SUSE15-64
Target: x86_64-native-linuxapp-clang
FAILED: drivers/libtmp_rte_common_qat.a.p/common_qat_qat_qp.c.o 
clang -Idrivers/libtmp_rte_common_qat.a.p -Idrivers -I../drivers -Idrivers/common/qat -I../drivers/common/qat -I../drivers/common/qat/qat_adf -I../drivers/crypto/qat -I../drivers/compress/qat -Idrivers/bus/pci -I../drivers/bus/pci -I../drivers/bus/pci/linux -I. -I.. -Iconfig -I../config -Ilib/librte_eal/include -I../lib/librte_eal/include -Ilib/librte_eal/linux/include -I../lib/librte_eal/linux/include -Ilib/librte_eal/x86/include -I../lib/librte_eal/x86/include -Ilib/librte_eal/common -I../lib/librte_eal/common -Ilib/librte_eal -I../lib/librte_eal -Ilib/librte_kvargs -I../lib/librte_kvargs -Ilib/librte_metrics -I../lib/librte_metrics -Ilib/librte_telemetry -I../lib/librte_telemetry -Ilib/librte_pci -I../lib/librte_pci -Ilib/librte_cryptodev -I../lib/librte_cryptodev -Ilib/librte_mbuf -I../lib/librte_mbuf -Ilib/librte_mempool -I../lib/librte_mempool -Ilib/librte_ring -I../lib/librte_ring -Ilib/librte_rcu -I../lib/librte_rcu -Ilib/librte_net -I../lib/librte_net -Ilib/librte_compressdev -I../lib/librte_compressdev -Xclang -fcolor-diagnostics -pipe -D_FILE_OFFSET_BITS=64 -Wall -Winvalid-pch -Werror -O3 -include rte_config.h -Wextra -Wcast-qual -Wdeprecated -Wformat -Wformat-nonliteral -Wformat-security -Wmissing-declarations -Wmissing-prototypes -Wnested-externs -Wold-style-definition -Wpointer-arith -Wsign-compare -Wstrict-prototypes -Wundef -Wwrite-strings -Wno-address-of-packed-member -Wno-missing-field-initializers -D_GNU_SOURCE -fPIC -march=native -DALLOW_EXPERIMENTAL_API -DALLOW_INTERNAL_API -MD -MQ drivers/libtmp_rte_common_qat.a.p/common_qat_qat_qp.c.o -MF drivers/libtmp_rte_common_qat.a.p/common_qat_qat_qp.c.o.d -o drivers/libtmp_rte_common_qat.a.p/common_qat_qat_qp.c.o -c ../drivers/common/qat/qat_qp.c
In file included from ../drivers/common/qat/qat_qp.c:18:
../drivers/crypto/qat/qat_sym.h:307:8: error: unused parameter 'op_cookie' [-Werror,-Wunused-parameter]
        void *op_cookie)
              ^
1 error generated.
[776/2732] Generating pipeline.sym_chk with a custom command (wrapped by meson to capture output)
[777/2732] Compiling C object drivers/libtmp_rte_common_qat.a.p/common_qat_qat_common.c.o
[778/2732] Compiling C object drivers/librte_bus_vmbus.so.21.2.p/meson-generated_.._rte_bus_vmbus.pmd.c.o
[779/2732] Generating rte_bus_pci.sym_chk with a custom command (wrapped by meson to capture output)
[780/2732] Generating symbol file drivers/librte_bus_vdev.so.21.2.p/librte_bus_vdev.so.21.2.symbols
[781/2732] Generating rte_bus_vmbus.sym_chk with a custom command (wrapped by meson to capture output)
[782/2732] Generating rte_bus_dpaa.sym_chk with a custom command (wrapped by meson to capture output)
[783/2732] Generating rte_bus_fslmc.sym_chk with a custom command (wrapped by meson to capture output)
[784/2732] Generating rte_common_sfc_efx.sym_chk with a custom command (wrapped by meson to capture output)
ninja: build stopped




*Build Failed #6:
OS: SUSE15-64
Target: x86_64-native-linuxapp-gcc
FAILED: drivers/libtmp_rte_common_qat.a.p/common_qat_qat_qp.c.o 
gcc -Idrivers/libtmp_rte_common_qat.a.p -Idrivers -I../drivers -Idrivers/common/qat -I../drivers/common/qat -I../drivers/common/qat/qat_adf -I../drivers/crypto/qat -I../drivers/compress/qat -Idrivers/bus/pci -I../drivers/bus/pci -I../drivers/bus/pci/linux -I. -I.. -Iconfig -I../config -Ilib/librte_eal/include -I../lib/librte_eal/include -Ilib/librte_eal/linux/include -I../lib/librte_eal/linux/include -Ilib/librte_eal/x86/include -I../lib/librte_eal/x86/include -Ilib/librte_eal/common -I../lib/librte_eal/common -Ilib/librte_eal -I../lib/librte_eal -Ilib/librte_kvargs -I../lib/librte_kvargs -Ilib/librte_metrics -I../lib/librte_metrics -Ilib/librte_telemetry -I../lib/librte_telemetry -Ilib/librte_pci -I../lib/librte_pci -Ilib/librte_cryptodev -I../lib/librte_cryptodev -Ilib/librte_mbuf -I../lib/librte_mbuf -Ilib/librte_mempool -I../lib/librte_mempool -Ilib/librte_ring -I../lib/librte_ring -Ilib/librte_rcu -I../lib/librte_rcu -Ilib/librte_net -I../lib/librte_net -Ilib/librte_compressdev -I../lib/librte_compressdev -fdiagnostics-color=always -pipe -D_FILE_OFFSET_BITS=64 -Wall -Winvalid-pch -Werror -O3 -include rte_config.h -Wextra -Wcast-qual -Wdeprecated -Wformat -Wformat-nonliteral -Wformat-security -Wmissing-declarations -Wmissing-prototypes -Wnested-externs -Wold-style-definition -Wpointer-arith -Wsign-compare -Wstrict-prototypes -Wundef -Wwrite-strings -Wno-missing-field-initializers -D_GNU_SOURCE -fPIC -march=native -DALLOW_EXPERIMENTAL_API -DALLOW_INTERNAL_API -Wno-format-truncation -MD -MQ drivers/libtmp_rte_common_qat.a.p/common_qat_qat_qp.c.o -MF drivers/libtmp_rte_common_qat.a.p/common_qat_qat_qp.c.o.d -o drivers/libtmp_rte_common_qat.a.p/common_qat_qat_qp.c.o -c ../drivers/common/qat/qat_qp.c
In file included from ../drivers/common/qat/qat_qp.c:18:0:
../drivers/crypto/qat/qat_sym.h: In function ‘qat_sym_process_response’:
../drivers/crypto/qat/qat_sym.h:307:8: error: unused parameter ‘op_cookie’ [-Werror=unused-parameter]
  void *op_cookie)
        ^~~~~~~~~
cc1: all warnings being treated as errors
[785/2730] Compiling C object drivers/libtmp_rte_common_qat.a.p/compress_qat_qat_comp_pmd.c.o
[786/2730] Generating rte_bus_fslmc.sym_chk with a custom command (wrapped by meson to capture output)
[787/2730] Generating pipeline.sym_chk with a custom command (wrapped by meson to capture output)
[788/2730] Generating symbol file drivers/librte_bus_vmbus.so.21.2.p/librte_bus_vmbus.so.21.2.symbols
[789/2730] Generating symbol file drivers/librte_bus_dpaa.so.21.2.p/librte_bus_dpaa.so.21.2.symbols
[790/2730] Generating rte_common_sfc_efx.sym_chk with a custom command (wrapped by meson to capture output)
[791/2730] Compiling C object drivers/libtmp_rte_common_qat.a.p/compress_qat_qat_comp.c.o
ninja: build stopped


DPDK STV team


More information about the test-report mailing list