[dpdk-test-report] |FAILURE| pw88678 [dpdk-dev] [PATCH 36/36] event/cnxk: add Tx adapter fastpath ops

0-day Robot robot at bytheb.org
Sat Mar 6 18:57:04 CET 2021


From: robot at bytheb.org

Test-Label: github-robot
Test-Status: FAILURE
http://patchwork.dpdk.org/patch/88678/

_github build: failed_
Build URL: https://github.com/ovsrobot/dpdk/actions/runs/627663877
Build Logs:
-----------------------Summary of failed steps-----------------------
ubuntu-18.04-gcc-shared-abi+doc+tests failed at step "Build and test"
ubuntu-18.04-clang-shared-doc+tests failed at step "Build and test"
----------------------End summary of failed steps--------------------

-------------------------------BEGIN LOGS----------------------------
####################################################################################
#### [Begin job log] ubuntu-18.04-gcc-shared-abi+doc+tests at step "Build and test"
####################################################################################
[2796/3380] Compiling C object 'examples/examples@@dpdk-ip_pipeline at exe/ip_pipeline_tmgr.c.o'.
[2797/3380] Compiling C object 'examples/examples@@dpdk-ip_pipeline at exe/ip_pipeline_thread.c.o'.
[2798/3380] Compiling C object 'examples/examples@@dpdk-ip_pipeline at exe/ip_pipeline_cryptodev.c.o'.
[2799/3380] Compiling C object 'examples/examples@@dpdk-ipsec-secgw at exe/ipsec-secgw_flow.c.o'.
[2800/3380] Linking target examples/dpdk-ip_pipeline.
[2801/3380] Compiling C object 'examples/examples@@dpdk-ip_reassembly at exe/ip_reassembly_main.c.o'.
[2802/3380] Linking target examples/dpdk-ip_reassembly.
[2803/3380] Compiling C object 'examples/examples@@dpdk-ipsec-secgw at exe/ipsec-secgw_ipsec.c.o'.
[2804/3380] Compiling C object 'examples/examples@@dpdk-ipsec-secgw at exe/ipsec-secgw_parser.c.o'.
[2805/3380] Compiling C object 'examples/examples@@dpdk-ipsec-secgw at exe/ipsec-secgw_rt.c.o'.
[2806/3380] Compiling C object 'examples/examples@@dpdk-ipsec-secgw at exe/ipsec-secgw_ipsec_process.c.o'.
[2807/3380] Compiling C object 'examples/examples@@dpdk-ipsec-secgw at exe/ipsec-secgw_ipsec-secgw.c.o'.
[2808/3380] Generating html_guides with a custom command.
FAILED: doc/guides/html 
/usr/bin/python3 ../buildtools/call-sphinx-build.py /usr/bin/sphinx-build 21.05.0-rc0 /home/runner/work/dpdk/dpdk/doc/guides /home/runner/work/dpdk/dpdk/build/doc/guides -W

Warning, treated as error:
/home/runner/work/dpdk/dpdk/doc/guides/eventdevs/cnxk.rst:5:Title underline too short.

OCTEON CNXK SSO Eventdev Driver
==========================
[2809/3380] Compiling C object 'examples/examples@@dpdk-ipsec-secgw at exe/ipsec-secgw_sp4.c.o'.
[2810/3380] Compiling C object 'examples/examples@@dpdk-ipsec-secgw at exe/ipsec-secgw_ipsec_worker.c.o'.
ninja: build stopped: subcommand failed.
##[error]Process completed with exit code 1.
####################################################################################
#### [End job log] ubuntu-18.04-gcc-shared-abi+doc+tests at step "Build and test"
####################################################################################




####################################################################################
#### [Begin job log] ubuntu-18.04-clang-shared-doc+tests at step "Build and test"
####################################################################################
[2819/3382] Compiling C object 'examples/examples@@dpdk-l2fwd at exe/l2fwd_main.c.o'.
[2820/3382] Linking target examples/dpdk-kni.
[2821/3382] Compiling C object 'examples/examples@@dpdk-ipv4_multicast at exe/ipv4_multicast_main.c.o'.
[2822/3382] Linking target examples/dpdk-ipv4_multicast.
[2823/3382] Compiling C object 'examples/examples@@dpdk-l2fwd-event at exe/l2fwd-event_l2fwd_poll.c.o'.
[2824/3382] Linking target examples/dpdk-l2fwd.
[2825/3382] Compiling C object 'examples/examples@@dpdk-l2fwd-event at exe/l2fwd-event_main.c.o'.
[2826/3382] Compiling C object 'examples/examples@@dpdk-l2fwd-event at exe/l2fwd-event_l2fwd_common.c.o'.
[2827/3382] Compiling C object 'examples/examples@@dpdk-l2fwd-event at exe/l2fwd-event_l2fwd_event.c.o'.
[2828/3382] Compiling C object 'examples/examples@@dpdk-l2fwd-keepalive at exe/l2fwd-keepalive_main.c.o'.
[2829/3382] Compiling C object 'examples/examples@@dpdk-l2fwd-event at exe/l2fwd-event_l2fwd_event_generic.c.o'.
[2830/3382] Compiling C object 'examples/examples@@dpdk-l2fwd-keepalive at exe/l2fwd-keepalive_shm.c.o'.
[2831/3382] Generating html_guides with a custom command.
FAILED: doc/guides/html 
/usr/bin/python3 ../buildtools/call-sphinx-build.py /usr/bin/sphinx-build 21.05.0-rc0 /home/runner/work/dpdk/dpdk/doc/guides /home/runner/work/dpdk/dpdk/build/doc/guides -W

Warning, treated as error:
/home/runner/work/dpdk/dpdk/doc/guides/eventdevs/cnxk.rst:5:Title underline too short.

OCTEON CNXK SSO Eventdev Driver
==========================
[2832/3382] Compiling C object 'examples/examples@@dpdk-l2fwd-jobstats at exe/l2fwd-jobstats_main.c.o'.
[2833/3382] Compiling C object 'examples/examples@@dpdk-l2fwd-crypto at exe/l2fwd-crypto_main.c.o'.
ninja: build stopped: subcommand failed.
##[error]Process completed with exit code 1.
####################################################################################
#### [End job log] ubuntu-18.04-clang-shared-doc+tests at step "Build and test"
####################################################################################
--------------------------------END LOGS-----------------------------


More information about the test-report mailing list