[dpdk-test-report] |FAILURE| pw(88812) librte_eal/common: fix return type of rte_bsf64

sys_stv at intel.com sys_stv at intel.com
Wed Mar 10 08:50:36 CET 2021


Test-Label: Intel-compilation
Test-Status: FAILURE
http://dpdk.org/patch/88812

_Compilation issues_

Submitter: Tyler Retzlaff <roretzla at linux.microsoft.com>
Date: 2021-03-10 06:41:06
Reply_mail: 1615358466-12761-1-git-send-email-roretzla at linux.microsoft.com

DPDK git baseline: Repo:dpdk, CommitID: 1e28e842e08428ff5716fbe909bf5acd0365aaf6


Meson Build Summary: 22 Builds Done, 3 Successful, 19 Failures, 0 Blocked

+------------------+------------+--------------+------------+------------+-----------+----------+
| os               | gcc-static | clang-static | icc-static | gcc-shared | gcc-debug | document |
+------------------+------------+--------------+------------+------------+-----------+----------+
| UB2004-64        | FAIL       | FAIL         | pass       |            |           | FAIL     |
| RHEL83-64        | FAIL       |              |            |            |           |          |
| FC33-64          | FAIL       | FAIL         |            |            |           |          |
| CentOsStream8-64 | FAIL       |              |            |            |           |          |
| UB2010-64        | FAIL       |              |            |            |           |          |
| WIN10-64         |            | pass         |            |            |           |          |
| UB2004-32        | FAIL       |              |            |            |           |          |
| CENTOS83-64      | FAIL       | FAIL         | pass       | FAIL       | FAIL      |          |
| FreeBSD1201-64   | FAIL       | FAIL         |            | FAIL       | FAIL      |          |
| SUSE15-64        | FAIL       | FAIL         |            |            |           |          |
+------------------+------------+--------------+------------+------------+-----------+----------+
Test environment and configuration as below:


OS: UB2004-64
	Kernel Version: 5.6.0-050600-generic
	GCC Version: gcc (Ubuntu 10-20200416-0ubuntu1) 10.0.1 20200416 (experimental) [master revision 3c3f12e2a76:dcee354ce56:44b326839d864fc10c459916abcc97f35a9ac3de]
	Clang Version: 10.0.0-4ubuntu1
	x86_64-native-linuxapp-clang
	x86_64-native-linuxapp-gcc
	x86_64-native-linuxapp-icc
	x86_64-native-linuxapp-doc

OS: RHEL83-64
	Kernel Version: 4.18.0-240.el8.x86_64
	GCC Version: gcc (GCC) 8.3.1 20191121 (Red Hat 8.3.1-5)
	Clang Version: 10.0.1 (Red Hat 10.0.1-1.module+el8.3.0+7459+90c24896)
	x86_64-native-linuxapp-gcc

OS: FC33-64
	Kernel Version: 5.8.16-300.fc33.x86_64
	GCC Version: gcc (GCC) 10.2.1 20201005 (Red Hat 10.2.1-5)
	Clang Version: 11.0.0 (Fedora 11.0.0-1.fc33)
	x86_64-native-linuxapp-gcc
	x86_64-native-linuxapp-clang

OS: CentOsStream8-64
	Kernel Version: 4.18.0-257.el8.x86_64
	GCC Version: gcc (GCC) 8.4.1 20200928 (Red Hat 8.4.1-1)
	Clang Version: 11.0.0 (Red Hat 11.0.0-0.2.rc2.module_el8.4.0+533+50191577)
	x86_64-native-linuxapp-gcc

OS: UB2010-64
	Kernel Version: 5.8.0-25-generic
	GCC Version: gcc (Ubuntu 10.2.0-13ubuntu1) 10.2.0
	Clang Version: 11.0.0-2
	x86_64-native-linuxapp-gcc

OS: WIN10-64
	Kernel Version: N/A
	GCC Version: N/A
	Clang Version: Clang 8.0.0
	x86_64-windows-clang

OS: UB2004-32
	Kernel Version: 5.6.0-050600-generic
	GCC Version: gcc (Ubuntu 9.3.0-10ubuntu2) 9.3.0
	Clang Version: 10.0.0-4ubuntu1
	i686-native-linuxapp-gcc

OS: CENTOS83-64
	Kernel Version: 4.18.0-240.1.1.el8_3.x86_64
	GCC Version: gcc (GCC) 8.3.1 20191121 (Red Hat 8.3.1-5)
	Clang Version: 10.0.1 (Red Hat 10.0.1-1.module_el8.3.0+467+cb298d5b)
	x86_64-native-linuxapp-gcc
	x86_64-native-linuxapp-clang
	x86_64-native-linuxapp-icc
	x86_64-native-linuxapp-gcc+shared
	x86_64-native-linuxapp-gcc+debug

OS: FreeBSD1201-64
	Kernel Version: 12.1-RELEASE
	GCC Version: gcc (FreeBSD Ports Collection) 9.2.0
	Clang Version: 8.0.1 (tags/RELEASE_801/final 366581) (based on LLVM 8.0.1)
	x86_64-native-bsdapp-gcc
	x86_64-native-bsdapp-clang
	x86_64-native-bsdapp-gcc+shared
	x86_64-native-bsdapp-gcc+debug

OS: SUSE15-64
	Kernel Version: 5.3.18-lp152.57-default
	GCC Version: gcc (SUSE Linux) 7.5.0
	Clang Version: 9.0.1
	x86_64-native-linuxapp-clang
	x86_64-native-linuxapp-gcc



*Build Failed #1:
OS: CENTOS83-64
Target: x86_64-native-linuxapp-gcc
FAILED: app/test/dpdk-test.p/test_mbuf.c.o 
gcc -Iapp/test/dpdk-test.p -Iapp/test -I../app/test -Ilib/librte_acl -I../lib/librte_acl -I. -I.. -Iconfig -I../config -Ilib/librte_eal/include -I../lib/librte_eal/include -Ilib/librte_eal/linux/include -I../lib/librte_eal/linux/include -Ilib/librte_eal/x86/include -I../lib/librte_eal/x86/include -Ilib/librte_eal/common -I../lib/librte_eal/common -Ilib/librte_eal -I../lib/librte_eal -Ilib/librte_kvargs -I../lib/librte_kvargs -Ilib/librte_metrics -I../lib/librte_metrics -Ilib/librte_telemetry -I../lib/librte_telemetry -Idrivers/bus/pci -I../drivers/bus/pci -I../drivers/bus/pci/linux -Ilib/librte_pci -I../lib/librte_pci -Idrivers/bus/vdev -I../drivers/bus/vdev -Ilib/librte_bitratestats -I../lib/librte_bitratestats -Ilib/librte_ethdev -I../lib/librte_ethdev -Ilib/librte_net -I../lib/librte_net -Ilib/librte_mbuf -I../lib/librte_mbuf -Ilib/librte_mempool -I../lib/librte_mempool -Ilib/librte_ring -I../lib/librte_ring -Ilib/librte_meter -I../lib/librte_meter -Ilib/librte_bpf -I../lib/librte_bpf -Ilib/librte_cfgfile -I../lib/librte_cfgfile -Ilib/librte_cmdline -I../lib/librte_cmdline -Ilib/librte_cryptodev -I../lib/librte_cryptodev -Ilib/librte_rcu -I../lib/librte_rcu -Ilib/librte_distributor -I../lib/librte_distributor -Ilib/librte_efd -I../lib/librte_efd -Ilib/librte_hash -I../lib/librte_hash -Ilib/librte_eventdev -I../lib/librte_eventdev -Ilib/librte_timer -I../lib/librte_timer -Ilib/librte_fib -I../lib/librte_fib -Ilib/librte_rib -I../lib/librte_rib -Ilib/librte_flow_classify -I../lib/librte_flow_classify -Ilib/librte_table -I../lib/librte_table -Ilib/librte_port -I../lib/librte_port -Ilib/librte_sched -I../lib/librte_sched -Ilib/librte_ip_frag -I../lib/librte_ip_frag -Ilib/librte_kni -I../lib/librte_kni -Ilib/librte_lpm -I../lib/librte_lpm -Ilib/librte_graph -I../lib/librte_graph -Ilib/librte_ipsec -I../lib/librte_ipsec -Ilib/librte_security -I../lib/librte_security -Ilib/librte_latencystats -I../lib/librte_latencystats -Ilib/librte_member -I../lib/librte_member -Ilib/librte_node -I../lib/librte_node -Ilib/librte_pipeline -I../lib/librte_pipeline -Ilib/librte_rawdev -I../lib/librte_rawdev -Ilib/librte_reorder -I../lib/librte_reorder -Ilib/librte_stack -I../lib/librte_stack -Idrivers/mempool/ring -I../drivers/mempool/ring -Idrivers/mempool/stack -I../drivers/mempool/stack -Idrivers/event/skeleton -I../drivers/event/skeleton -Idrivers/net/bonding -I../drivers/net/bonding -Idrivers/net/ring -I../drivers/net/ring -Ilib/librte_power -I../lib/librte_power -Ilib/librte_pdump -I../lib/librte_pdump -Ilib/librte_compressdev -I../lib/librte_compressdev -Idrivers/crypto/scheduler -I../drivers/crypto/scheduler -fdiagnostics-color=always -pipe -D_FILE_OFFSET_BITS=64 -Wall -Winvalid-pch -Werror -O3 -include rte_config.h -Wextra -Wcast-qual -Wdeprecated -Wformat -Wformat-nonliteral -Wformat-security -Wmissing-declarations -Wmissing-prototypes -Wnested-externs -Wold-style-definition -Wpointer-arith -Wsign-compare -Wstrict-prototypes -Wundef -Wwrite-strings -Wno-packed-not-aligned -Wno-missing-field-initializers -march=native -DALLOW_EXPERIMENTAL_API -Wno-format-truncation -D_GNU_SOURCE -fno-strict-aliasing -DALLOW_INTERNAL_API -MD -MQ app/test/dpdk-test.p/test_mbuf.c.o -MF app/test/dpdk-test.p/test_mbuf.c.o.d -o app/test/dpdk-test.p/test_mbuf.c.o -c ../app/test/test_mbuf.c
../app/test/test_mbuf.c: In function ‘test_mbuf_dyn’:
../app/test/test_mbuf.c:2658:12: error: comparison of integer expressions of different signedness: ‘int’ and ‘uint32_t’ {aka ‘unsigned int’} [-Werror=sign-compare]
  if (flag3 != rte_bsf64(PKT_LAST_FREE))
            ^~
cc1: all warnings being treated as errors
[2563/2829] Compiling C object app/test/dpdk-test.p/test_ring_mt_peek_stress_zc.c.o
[2564/2829] Compiling C object app/test/dpdk-test.p/test_ring_rts_stress.c.o
[2565/2829] Compiling C object app/test/dpdk-test.p/test_ring_st_peek_stress_zc.c.o
[2566/2829] Compiling C object app/test/dpdk-test.p/test_ring_mt_peek_stress.c.o
[2567/2829] Compiling C object app/test/dpdk-test.p/test_ring_st_peek_stress.c.o
[2568/2829] Compiling C object app/test/dpdk-test.p/test_cryptodev.c.o
[2569/2829] Compiling C object app/test/dpdk-test.p/test_memcpy_perf.c.o
[2570/2829] Compiling C object app/test/dpdk-test.p/test_ring_perf.c.o
[2571/2829] Compiling C object app/test/dpdk-test.p/test_ring.c.o
[2572/2829] Compiling C object drivers/libtmp_rte_event_octeontx2.a.p/event_octeontx2_otx2_worker.c.o
[2573/2829] Compiling C object drivers/libtmp_rte_event_octeontx2.a.p/event_octeontx2_otx2_worker_dual.c.o
ninja: build stopped




*Build Failed #2:
OS: CENTOS83-64
Target: x86_64-native-linuxapp-clang
FAILED: app/test/dpdk-test.p/test_mbuf.c.o 
clang -Iapp/test/dpdk-test.p -Iapp/test -I../app/test -Ilib/librte_acl -I../lib/librte_acl -I. -I.. -Iconfig -I../config -Ilib/librte_eal/include -I../lib/librte_eal/include -Ilib/librte_eal/linux/include -I../lib/librte_eal/linux/include -Ilib/librte_eal/x86/include -I../lib/librte_eal/x86/include -Ilib/librte_eal/common -I../lib/librte_eal/common -Ilib/librte_eal -I../lib/librte_eal -Ilib/librte_kvargs -I../lib/librte_kvargs -Ilib/librte_metrics -I../lib/librte_metrics -Ilib/librte_telemetry -I../lib/librte_telemetry -Idrivers/bus/pci -I../drivers/bus/pci -I../drivers/bus/pci/linux -Ilib/librte_pci -I../lib/librte_pci -Idrivers/bus/vdev -I../drivers/bus/vdev -Ilib/librte_bitratestats -I../lib/librte_bitratestats -Ilib/librte_ethdev -I../lib/librte_ethdev -Ilib/librte_net -I../lib/librte_net -Ilib/librte_mbuf -I../lib/librte_mbuf -Ilib/librte_mempool -I../lib/librte_mempool -Ilib/librte_ring -I../lib/librte_ring -Ilib/librte_meter -I../lib/librte_meter -Ilib/librte_bpf -I../lib/librte_bpf -Ilib/librte_cfgfile -I../lib/librte_cfgfile -Ilib/librte_cmdline -I../lib/librte_cmdline -Ilib/librte_cryptodev -I../lib/librte_cryptodev -Ilib/librte_rcu -I../lib/librte_rcu -Ilib/librte_distributor -I../lib/librte_distributor -Ilib/librte_efd -I../lib/librte_efd -Ilib/librte_hash -I../lib/librte_hash -Ilib/librte_eventdev -I../lib/librte_eventdev -Ilib/librte_timer -I../lib/librte_timer -Ilib/librte_fib -I../lib/librte_fib -Ilib/librte_rib -I../lib/librte_rib -Ilib/librte_flow_classify -I../lib/librte_flow_classify -Ilib/librte_table -I../lib/librte_table -Ilib/librte_port -I../lib/librte_port -Ilib/librte_sched -I../lib/librte_sched -Ilib/librte_ip_frag -I../lib/librte_ip_frag -Ilib/librte_kni -I../lib/librte_kni -Ilib/librte_lpm -I../lib/librte_lpm -Ilib/librte_graph -I../lib/librte_graph -Ilib/librte_ipsec -I../lib/librte_ipsec -Ilib/librte_security -I../lib/librte_security -Ilib/librte_latencystats -I../lib/librte_latencystats -Ilib/librte_member -I../lib/librte_member -Ilib/librte_node -I../lib/librte_node -Ilib/librte_pipeline -I../lib/librte_pipeline -Ilib/librte_rawdev -I../lib/librte_rawdev -Ilib/librte_reorder -I../lib/librte_reorder -Ilib/librte_stack -I../lib/librte_stack -Idrivers/mempool/ring -I../drivers/mempool/ring -Idrivers/mempool/stack -I../drivers/mempool/stack -Idrivers/event/skeleton -I../drivers/event/skeleton -Idrivers/net/bonding -I../drivers/net/bonding -Idrivers/net/ring -I../drivers/net/ring -Ilib/librte_power -I../lib/librte_power -Ilib/librte_pdump -I../lib/librte_pdump -Ilib/librte_compressdev -I../lib/librte_compressdev -Idrivers/crypto/scheduler -I../drivers/crypto/scheduler -Xclang -fcolor-diagnostics -pipe -D_FILE_OFFSET_BITS=64 -Wall -Winvalid-pch -Werror -O3 -include rte_config.h -Wextra -Wcast-qual -Wdeprecated -Wformat -Wformat-nonliteral -Wformat-security -Wmissing-declarations -Wmissing-prototypes -Wnested-externs -Wold-style-definition -Wpointer-arith -Wsign-compare -Wstrict-prototypes -Wundef -Wwrite-strings -Wno-address-of-packed-member -Wno-missing-field-initializers -march=native -DALLOW_EXPERIMENTAL_API -D_GNU_SOURCE -fno-strict-aliasing -DALLOW_INTERNAL_API -MD -MQ app/test/dpdk-test.p/test_mbuf.c.o -MF app/test/dpdk-test.p/test_mbuf.c.o.d -o app/test/dpdk-test.p/test_mbuf.c.o -c ../app/test/test_mbuf.c
../app/test/test_mbuf.c:2658:12: error: comparison of integers of different signs: 'int' and 'uint32_t' (aka 'unsigned int') [-Werror,-Wsign-compare]
        if (flag3 != rte_bsf64(PKT_LAST_FREE))
            ~~~~~ ^  ~~~~~~~~~~~~~~~~~~~~~~~~
1 error generated.
[2541/2832] Compiling C object app/test/dpdk-test.p/test_ipsec.c.o
[2542/2832] Compiling C object app/test/dpdk-test.p/test_memcpy.c.o
[2543/2832] Compiling C object app/test/dpdk-test.p/test_member.c.o
[2544/2832] Compiling C object app/test/dpdk-test.p/test_member_perf.c.o
[2545/2832] Compiling C object app/test/dpdk-test.p/test_mempool.c.o
[2546/2832] Compiling C object app/test/dpdk-test.p/test_mempool_perf.c.o
[2547/2832] Compiling C object app/test/dpdk-test.p/test_memcpy_perf.c.o
[2548/2832] Compiling C object drivers/libtmp_rte_event_octeontx2.a.p/event_octeontx2_otx2_worker.c.o
[2549/2832] Compiling C object drivers/libtmp_rte_event_octeontx2.a.p/event_octeontx2_otx2_worker_dual.c.o
ninja: build stopped




*Build Failed #3:
OS: CENTOS83-64
Target: x86_64-native-linuxapp-gcc+shared
FAILED: app/test/dpdk-test.p/test_mbuf.c.o 
gcc -Iapp/test/dpdk-test.p -Iapp/test -I../app/test -Ilib/librte_acl -I../lib/librte_acl -I. -I.. -Iconfig -I../config -Ilib/librte_eal/include -I../lib/librte_eal/include -Ilib/librte_eal/linux/include -I../lib/librte_eal/linux/include -Ilib/librte_eal/x86/include -I../lib/librte_eal/x86/include -Ilib/librte_eal/common -I../lib/librte_eal/common -Ilib/librte_eal -I../lib/librte_eal -Ilib/librte_kvargs -I../lib/librte_kvargs -Ilib/librte_metrics -I../lib/librte_metrics -Ilib/librte_telemetry -I../lib/librte_telemetry -Idrivers/bus/pci -I../drivers/bus/pci -I../drivers/bus/pci/linux -Ilib/librte_pci -I../lib/librte_pci -Idrivers/bus/vdev -I../drivers/bus/vdev -Ilib/librte_bitratestats -I../lib/librte_bitratestats -Ilib/librte_ethdev -I../lib/librte_ethdev -Ilib/librte_net -I../lib/librte_net -Ilib/librte_mbuf -I../lib/librte_mbuf -Ilib/librte_mempool -I../lib/librte_mempool -Ilib/librte_ring -I../lib/librte_ring -Ilib/librte_meter -I../lib/librte_meter -Ilib/librte_bpf -I../lib/librte_bpf -Ilib/librte_cfgfile -I../lib/librte_cfgfile -Ilib/librte_cmdline -I../lib/librte_cmdline -Ilib/librte_cryptodev -I../lib/librte_cryptodev -Ilib/librte_rcu -I../lib/librte_rcu -Ilib/librte_distributor -I../lib/librte_distributor -Ilib/librte_efd -I../lib/librte_efd -Ilib/librte_hash -I../lib/librte_hash -Ilib/librte_eventdev -I../lib/librte_eventdev -Ilib/librte_timer -I../lib/librte_timer -Ilib/librte_fib -I../lib/librte_fib -Ilib/librte_rib -I../lib/librte_rib -Ilib/librte_flow_classify -I../lib/librte_flow_classify -Ilib/librte_table -I../lib/librte_table -Ilib/librte_port -I../lib/librte_port -Ilib/librte_sched -I../lib/librte_sched -Ilib/librte_ip_frag -I../lib/librte_ip_frag -Ilib/librte_kni -I../lib/librte_kni -Ilib/librte_lpm -I../lib/librte_lpm -Ilib/librte_graph -I../lib/librte_graph -Ilib/librte_ipsec -I../lib/librte_ipsec -Ilib/librte_security -I../lib/librte_security -Ilib/librte_latencystats -I../lib/librte_latencystats -Ilib/librte_member -I../lib/librte_member -Ilib/librte_node -I../lib/librte_node -Ilib/librte_pipeline -I../lib/librte_pipeline -Ilib/librte_rawdev -I../lib/librte_rawdev -Ilib/librte_reorder -I../lib/librte_reorder -Ilib/librte_stack -I../lib/librte_stack -Idrivers/mempool/ring -I../drivers/mempool/ring -Idrivers/mempool/stack -I../drivers/mempool/stack -Idrivers/event/skeleton -I../drivers/event/skeleton -Idrivers/net/bonding -I../drivers/net/bonding -Idrivers/net/ring -I../drivers/net/ring -Ilib/librte_power -I../lib/librte_power -Ilib/librte_pdump -I../lib/librte_pdump -Ilib/librte_compressdev -I../lib/librte_compressdev -Idrivers/crypto/scheduler -I../drivers/crypto/scheduler -fdiagnostics-color=always -pipe -D_FILE_OFFSET_BITS=64 -Wall -Winvalid-pch -Werror -O3 -include rte_config.h -Wextra -Wcast-qual -Wdeprecated -Wformat -Wformat-nonliteral -Wformat-security -Wmissing-declarations -Wmissing-prototypes -Wnested-externs -Wold-style-definition -Wpointer-arith -Wsign-compare -Wstrict-prototypes -Wundef -Wwrite-strings -Wno-packed-not-aligned -Wno-missing-field-initializers -march=native -DALLOW_EXPERIMENTAL_API -Wno-format-truncation -D_GNU_SOURCE -fno-strict-aliasing -DALLOW_INTERNAL_API -MD -MQ app/test/dpdk-test.p/test_mbuf.c.o -MF app/test/dpdk-test.p/test_mbuf.c.o.d -o app/test/dpdk-test.p/test_mbuf.c.o -c ../app/test/test_mbuf.c
../app/test/test_mbuf.c: In function ‘test_mbuf_dyn’:
../app/test/test_mbuf.c:2658:12: error: comparison of integer expressions of different signedness: ‘int’ and ‘uint32_t’ {aka ‘unsigned int’} [-Werror=sign-compare]
  if (flag3 != rte_bsf64(PKT_LAST_FREE))
            ^~
cc1: all warnings being treated as errors
[2606/2672] Compiling C object app/test/dpdk-test.p/test_red.c.o
[2607/2672] Compiling C object app/test/dpdk-test.p/test_cryptodev.c.o
[2608/2672] Compiling C object app/test/dpdk-test.p/test_reorder.c.o
[2609/2672] Compiling C object app/test/dpdk-test.p/test_rib.c.o
[2610/2672] Compiling C object app/test/dpdk-test.p/test_rib6.c.o
[2611/2672] Compiling C object app/test/dpdk-test.p/test_memcpy_perf.c.o
[2612/2672] Compiling C object app/test/dpdk-test.p/test_ring.c.o
[2613/2672] Compiling C object drivers/libtmp_rte_event_octeontx2.a.p/event_octeontx2_otx2_worker.c.o
[2614/2672] Compiling C object drivers/libtmp_rte_event_octeontx2.a.p/event_octeontx2_otx2_worker_dual.c.o
ninja: build stopped




*Build Failed #4:
OS: CENTOS83-64
Target: x86_64-native-linuxapp-gcc+debug
FAILED: app/test/dpdk-test.p/test_mbuf.c.o 
gcc -Iapp/test/dpdk-test.p -Iapp/test -I../app/test -Ilib/librte_acl -I../lib/librte_acl -I. -I.. -Iconfig -I../config -Ilib/librte_eal/include -I../lib/librte_eal/include -Ilib/librte_eal/linux/include -I../lib/librte_eal/linux/include -Ilib/librte_eal/x86/include -I../lib/librte_eal/x86/include -Ilib/librte_eal/common -I../lib/librte_eal/common -Ilib/librte_eal -I../lib/librte_eal -Ilib/librte_kvargs -I../lib/librte_kvargs -Ilib/librte_metrics -I../lib/librte_metrics -Ilib/librte_telemetry -I../lib/librte_telemetry -Idrivers/bus/pci -I../drivers/bus/pci -I../drivers/bus/pci/linux -Ilib/librte_pci -I../lib/librte_pci -Idrivers/bus/vdev -I../drivers/bus/vdev -Ilib/librte_bitratestats -I../lib/librte_bitratestats -Ilib/librte_ethdev -I../lib/librte_ethdev -Ilib/librte_net -I../lib/librte_net -Ilib/librte_mbuf -I../lib/librte_mbuf -Ilib/librte_mempool -I../lib/librte_mempool -Ilib/librte_ring -I../lib/librte_ring -Ilib/librte_meter -I../lib/librte_meter -Ilib/librte_bpf -I../lib/librte_bpf -Ilib/librte_cfgfile -I../lib/librte_cfgfile -Ilib/librte_cmdline -I../lib/librte_cmdline -Ilib/librte_cryptodev -I../lib/librte_cryptodev -Ilib/librte_rcu -I../lib/librte_rcu -Ilib/librte_distributor -I../lib/librte_distributor -Ilib/librte_efd -I../lib/librte_efd -Ilib/librte_hash -I../lib/librte_hash -Ilib/librte_eventdev -I../lib/librte_eventdev -Ilib/librte_timer -I../lib/librte_timer -Ilib/librte_fib -I../lib/librte_fib -Ilib/librte_rib -I../lib/librte_rib -Ilib/librte_flow_classify -I../lib/librte_flow_classify -Ilib/librte_table -I../lib/librte_table -Ilib/librte_port -I../lib/librte_port -Ilib/librte_sched -I../lib/librte_sched -Ilib/librte_ip_frag -I../lib/librte_ip_frag -Ilib/librte_kni -I../lib/librte_kni -Ilib/librte_lpm -I../lib/librte_lpm -Ilib/librte_graph -I../lib/librte_graph -Ilib/librte_ipsec -I../lib/librte_ipsec -Ilib/librte_security -I../lib/librte_security -Ilib/librte_latencystats -I../lib/librte_latencystats -Ilib/librte_member -I../lib/librte_member -Ilib/librte_node -I../lib/librte_node -Ilib/librte_pipeline -I../lib/librte_pipeline -Ilib/librte_rawdev -I../lib/librte_rawdev -Ilib/librte_reorder -I../lib/librte_reorder -Ilib/librte_stack -I../lib/librte_stack -Idrivers/mempool/ring -I../drivers/mempool/ring -Idrivers/mempool/stack -I../drivers/mempool/stack -Idrivers/event/skeleton -I../drivers/event/skeleton -Idrivers/net/bonding -I../drivers/net/bonding -Idrivers/net/ring -I../drivers/net/ring -Ilib/librte_power -I../lib/librte_power -Ilib/librte_pdump -I../lib/librte_pdump -Ilib/librte_compressdev -I../lib/librte_compressdev -Idrivers/crypto/scheduler -I../drivers/crypto/scheduler -fdiagnostics-color=always -pipe -D_FILE_OFFSET_BITS=64 -Wall -Winvalid-pch -Werror -O2 -g -include rte_config.h -Wextra -Wcast-qual -Wdeprecated -Wformat -Wformat-nonliteral -Wformat-security -Wmissing-declarations -Wmissing-prototypes -Wnested-externs -Wold-style-definition -Wpointer-arith -Wsign-compare -Wstrict-prototypes -Wundef -Wwrite-strings -Wno-packed-not-aligned -Wno-missing-field-initializers -march=native -DALLOW_EXPERIMENTAL_API -Wno-format-truncation -D_GNU_SOURCE -fno-strict-aliasing -DALLOW_INTERNAL_API -MD -MQ app/test/dpdk-test.p/test_mbuf.c.o -MF app/test/dpdk-test.p/test_mbuf.c.o.d -o app/test/dpdk-test.p/test_mbuf.c.o -c ../app/test/test_mbuf.c
../app/test/test_mbuf.c: In function ‘test_mbuf_dyn’:
../app/test/test_mbuf.c:2658:12: error: comparison of integer expressions of different signedness: ‘int’ and ‘uint32_t’ {aka ‘unsigned int’} [-Werror=sign-compare]
  if (flag3 != rte_bsf64(PKT_LAST_FREE))
            ^~
cc1: all warnings being treated as errors
[2574/2832] Compiling C object app/test/dpdk-test.p/test_spinlock.c.o
[2575/2832] Compiling C object app/test/dpdk-test.p/test_sched.c.o
[2576/2832] Compiling C object app/test/dpdk-test.p/test_service_cores.c.o
[2577/2832] Compiling C object app/test/dpdk-test.p/test_security.c.o
[2578/2832] Compiling C object app/test/dpdk-test.p/test_ring_perf.c.o
[2579/2832] Compiling C object app/test/dpdk-test.p/test_memcpy_perf.c.o
[2580/2832] Compiling C object app/test/dpdk-test.p/test_ring.c.o
[2581/2832] Compiling C object drivers/libtmp_rte_event_octeontx2.a.p/event_octeontx2_otx2_worker.c.o
[2582/2832] Compiling C object drivers/libtmp_rte_event_octeontx2.a.p/event_octeontx2_otx2_worker_dual.c.o
ninja: build stopped




*Build Failed #5:
OS: FC33-64
Target: x86_64-native-linuxapp-gcc
FAILED: app/test/dpdk-test.p/test_mbuf.c.o 
gcc -Iapp/test/dpdk-test.p -Iapp/test -I../app/test -Ilib/librte_acl -I../lib/librte_acl -I. -I.. -Iconfig -I../config -Ilib/librte_eal/include -I../lib/librte_eal/include -Ilib/librte_eal/linux/include -I../lib/librte_eal/linux/include -Ilib/librte_eal/x86/include -I../lib/librte_eal/x86/include -Ilib/librte_eal/common -I../lib/librte_eal/common -Ilib/librte_eal -I../lib/librte_eal -Ilib/librte_kvargs -I../lib/librte_kvargs -Ilib/librte_metrics -I../lib/librte_metrics -Ilib/librte_telemetry -I../lib/librte_telemetry -Idrivers/bus/pci -I../drivers/bus/pci -I../drivers/bus/pci/linux -Ilib/librte_pci -I../lib/librte_pci -Idrivers/bus/vdev -I../drivers/bus/vdev -Ilib/librte_bitratestats -I../lib/librte_bitratestats -Ilib/librte_ethdev -I../lib/librte_ethdev -Ilib/librte_net -I../lib/librte_net -Ilib/librte_mbuf -I../lib/librte_mbuf -Ilib/librte_mempool -I../lib/librte_mempool -Ilib/librte_ring -I../lib/librte_ring -Ilib/librte_meter -I../lib/librte_meter -Ilib/librte_bpf -I../lib/librte_bpf -Ilib/librte_cfgfile -I../lib/librte_cfgfile -Ilib/librte_cmdline -I../lib/librte_cmdline -Ilib/librte_cryptodev -I../lib/librte_cryptodev -Ilib/librte_rcu -I../lib/librte_rcu -Ilib/librte_distributor -I../lib/librte_distributor -Ilib/librte_efd -I../lib/librte_efd -Ilib/librte_hash -I../lib/librte_hash -Ilib/librte_eventdev -I../lib/librte_eventdev -Ilib/librte_timer -I../lib/librte_timer -Ilib/librte_fib -I../lib/librte_fib -Ilib/librte_rib -I../lib/librte_rib -Ilib/librte_flow_classify -I../lib/librte_flow_classify -Ilib/librte_table -I../lib/librte_table -Ilib/librte_port -I../lib/librte_port -Ilib/librte_sched -I../lib/librte_sched -Ilib/librte_ip_frag -I../lib/librte_ip_frag -Ilib/librte_kni -I../lib/librte_kni -Ilib/librte_lpm -I../lib/librte_lpm -Ilib/librte_graph -I../lib/librte_graph -Ilib/librte_ipsec -I../lib/librte_ipsec -Ilib/librte_security -I../lib/librte_security -Ilib/librte_latencystats -I../lib/librte_latencystats -Ilib/librte_member -I../lib/librte_member -Ilib/librte_node -I../lib/librte_node -Ilib/librte_pipeline -I../lib/librte_pipeline -Ilib/librte_rawdev -I../lib/librte_rawdev -Ilib/librte_reorder -I../lib/librte_reorder -Ilib/librte_stack -I../lib/librte_stack -Idrivers/mempool/ring -I../drivers/mempool/ring -Idrivers/mempool/stack -I../drivers/mempool/stack -Idrivers/event/skeleton -I../drivers/event/skeleton -Idrivers/net/bonding -I../drivers/net/bonding -Idrivers/net/ring -I../drivers/net/ring -Ilib/librte_power -I../lib/librte_power -Ilib/librte_pdump -I../lib/librte_pdump -Ilib/librte_compressdev -I../lib/librte_compressdev -Idrivers/crypto/scheduler -I../drivers/crypto/scheduler -fdiagnostics-color=always -pipe -D_FILE_OFFSET_BITS=64 -Wall -Winvalid-pch -Werror -O3 -include rte_config.h -Wextra -Wcast-qual -Wdeprecated -Wformat -Wformat-nonliteral -Wformat-security -Wmissing-declarations -Wmissing-prototypes -Wnested-externs -Wold-style-definition -Wpointer-arith -Wsign-compare -Wstrict-prototypes -Wundef -Wwrite-strings -Wno-address-of-packed-member -Wno-packed-not-aligned -Wno-missing-field-initializers -Wno-zero-length-bounds -march=native -DALLOW_EXPERIMENTAL_API -Wno-format-truncation -D_GNU_SOURCE -fno-strict-aliasing -DALLOW_INTERNAL_API -MD -MQ app/test/dpdk-test.p/test_mbuf.c.o -MF app/test/dpdk-test.p/test_mbuf.c.o.d -o app/test/dpdk-test.p/test_mbuf.c.o -c ../app/test/test_mbuf.c
../app/test/test_mbuf.c: In function ‘test_mbuf_dyn’:
../app/test/test_mbuf.c:2658:12: error: comparison of integer expressions of different signedness: ‘int’ and ‘uint32_t’ {aka ‘unsigned int’} [-Werror=sign-compare]
 2658 |  if (flag3 != rte_bsf64(PKT_LAST_FREE))
      |            ^~
cc1: all warnings being treated as errors
[2584/2841] Compiling C object app/test/dpdk-test.p/test_ring_st_peek_stress.c.o
[2585/2841] Compiling C object app/test/dpdk-test.p/test_spinlock.c.o
[2586/2841] Compiling C object app/test/dpdk-test.p/test_sched.c.o
[2587/2841] Compiling C object app/test/dpdk-test.p/test_service_cores.c.o
[2588/2841] Compiling C object app/test/dpdk-test.p/test_security.c.o
[2589/2841] Compiling C object app/test/dpdk-test.p/test_cryptodev.c.o
[2590/2841] Compiling C object app/test/dpdk-test.p/test_memcpy_perf.c.o
[2591/2841] Compiling C object app/test/dpdk-test.p/test_ring_perf.c.o
[2592/2841] Compiling C object app/test/dpdk-test.p/test_ring.c.o
[2593/2841] Compiling C object drivers/libtmp_rte_event_octeontx2.a.p/event_octeontx2_otx2_worker.c.o
[2594/2841] Compiling C object drivers/libtmp_rte_event_octeontx2.a.p/event_octeontx2_otx2_worker_dual.c.o
ninja: build stopped




*Build Failed #6:
OS: FC33-64
Target: x86_64-native-linuxapp-clang
FAILED: app/test/dpdk-test.p/test_mbuf.c.o 
clang -Iapp/test/dpdk-test.p -Iapp/test -I../app/test -Ilib/librte_acl -I../lib/librte_acl -I. -I.. -Iconfig -I../config -Ilib/librte_eal/include -I../lib/librte_eal/include -Ilib/librte_eal/linux/include -I../lib/librte_eal/linux/include -Ilib/librte_eal/x86/include -I../lib/librte_eal/x86/include -Ilib/librte_eal/common -I../lib/librte_eal/common -Ilib/librte_eal -I../lib/librte_eal -Ilib/librte_kvargs -I../lib/librte_kvargs -Ilib/librte_metrics -I../lib/librte_metrics -Ilib/librte_telemetry -I../lib/librte_telemetry -Idrivers/bus/pci -I../drivers/bus/pci -I../drivers/bus/pci/linux -Ilib/librte_pci -I../lib/librte_pci -Idrivers/bus/vdev -I../drivers/bus/vdev -Ilib/librte_bitratestats -I../lib/librte_bitratestats -Ilib/librte_ethdev -I../lib/librte_ethdev -Ilib/librte_net -I../lib/librte_net -Ilib/librte_mbuf -I../lib/librte_mbuf -Ilib/librte_mempool -I../lib/librte_mempool -Ilib/librte_ring -I../lib/librte_ring -Ilib/librte_meter -I../lib/librte_meter -Ilib/librte_bpf -I../lib/librte_bpf -Ilib/librte_cfgfile -I../lib/librte_cfgfile -Ilib/librte_cmdline -I../lib/librte_cmdline -Ilib/librte_cryptodev -I../lib/librte_cryptodev -Ilib/librte_rcu -I../lib/librte_rcu -Ilib/librte_distributor -I../lib/librte_distributor -Ilib/librte_efd -I../lib/librte_efd -Ilib/librte_hash -I../lib/librte_hash -Ilib/librte_eventdev -I../lib/librte_eventdev -Ilib/librte_timer -I../lib/librte_timer -Ilib/librte_fib -I../lib/librte_fib -Ilib/librte_rib -I../lib/librte_rib -Ilib/librte_flow_classify -I../lib/librte_flow_classify -Ilib/librte_table -I../lib/librte_table -Ilib/librte_port -I../lib/librte_port -Ilib/librte_sched -I../lib/librte_sched -Ilib/librte_ip_frag -I../lib/librte_ip_frag -Ilib/librte_kni -I../lib/librte_kni -Ilib/librte_lpm -I../lib/librte_lpm -Ilib/librte_graph -I../lib/librte_graph -Ilib/librte_ipsec -I../lib/librte_ipsec -Ilib/librte_security -I../lib/librte_security -Ilib/librte_latencystats -I../lib/librte_latencystats -Ilib/librte_member -I../lib/librte_member -Ilib/librte_node -I../lib/librte_node -Ilib/librte_pipeline -I../lib/librte_pipeline -Ilib/librte_rawdev -I../lib/librte_rawdev -Ilib/librte_reorder -I../lib/librte_reorder -Ilib/librte_stack -I../lib/librte_stack -Idrivers/mempool/ring -I../drivers/mempool/ring -Idrivers/mempool/stack -I../drivers/mempool/stack -Idrivers/event/skeleton -I../drivers/event/skeleton -Idrivers/net/bonding -I../drivers/net/bonding -Idrivers/net/ring -I../drivers/net/ring -Ilib/librte_power -I../lib/librte_power -Ilib/librte_pdump -I../lib/librte_pdump -Ilib/librte_compressdev -I../lib/librte_compressdev -Idrivers/crypto/scheduler -I../drivers/crypto/scheduler -Xclang -fcolor-diagnostics -pipe -D_FILE_OFFSET_BITS=64 -Wall -Winvalid-pch -Werror -O3 -include rte_config.h -Wextra -Wcast-qual -Wdeprecated -Wformat -Wformat-nonliteral -Wformat-security -Wmissing-declarations -Wmissing-prototypes -Wnested-externs -Wold-style-definition -Wpointer-arith -Wsign-compare -Wstrict-prototypes -Wundef -Wwrite-strings -Wno-address-of-packed-member -Wno-missing-field-initializers -march=native -DALLOW_EXPERIMENTAL_API -D_GNU_SOURCE -fno-strict-aliasing -DALLOW_INTERNAL_API -MD -MQ app/test/dpdk-test.p/test_mbuf.c.o -MF app/test/dpdk-test.p/test_mbuf.c.o.d -o app/test/dpdk-test.p/test_mbuf.c.o -c ../app/test/test_mbuf.c
../app/test/test_mbuf.c:2658:12: error: comparison of integers of different signs: 'int' and 'uint32_t' (aka 'unsigned int') [-Werror,-Wsign-compare]
        if (flag3 != rte_bsf64(PKT_LAST_FREE))
            ~~~~~ ^  ~~~~~~~~~~~~~~~~~~~~~~~~
1 error generated.
[2552/2841] Compiling C object app/test/dpdk-test.p/test_mcslock.c.o
[2553/2841] Compiling C object app/test/dpdk-test.p/test_mempool_perf.c.o
[2554/2841] Compiling C object app/test/dpdk-test.p/test_meter.c.o
[2555/2841] Compiling C object app/test/dpdk-test.p/test_mempool.c.o
[2556/2841] Compiling C object app/test/dpdk-test.p/test_member_perf.c.o
[2557/2841] Compiling C object app/test/dpdk-test.p/test_mp_secondary.c.o
[2558/2841] Compiling C object app/test/dpdk-test.p/test_memcpy_perf.c.o
[2559/2841] Compiling C object drivers/libtmp_rte_event_octeontx2.a.p/event_octeontx2_otx2_worker.c.o
[2560/2841] Compiling C object drivers/libtmp_rte_event_octeontx2.a.p/event_octeontx2_otx2_worker_dual.c.o
ninja: build stopped




*Build Failed #7:
OS: FreeBSD1201-64
Target: x86_64-native-bsdapp-gcc
FAILED: app/test/dpdk-test.p/test_mbuf.c.o 
gcc -Iapp/test/dpdk-test.p -Iapp/test -I../app/test -Ilib/librte_acl -I../lib/librte_acl -I. -I.. -Iconfig -I../config -Ilib/librte_eal/include -I../lib/librte_eal/include -Ilib/librte_eal/freebsd/include -I../lib/librte_eal/freebsd/include -Ilib/librte_eal/x86/include -I../lib/librte_eal/x86/include -Ilib/librte_eal/common -I../lib/librte_eal/common -Ilib/librte_eal -I../lib/librte_eal -Ilib/librte_kvargs -I../lib/librte_kvargs -Ilib/librte_metrics -I../lib/librte_metrics -Ilib/librte_telemetry -I../lib/librte_telemetry -Idrivers/bus/pci -I../drivers/bus/pci -I../drivers/bus/pci/bsd -Ilib/librte_pci -I../lib/librte_pci -Idrivers/bus/vdev -I../drivers/bus/vdev -Ilib/librte_bitratestats -I../lib/librte_bitratestats -Ilib/librte_ethdev -I../lib/librte_ethdev -Ilib/librte_net -I../lib/librte_net -Ilib/librte_mbuf -I../lib/librte_mbuf -Ilib/librte_mempool -I../lib/librte_mempool -Ilib/librte_ring -I../lib/librte_ring -Ilib/librte_meter -I../lib/librte_meter -Ilib/librte_bpf -I../lib/librte_bpf -Ilib/librte_cfgfile -I../lib/librte_cfgfile -Ilib/librte_cmdline -I../lib/librte_cmdline -Ilib/librte_cryptodev -I../lib/librte_cryptodev -Ilib/librte_rcu -I../lib/librte_rcu -Ilib/librte_distributor -I../lib/librte_distributor -Ilib/librte_efd -I../lib/librte_efd -Ilib/librte_hash -I../lib/librte_hash -Ilib/librte_eventdev -I../lib/librte_eventdev -Ilib/librte_timer -I../lib/librte_timer -Ilib/librte_fib -I../lib/librte_fib -Ilib/librte_rib -I../lib/librte_rib -Ilib/librte_flow_classify -I../lib/librte_flow_classify -Ilib/librte_table -I../lib/librte_table -Ilib/librte_port -I../lib/librte_port -Ilib/librte_sched -I../lib/librte_sched -Ilib/librte_ip_frag -I../lib/librte_ip_frag -Ilib/librte_lpm -I../lib/librte_lpm -Ilib/librte_graph -I../lib/librte_graph -Ilib/librte_ipsec -I../lib/librte_ipsec -Ilib/librte_security -I../lib/librte_security -Ilib/librte_latencystats -I../lib/librte_latencystats -Ilib/librte_member -I../lib/librte_member -Ilib/librte_node -I../lib/librte_node -Ilib/librte_pipeline -I../lib/librte_pipeline -Ilib/librte_rawdev -I../lib/librte_rawdev -Ilib/librte_reorder -I../lib/librte_reorder -Ilib/librte_stack -I../lib/librte_stack -Idrivers/mempool/ring -I../drivers/mempool/ring -Idrivers/mempool/stack -I../drivers/mempool/stack -Idrivers/event/skeleton -I../drivers/event/skeleton -Idrivers/net/bonding -I../drivers/net/bonding -Idrivers/net/ring -I../drivers/net/ring -Ilib/librte_pdump -I../lib/librte_pdump -Ilib/librte_compressdev -I../lib/librte_compressdev -Idrivers/crypto/scheduler -I../drivers/crypto/scheduler -fdiagnostics-color=always -pipe -D_FILE_OFFSET_BITS=64 -Wall -Winvalid-pch -Werror -O3 -include rte_config.h -Wextra -Wcast-qual -Wdeprecated -Wformat -Wformat-nonliteral -Wformat-security -Wmissing-declarations -Wmissing-prototypes -Wnested-externs -Wold-style-definition -Wpointer-arith -Wsign-compare -Wstrict-prototypes -Wundef -Wwrite-strings -Wno-address-of-packed-member -Wno-packed-not-aligned -Wno-missing-field-initializers -D__BSD_VISIBLE -march=native -mno-avx512f -DALLOW_EXPERIMENTAL_API -Wno-format-truncation -D_GNU_SOURCE -fno-strict-aliasing -DALLOW_INTERNAL_API -MD -MQ app/test/dpdk-test.p/test_mbuf.c.o -MF app/test/dpdk-test.p/test_mbuf.c.o.d -o app/test/dpdk-test.p/test_mbuf.c.o -c ../app/test/test_mbuf.c
../app/test/test_mbuf.c: In function 'test_mbuf_dyn':
../app/test/test_mbuf.c:2658:12: error: comparison of integer expressions of different signedness: 'int' and 'uint32_t' {aka 'unsigned int'} [-Werror=sign-compare]
 2658 |  if (flag3 != rte_bsf64(PKT_LAST_FREE))
      |            ^~
cc1: all warnings being treated as errors
[1843/2051] Compiling C object app/test/dpdk-test.p/test_reciprocal_division.c.o
[1844/2051] Compiling C object app/test/dpdk-test.p/test_rawdev.c.o
[1845/2051] Compiling C object app/test/dpdk-test.p/test_rcu_qsbr_perf.c.o
[1846/2051] Compiling C object app/test/dpdk-test.p/test_rcu_qsbr.c.o
[1847/2051] Compiling C object app/test/dpdk-test.p/test_memcpy_perf.c.o
ninja: build stopped




*Build Failed #8:
OS: FreeBSD1201-64
Target: x86_64-native-bsdapp-clang
FAILED: app/test/dpdk-test.p/test_mbuf.c.o 
clang -Iapp/test/dpdk-test.p -Iapp/test -I../app/test -Ilib/librte_acl -I../lib/librte_acl -I. -I.. -Iconfig -I../config -Ilib/librte_eal/include -I../lib/librte_eal/include -Ilib/librte_eal/freebsd/include -I../lib/librte_eal/freebsd/include -Ilib/librte_eal/x86/include -I../lib/librte_eal/x86/include -Ilib/librte_eal/common -I../lib/librte_eal/common -Ilib/librte_eal -I../lib/librte_eal -Ilib/librte_kvargs -I../lib/librte_kvargs -Ilib/librte_metrics -I../lib/librte_metrics -Ilib/librte_telemetry -I../lib/librte_telemetry -Idrivers/bus/pci -I../drivers/bus/pci -I../drivers/bus/pci/bsd -Ilib/librte_pci -I../lib/librte_pci -Idrivers/bus/vdev -I../drivers/bus/vdev -Ilib/librte_bitratestats -I../lib/librte_bitratestats -Ilib/librte_ethdev -I../lib/librte_ethdev -Ilib/librte_net -I../lib/librte_net -Ilib/librte_mbuf -I../lib/librte_mbuf -Ilib/librte_mempool -I../lib/librte_mempool -Ilib/librte_ring -I../lib/librte_ring -Ilib/librte_meter -I../lib/librte_meter -Ilib/librte_bpf -I../lib/librte_bpf -Ilib/librte_cfgfile -I../lib/librte_cfgfile -Ilib/librte_cmdline -I../lib/librte_cmdline -Ilib/librte_cryptodev -I../lib/librte_cryptodev -Ilib/librte_rcu -I../lib/librte_rcu -Ilib/librte_distributor -I../lib/librte_distributor -Ilib/librte_efd -I../lib/librte_efd -Ilib/librte_hash -I../lib/librte_hash -Ilib/librte_eventdev -I../lib/librte_eventdev -Ilib/librte_timer -I../lib/librte_timer -Ilib/librte_fib -I../lib/librte_fib -Ilib/librte_rib -I../lib/librte_rib -Ilib/librte_flow_classify -I../lib/librte_flow_classify -Ilib/librte_table -I../lib/librte_table -Ilib/librte_port -I../lib/librte_port -Ilib/librte_sched -I../lib/librte_sched -Ilib/librte_ip_frag -I../lib/librte_ip_frag -Ilib/librte_lpm -I../lib/librte_lpm -Ilib/librte_graph -I../lib/librte_graph -Ilib/librte_ipsec -I../lib/librte_ipsec -Ilib/librte_security -I../lib/librte_security -Ilib/librte_latencystats -I../lib/librte_latencystats -Ilib/librte_member -I../lib/librte_member -Ilib/librte_node -I../lib/librte_node -Ilib/librte_pipeline -I../lib/librte_pipeline -Ilib/librte_rawdev -I../lib/librte_rawdev -Ilib/librte_reorder -I../lib/librte_reorder -Ilib/librte_stack -I../lib/librte_stack -Idrivers/mempool/ring -I../drivers/mempool/ring -Idrivers/mempool/stack -I../drivers/mempool/stack -Idrivers/event/skeleton -I../drivers/event/skeleton -Idrivers/net/bonding -I../drivers/net/bonding -Idrivers/net/ring -I../drivers/net/ring -Ilib/librte_pdump -I../lib/librte_pdump -Ilib/librte_compressdev -I../lib/librte_compressdev -Idrivers/crypto/scheduler -I../drivers/crypto/scheduler -Xclang -fcolor-diagnostics -pipe -D_FILE_OFFSET_BITS=64 -Wall -Winvalid-pch -Werror -O3 -include rte_config.h -Wextra -Wcast-qual -Wdeprecated -Wformat -Wformat-nonliteral -Wformat-security -Wmissing-declarations -Wmissing-prototypes -Wnested-externs -Wold-style-definition -Wpointer-arith -Wsign-compare -Wstrict-prototypes -Wundef -Wwrite-strings -Wno-address-of-packed-member -Wno-missing-field-initializers -D__BSD_VISIBLE -march=native -mno-avx512f -DALLOW_EXPERIMENTAL_API -D_GNU_SOURCE -fno-strict-aliasing -DALLOW_INTERNAL_API -MD -MQ app/test/dpdk-test.p/test_mbuf.c.o -MF app/test/dpdk-test.p/test_mbuf.c.o.d -o app/test/dpdk-test.p/test_mbuf.c.o -c ../app/test/test_mbuf.c
../app/test/test_mbuf.c:2658:12: error: comparison of integers of different signs: 'int' and 'uint32_t' (aka 'unsigned int') [-Werror,-Wsign-compare]
        if (flag3 != rte_bsf64(PKT_LAST_FREE))
            ~~~~~ ^  ~~~~~~~~~~~~~~~~~~~~~~~~
1 error generated.
[1829/2051] Compiling C object app/test/dpdk-test.p/test_mempool_perf.c.o
[1830/2051] Compiling C object app/test/dpdk-test.p/test_member_perf.c.o
[1831/2051] Compiling C object app/test/dpdk-test.p/test_meter.c.o
[1832/2051] Compiling C object app/test/dpdk-test.p/test_mempool.c.o
[1833/2051] Compiling C object app/test/dpdk-test.p/test_memcpy_perf.c.o
ninja: build stopped




*Build Failed #9:
OS: FreeBSD1201-64
Target: x86_64-native-bsdapp-gcc+shared
FAILED: app/test/dpdk-test.p/test_mbuf.c.o 
gcc -Iapp/test/dpdk-test.p -Iapp/test -I../app/test -Ilib/librte_acl -I../lib/librte_acl -I. -I.. -Iconfig -I../config -Ilib/librte_eal/include -I../lib/librte_eal/include -Ilib/librte_eal/freebsd/include -I../lib/librte_eal/freebsd/include -Ilib/librte_eal/x86/include -I../lib/librte_eal/x86/include -Ilib/librte_eal/common -I../lib/librte_eal/common -Ilib/librte_eal -I../lib/librte_eal -Ilib/librte_kvargs -I../lib/librte_kvargs -Ilib/librte_metrics -I../lib/librte_metrics -Ilib/librte_telemetry -I../lib/librte_telemetry -Idrivers/bus/pci -I../drivers/bus/pci -I../drivers/bus/pci/bsd -Ilib/librte_pci -I../lib/librte_pci -Idrivers/bus/vdev -I../drivers/bus/vdev -Ilib/librte_bitratestats -I../lib/librte_bitratestats -Ilib/librte_ethdev -I../lib/librte_ethdev -Ilib/librte_net -I../lib/librte_net -Ilib/librte_mbuf -I../lib/librte_mbuf -Ilib/librte_mempool -I../lib/librte_mempool -Ilib/librte_ring -I../lib/librte_ring -Ilib/librte_meter -I../lib/librte_meter -Ilib/librte_bpf -I../lib/librte_bpf -Ilib/librte_cfgfile -I../lib/librte_cfgfile -Ilib/librte_cmdline -I../lib/librte_cmdline -Ilib/librte_cryptodev -I../lib/librte_cryptodev -Ilib/librte_rcu -I../lib/librte_rcu -Ilib/librte_distributor -I../lib/librte_distributor -Ilib/librte_efd -I../lib/librte_efd -Ilib/librte_hash -I../lib/librte_hash -Ilib/librte_eventdev -I../lib/librte_eventdev -Ilib/librte_timer -I../lib/librte_timer -Ilib/librte_fib -I../lib/librte_fib -Ilib/librte_rib -I../lib/librte_rib -Ilib/librte_flow_classify -I../lib/librte_flow_classify -Ilib/librte_table -I../lib/librte_table -Ilib/librte_port -I../lib/librte_port -Ilib/librte_sched -I../lib/librte_sched -Ilib/librte_ip_frag -I../lib/librte_ip_frag -Ilib/librte_lpm -I../lib/librte_lpm -Ilib/librte_graph -I../lib/librte_graph -Ilib/librte_ipsec -I../lib/librte_ipsec -Ilib/librte_security -I../lib/librte_security -Ilib/librte_latencystats -I../lib/librte_latencystats -Ilib/librte_member -I../lib/librte_member -Ilib/librte_node -I../lib/librte_node -Ilib/librte_pipeline -I../lib/librte_pipeline -Ilib/librte_rawdev -I../lib/librte_rawdev -Ilib/librte_reorder -I../lib/librte_reorder -Ilib/librte_stack -I../lib/librte_stack -Idrivers/mempool/ring -I../drivers/mempool/ring -Idrivers/mempool/stack -I../drivers/mempool/stack -Idrivers/event/skeleton -I../drivers/event/skeleton -Idrivers/net/bonding -I../drivers/net/bonding -Idrivers/net/ring -I../drivers/net/ring -Ilib/librte_pdump -I../lib/librte_pdump -Ilib/librte_compressdev -I../lib/librte_compressdev -Idrivers/crypto/scheduler -I../drivers/crypto/scheduler -fdiagnostics-color=always -pipe -D_FILE_OFFSET_BITS=64 -Wall -Winvalid-pch -Werror -O3 -include rte_config.h -Wextra -Wcast-qual -Wdeprecated -Wformat -Wformat-nonliteral -Wformat-security -Wmissing-declarations -Wmissing-prototypes -Wnested-externs -Wold-style-definition -Wpointer-arith -Wsign-compare -Wstrict-prototypes -Wundef -Wwrite-strings -Wno-address-of-packed-member -Wno-packed-not-aligned -Wno-missing-field-initializers -D__BSD_VISIBLE -march=native -mno-avx512f -DALLOW_EXPERIMENTAL_API -Wno-format-truncation -D_GNU_SOURCE -fno-strict-aliasing -DALLOW_INTERNAL_API -MD -MQ app/test/dpdk-test.p/test_mbuf.c.o -MF app/test/dpdk-test.p/test_mbuf.c.o.d -o app/test/dpdk-test.p/test_mbuf.c.o -c ../app/test/test_mbuf.c
../app/test/test_mbuf.c: In function 'test_mbuf_dyn':
../app/test/test_mbuf.c:2658:12: error: comparison of integer expressions of different signedness: 'int' and 'uint32_t' {aka 'unsigned int'} [-Werror=sign-compare]
 2658 |  if (flag3 != rte_bsf64(PKT_LAST_FREE))
      |            ^~
cc1: all warnings being treated as errors
[1869/1933] Compiling C object app/test/dpdk-test.p/test_prefetch.c.o
[1870/1933] Compiling C object app/test/dpdk-test.p/test_rand_perf.c.o
[1871/1933] Compiling C object app/test/dpdk-test.p/test_pmd_perf.c.o
[1872/1933] Compiling C object app/test/dpdk-test.p/test_rawdev.c.o
[1873/1933] Compiling C object app/test/dpdk-test.p/test_memcpy_perf.c.o
ninja: build stopped




*Build Failed #10:
OS: FreeBSD1201-64
Target: x86_64-native-bsdapp-gcc+debug
FAILED: app/test/dpdk-test.p/test_mbuf.c.o 
gcc -Iapp/test/dpdk-test.p -Iapp/test -I../app/test -Ilib/librte_acl -I../lib/librte_acl -I. -I.. -Iconfig -I../config -Ilib/librte_eal/include -I../lib/librte_eal/include -Ilib/librte_eal/freebsd/include -I../lib/librte_eal/freebsd/include -Ilib/librte_eal/x86/include -I../lib/librte_eal/x86/include -Ilib/librte_eal/common -I../lib/librte_eal/common -Ilib/librte_eal -I../lib/librte_eal -Ilib/librte_kvargs -I../lib/librte_kvargs -Ilib/librte_metrics -I../lib/librte_metrics -Ilib/librte_telemetry -I../lib/librte_telemetry -Idrivers/bus/pci -I../drivers/bus/pci -I../drivers/bus/pci/bsd -Ilib/librte_pci -I../lib/librte_pci -Idrivers/bus/vdev -I../drivers/bus/vdev -Ilib/librte_bitratestats -I../lib/librte_bitratestats -Ilib/librte_ethdev -I../lib/librte_ethdev -Ilib/librte_net -I../lib/librte_net -Ilib/librte_mbuf -I../lib/librte_mbuf -Ilib/librte_mempool -I../lib/librte_mempool -Ilib/librte_ring -I../lib/librte_ring -Ilib/librte_meter -I../lib/librte_meter -Ilib/librte_bpf -I../lib/librte_bpf -Ilib/librte_cfgfile -I../lib/librte_cfgfile -Ilib/librte_cmdline -I../lib/librte_cmdline -Ilib/librte_cryptodev -I../lib/librte_cryptodev -Ilib/librte_rcu -I../lib/librte_rcu -Ilib/librte_distributor -I../lib/librte_distributor -Ilib/librte_efd -I../lib/librte_efd -Ilib/librte_hash -I../lib/librte_hash -Ilib/librte_eventdev -I../lib/librte_eventdev -Ilib/librte_timer -I../lib/librte_timer -Ilib/librte_fib -I../lib/librte_fib -Ilib/librte_rib -I../lib/librte_rib -Ilib/librte_flow_classify -I../lib/librte_flow_classify -Ilib/librte_table -I../lib/librte_table -Ilib/librte_port -I../lib/librte_port -Ilib/librte_sched -I../lib/librte_sched -Ilib/librte_ip_frag -I../lib/librte_ip_frag -Ilib/librte_lpm -I../lib/librte_lpm -Ilib/librte_graph -I../lib/librte_graph -Ilib/librte_ipsec -I../lib/librte_ipsec -Ilib/librte_security -I../lib/librte_security -Ilib/librte_latencystats -I../lib/librte_latencystats -Ilib/librte_member -I../lib/librte_member -Ilib/librte_node -I../lib/librte_node -Ilib/librte_pipeline -I../lib/librte_pipeline -Ilib/librte_rawdev -I../lib/librte_rawdev -Ilib/librte_reorder -I../lib/librte_reorder -Ilib/librte_stack -I../lib/librte_stack -Idrivers/mempool/ring -I../drivers/mempool/ring -Idrivers/mempool/stack -I../drivers/mempool/stack -Idrivers/event/skeleton -I../drivers/event/skeleton -Idrivers/net/bonding -I../drivers/net/bonding -Idrivers/net/ring -I../drivers/net/ring -Ilib/librte_pdump -I../lib/librte_pdump -Ilib/librte_compressdev -I../lib/librte_compressdev -Idrivers/crypto/scheduler -I../drivers/crypto/scheduler -fdiagnostics-color=always -pipe -D_FILE_OFFSET_BITS=64 -Wall -Winvalid-pch -Werror -O2 -g -include rte_config.h -Wextra -Wcast-qual -Wdeprecated -Wformat -Wformat-nonliteral -Wformat-security -Wmissing-declarations -Wmissing-prototypes -Wnested-externs -Wold-style-definition -Wpointer-arith -Wsign-compare -Wstrict-prototypes -Wundef -Wwrite-strings -Wno-address-of-packed-member -Wno-packed-not-aligned -Wno-missing-field-initializers -D__BSD_VISIBLE -march=native -mno-avx512f -DALLOW_EXPERIMENTAL_API -Wno-format-truncation -D_GNU_SOURCE -fno-strict-aliasing -DALLOW_INTERNAL_API -MD -MQ app/test/dpdk-test.p/test_mbuf.c.o -MF app/test/dpdk-test.p/test_mbuf.c.o.d -o app/test/dpdk-test.p/test_mbuf.c.o -c ../app/test/test_mbuf.c
../app/test/test_mbuf.c: In function 'test_mbuf_dyn':
../app/test/test_mbuf.c:2658:12: error: comparison of integer expressions of different signedness: 'int' and 'uint32_t' {aka 'unsigned int'} [-Werror=sign-compare]
 2658 |  if (flag3 != rte_bsf64(PKT_LAST_FREE))
      |            ^~
cc1: all warnings being treated as errors
[1844/2051] Compiling C object app/test/dpdk-test.p/test_reciprocal_division_perf.c.o
[1845/2051] Compiling C object app/test/dpdk-test.p/test_rawdev.c.o
[1846/2051] Compiling C object app/test/dpdk-test.p/test_rcu_qsbr_perf.c.o
[1847/2051] Compiling C object app/test/dpdk-test.p/test_rcu_qsbr.c.o
[1848/2051] Compiling C object app/test/dpdk-test.p/test_memcpy_perf.c.o
ninja: build stopped




*Build Failed #11:
OS: RHEL83-64
Target: x86_64-native-linuxapp-gcc
FAILED: app/test/dpdk-test.p/test_mbuf.c.o 
gcc -Iapp/test/dpdk-test.p -Iapp/test -I../app/test -Ilib/librte_acl -I../lib/librte_acl -I. -I.. -Iconfig -I../config -Ilib/librte_eal/include -I../lib/librte_eal/include -Ilib/librte_eal/linux/include -I../lib/librte_eal/linux/include -Ilib/librte_eal/x86/include -I../lib/librte_eal/x86/include -Ilib/librte_eal/common -I../lib/librte_eal/common -Ilib/librte_eal -I../lib/librte_eal -Ilib/librte_kvargs -I../lib/librte_kvargs -Ilib/librte_metrics -I../lib/librte_metrics -Ilib/librte_telemetry -I../lib/librte_telemetry -Idrivers/bus/pci -I../drivers/bus/pci -I../drivers/bus/pci/linux -Ilib/librte_pci -I../lib/librte_pci -Idrivers/bus/vdev -I../drivers/bus/vdev -Ilib/librte_bitratestats -I../lib/librte_bitratestats -Ilib/librte_ethdev -I../lib/librte_ethdev -Ilib/librte_net -I../lib/librte_net -Ilib/librte_mbuf -I../lib/librte_mbuf -Ilib/librte_mempool -I../lib/librte_mempool -Ilib/librte_ring -I../lib/librte_ring -Ilib/librte_meter -I../lib/librte_meter -Ilib/librte_bpf -I../lib/librte_bpf -Ilib/librte_cfgfile -I../lib/librte_cfgfile -Ilib/librte_cmdline -I../lib/librte_cmdline -Ilib/librte_cryptodev -I../lib/librte_cryptodev -Ilib/librte_rcu -I../lib/librte_rcu -Ilib/librte_distributor -I../lib/librte_distributor -Ilib/librte_efd -I../lib/librte_efd -Ilib/librte_hash -I../lib/librte_hash -Ilib/librte_eventdev -I../lib/librte_eventdev -Ilib/librte_timer -I../lib/librte_timer -Ilib/librte_fib -I../lib/librte_fib -Ilib/librte_rib -I../lib/librte_rib -Ilib/librte_flow_classify -I../lib/librte_flow_classify -Ilib/librte_table -I../lib/librte_table -Ilib/librte_port -I../lib/librte_port -Ilib/librte_sched -I../lib/librte_sched -Ilib/librte_ip_frag -I../lib/librte_ip_frag -Ilib/librte_kni -I../lib/librte_kni -Ilib/librte_lpm -I../lib/librte_lpm -Ilib/librte_graph -I../lib/librte_graph -Ilib/librte_ipsec -I../lib/librte_ipsec -Ilib/librte_security -I../lib/librte_security -Ilib/librte_latencystats -I../lib/librte_latencystats -Ilib/librte_member -I../lib/librte_member -Ilib/librte_node -I../lib/librte_node -Ilib/librte_pipeline -I../lib/librte_pipeline -Ilib/librte_rawdev -I../lib/librte_rawdev -Ilib/librte_reorder -I../lib/librte_reorder -Ilib/librte_stack -I../lib/librte_stack -Idrivers/mempool/ring -I../drivers/mempool/ring -Idrivers/mempool/stack -I../drivers/mempool/stack -Idrivers/event/skeleton -I../drivers/event/skeleton -Idrivers/net/bonding -I../drivers/net/bonding -Idrivers/net/ring -I../drivers/net/ring -Ilib/librte_power -I../lib/librte_power -Ilib/librte_pdump -I../lib/librte_pdump -Ilib/librte_compressdev -I../lib/librte_compressdev -Idrivers/crypto/scheduler -I../drivers/crypto/scheduler -fdiagnostics-color=always -pipe -D_FILE_OFFSET_BITS=64 -Wall -Winvalid-pch -Werror -O3 -include rte_config.h -Wextra -Wcast-qual -Wdeprecated -Wformat -Wformat-nonliteral -Wformat-security -Wmissing-declarations -Wmissing-prototypes -Wnested-externs -Wold-style-definition -Wpointer-arith -Wsign-compare -Wstrict-prototypes -Wundef -Wwrite-strings -Wno-packed-not-aligned -Wno-missing-field-initializers -march=native -DALLOW_EXPERIMENTAL_API -Wno-format-truncation -D_GNU_SOURCE -fno-strict-aliasing -DALLOW_INTERNAL_API -MD -MQ app/test/dpdk-test.p/test_mbuf.c.o -MF app/test/dpdk-test.p/test_mbuf.c.o.d -o app/test/dpdk-test.p/test_mbuf.c.o -c ../app/test/test_mbuf.c
../app/test/test_mbuf.c: In function ‘test_mbuf_dyn’:
../app/test/test_mbuf.c:2658:12: error: comparison of integer expressions of different signedness: ‘int’ and ‘uint32_t’ {aka ‘unsigned int’} [-Werror=sign-compare]
  if (flag3 != rte_bsf64(PKT_LAST_FREE))
            ^~
cc1: all warnings being treated as errors
[2565/2832] Compiling C object app/test/dpdk-test.p/test_ring_hts_stress.c.o
[2566/2832] Compiling C object app/test/dpdk-test.p/test_ring_mpmc_stress.c.o
[2567/2832] Compiling C object app/test/dpdk-test.p/test_ring_mt_peek_stress_zc.c.o
[2568/2832] Compiling C object app/test/dpdk-test.p/test_ring_mt_peek_stress.c.o
[2569/2832] Compiling C object app/test/dpdk-test.p/test_memcpy_perf.c.o
[2570/2832] Compiling C object app/test/dpdk-test.p/test_ring_perf.c.o
[2571/2832] Compiling C object app/test/dpdk-test.p/test_ring.c.o
[2572/2832] Compiling C object drivers/libtmp_rte_event_octeontx2.a.p/event_octeontx2_otx2_worker.c.o
[2573/2832] Compiling C object drivers/libtmp_rte_event_octeontx2.a.p/event_octeontx2_otx2_worker_dual.c.o
ninja: build stopped




*Build Failed #12:
OS: SUSE15-64
Target: x86_64-native-linuxapp-clang
FAILED: app/test/dpdk-test.p/test_mbuf.c.o 
clang -Iapp/test/dpdk-test.p -Iapp/test -I../app/test -Ilib/librte_acl -I../lib/librte_acl -I. -I.. -Iconfig -I../config -Ilib/librte_eal/include -I../lib/librte_eal/include -Ilib/librte_eal/linux/include -I../lib/librte_eal/linux/include -Ilib/librte_eal/x86/include -I../lib/librte_eal/x86/include -Ilib/librte_eal/common -I../lib/librte_eal/common -Ilib/librte_eal -I../lib/librte_eal -Ilib/librte_kvargs -I../lib/librte_kvargs -Ilib/librte_metrics -I../lib/librte_metrics -Ilib/librte_telemetry -I../lib/librte_telemetry -Idrivers/bus/pci -I../drivers/bus/pci -I../drivers/bus/pci/linux -Ilib/librte_pci -I../lib/librte_pci -Idrivers/bus/vdev -I../drivers/bus/vdev -Ilib/librte_bitratestats -I../lib/librte_bitratestats -Ilib/librte_ethdev -I../lib/librte_ethdev -Ilib/librte_net -I../lib/librte_net -Ilib/librte_mbuf -I../lib/librte_mbuf -Ilib/librte_mempool -I../lib/librte_mempool -Ilib/librte_ring -I../lib/librte_ring -Ilib/librte_meter -I../lib/librte_meter -Ilib/librte_bpf -I../lib/librte_bpf -Ilib/librte_cfgfile -I../lib/librte_cfgfile -Ilib/librte_cmdline -I../lib/librte_cmdline -Ilib/librte_cryptodev -I../lib/librte_cryptodev -Ilib/librte_rcu -I../lib/librte_rcu -Ilib/librte_distributor -I../lib/librte_distributor -Ilib/librte_efd -I../lib/librte_efd -Ilib/librte_hash -I../lib/librte_hash -Ilib/librte_eventdev -I../lib/librte_eventdev -Ilib/librte_timer -I../lib/librte_timer -Ilib/librte_fib -I../lib/librte_fib -Ilib/librte_rib -I../lib/librte_rib -Ilib/librte_flow_classify -I../lib/librte_flow_classify -Ilib/librte_table -I../lib/librte_table -Ilib/librte_port -I../lib/librte_port -Ilib/librte_sched -I../lib/librte_sched -Ilib/librte_ip_frag -I../lib/librte_ip_frag -Ilib/librte_kni -I../lib/librte_kni -Ilib/librte_lpm -I../lib/librte_lpm -Ilib/librte_graph -I../lib/librte_graph -Ilib/librte_ipsec -I../lib/librte_ipsec -Ilib/librte_security -I../lib/librte_security -Ilib/librte_latencystats -I../lib/librte_latencystats -Ilib/librte_member -I../lib/librte_member -Ilib/librte_node -I../lib/librte_node -Ilib/librte_pipeline -I../lib/librte_pipeline -Ilib/librte_rawdev -I../lib/librte_rawdev -Ilib/librte_reorder -I../lib/librte_reorder -Ilib/librte_stack -I../lib/librte_stack -Idrivers/mempool/ring -I../drivers/mempool/ring -Idrivers/mempool/stack -I../drivers/mempool/stack -Idrivers/event/skeleton -I../drivers/event/skeleton -Idrivers/net/bonding -I../drivers/net/bonding -Idrivers/net/ring -I../drivers/net/ring -Ilib/librte_power -I../lib/librte_power -Ilib/librte_pdump -I../lib/librte_pdump -Ilib/librte_compressdev -I../lib/librte_compressdev -Idrivers/crypto/scheduler -I../drivers/crypto/scheduler -Xclang -fcolor-diagnostics -pipe -D_FILE_OFFSET_BITS=64 -Wall -Winvalid-pch -Werror -O3 -include rte_config.h -Wextra -Wcast-qual -Wdeprecated -Wformat -Wformat-nonliteral -Wformat-security -Wmissing-declarations -Wmissing-prototypes -Wnested-externs -Wold-style-definition -Wpointer-arith -Wsign-compare -Wstrict-prototypes -Wundef -Wwrite-strings -Wno-address-of-packed-member -Wno-missing-field-initializers -march=native -DALLOW_EXPERIMENTAL_API -D_GNU_SOURCE -fno-strict-aliasing -DALLOW_INTERNAL_API -MD -MQ app/test/dpdk-test.p/test_mbuf.c.o -MF app/test/dpdk-test.p/test_mbuf.c.o.d -o app/test/dpdk-test.p/test_mbuf.c.o -c ../app/test/test_mbuf.c
../app/test/test_mbuf.c:2658:12: error: comparison of integers of different signs: 'int' and 'uint32_t' (aka 'unsigned int') [-Werror,-Wsign-compare]
        if (flag3 != rte_bsf64(PKT_LAST_FREE))
            ~~~~~ ^  ~~~~~~~~~~~~~~~~~~~~~~~~
1 error generated.
[2439/2735] Compiling C object app/test/dpdk-test.p/test_lpm.c.o
[2440/2735] Compiling C object app/test/dpdk-test.p/test_cryptodev.c.o
[2441/2735] Compiling C object app/test/dpdk-test.p/test_ipsec.c.o
[2442/2735] Compiling C object app/test/dpdk-test.p/test_lpm_perf.c.o
[2443/2735] Compiling C object app/test/dpdk-test.p/test_memcpy.c.o
[2444/2735] Compiling C object app/test/dpdk-test.p/test_member.c.o
[2445/2735] Compiling C object app/test/dpdk-test.p/test_member_perf.c.o
[2446/2735] Compiling C object drivers/libtmp_rte_event_octeontx2.a.p/event_octeontx2_otx2_worker.c.o
[2447/2735] Compiling C object drivers/libtmp_rte_event_octeontx2.a.p/event_octeontx2_otx2_worker_dual.c.o
ninja: build stopped




*Build Failed #13:
OS: SUSE15-64
Target: x86_64-native-linuxapp-gcc
FAILED: app/test/dpdk-test.p/test_mbuf.c.o 
gcc -Iapp/test/dpdk-test.p -Iapp/test -I../app/test -Ilib/librte_acl -I../lib/librte_acl -I. -I.. -Iconfig -I../config -Ilib/librte_eal/include -I../lib/librte_eal/include -Ilib/librte_eal/linux/include -I../lib/librte_eal/linux/include -Ilib/librte_eal/x86/include -I../lib/librte_eal/x86/include -Ilib/librte_eal/common -I../lib/librte_eal/common -Ilib/librte_eal -I../lib/librte_eal -Ilib/librte_kvargs -I../lib/librte_kvargs -Ilib/librte_metrics -I../lib/librte_metrics -Ilib/librte_telemetry -I../lib/librte_telemetry -Idrivers/bus/pci -I../drivers/bus/pci -I../drivers/bus/pci/linux -Ilib/librte_pci -I../lib/librte_pci -Idrivers/bus/vdev -I../drivers/bus/vdev -Ilib/librte_bitratestats -I../lib/librte_bitratestats -Ilib/librte_ethdev -I../lib/librte_ethdev -Ilib/librte_net -I../lib/librte_net -Ilib/librte_mbuf -I../lib/librte_mbuf -Ilib/librte_mempool -I../lib/librte_mempool -Ilib/librte_ring -I../lib/librte_ring -Ilib/librte_meter -I../lib/librte_meter -Ilib/librte_bpf -I../lib/librte_bpf -Ilib/librte_cfgfile -I../lib/librte_cfgfile -Ilib/librte_cmdline -I../lib/librte_cmdline -Ilib/librte_cryptodev -I../lib/librte_cryptodev -Ilib/librte_rcu -I../lib/librte_rcu -Ilib/librte_distributor -I../lib/librte_distributor -Ilib/librte_efd -I../lib/librte_efd -Ilib/librte_hash -I../lib/librte_hash -Ilib/librte_eventdev -I../lib/librte_eventdev -Ilib/librte_timer -I../lib/librte_timer -Ilib/librte_fib -I../lib/librte_fib -Ilib/librte_rib -I../lib/librte_rib -Ilib/librte_flow_classify -I../lib/librte_flow_classify -Ilib/librte_table -I../lib/librte_table -Ilib/librte_port -I../lib/librte_port -Ilib/librte_sched -I../lib/librte_sched -Ilib/librte_ip_frag -I../lib/librte_ip_frag -Ilib/librte_kni -I../lib/librte_kni -Ilib/librte_lpm -I../lib/librte_lpm -Ilib/librte_graph -I../lib/librte_graph -Ilib/librte_ipsec -I../lib/librte_ipsec -Ilib/librte_security -I../lib/librte_security -Ilib/librte_latencystats -I../lib/librte_latencystats -Ilib/librte_member -I../lib/librte_member -Ilib/librte_node -I../lib/librte_node -Ilib/librte_pipeline -I../lib/librte_pipeline -Ilib/librte_rawdev -I../lib/librte_rawdev -Ilib/librte_reorder -I../lib/librte_reorder -Ilib/librte_stack -I../lib/librte_stack -Idrivers/mempool/ring -I../drivers/mempool/ring -Idrivers/mempool/stack -I../drivers/mempool/stack -Idrivers/event/skeleton -I../drivers/event/skeleton -Idrivers/net/bonding -I../drivers/net/bonding -Idrivers/net/ring -I../drivers/net/ring -Ilib/librte_power -I../lib/librte_power -Ilib/librte_pdump -I../lib/librte_pdump -Ilib/librte_compressdev -I../lib/librte_compressdev -Idrivers/crypto/scheduler -I../drivers/crypto/scheduler -fdiagnostics-color=always -pipe -D_FILE_OFFSET_BITS=64 -Wall -Winvalid-pch -Werror -O3 -include rte_config.h -Wextra -Wcast-qual -Wdeprecated -Wformat -Wformat-nonliteral -Wformat-security -Wmissing-declarations -Wmissing-prototypes -Wnested-externs -Wold-style-definition -Wpointer-arith -Wsign-compare -Wstrict-prototypes -Wundef -Wwrite-strings -Wno-missing-field-initializers -march=native -DALLOW_EXPERIMENTAL_API -Wno-format-truncation -D_GNU_SOURCE -fno-strict-aliasing -DALLOW_INTERNAL_API -MD -MQ app/test/dpdk-test.p/test_mbuf.c.o -MF app/test/dpdk-test.p/test_mbuf.c.o.d -o app/test/dpdk-test.p/test_mbuf.c.o -c ../app/test/test_mbuf.c
../app/test/test_mbuf.c: In function ‘test_mbuf_dyn’:
../app/test/test_mbuf.c:2658:12: error: comparison between signed and unsigned integer expressions [-Werror=sign-compare]
  if (flag3 != rte_bsf64(PKT_LAST_FREE))
            ^~
cc1: all warnings being treated as errors
[2453/2733] Compiling C object app/test/dpdk-test.p/test_power_cpufreq.c.o
[2454/2733] Compiling C object app/test/dpdk-test.p/test_power_kvm_vm.c.o
[2455/2733] Compiling C object app/test/dpdk-test.p/test_mp_secondary.c.o
[2456/2733] Compiling C object app/test/dpdk-test.p/test_pmd_perf.c.o
[2457/2733] Compiling C object app/test/dpdk-test.p/test_memcpy_perf.c.o
[2458/2733] Compiling C object drivers/libtmp_rte_event_octeontx2.a.p/event_octeontx2_otx2_worker.c.o
[2459/2733] Compiling C object drivers/libtmp_rte_event_octeontx2.a.p/event_octeontx2_otx2_worker_dual.c.o
ninja: build stopped




*Build Failed #14:
OS: CentOsStream8-64
Target: x86_64-native-linuxapp-gcc
FAILED: app/test/dpdk-test.p/test_mbuf.c.o 
gcc -Iapp/test/dpdk-test.p -Iapp/test -I../app/test -Ilib/librte_acl -I../lib/librte_acl -I. -I.. -Iconfig -I../config -Ilib/librte_eal/include -I../lib/librte_eal/include -Ilib/librte_eal/linux/include -I../lib/librte_eal/linux/include -Ilib/librte_eal/x86/include -I../lib/librte_eal/x86/include -Ilib/librte_eal/common -I../lib/librte_eal/common -Ilib/librte_eal -I../lib/librte_eal -Ilib/librte_kvargs -I../lib/librte_kvargs -Ilib/librte_metrics -I../lib/librte_metrics -Ilib/librte_telemetry -I../lib/librte_telemetry -Idrivers/bus/pci -I../drivers/bus/pci -I../drivers/bus/pci/linux -Ilib/librte_pci -I../lib/librte_pci -Idrivers/bus/vdev -I../drivers/bus/vdev -Ilib/librte_bitratestats -I../lib/librte_bitratestats -Ilib/librte_ethdev -I../lib/librte_ethdev -Ilib/librte_net -I../lib/librte_net -Ilib/librte_mbuf -I../lib/librte_mbuf -Ilib/librte_mempool -I../lib/librte_mempool -Ilib/librte_ring -I../lib/librte_ring -Ilib/librte_meter -I../lib/librte_meter -Ilib/librte_bpf -I../lib/librte_bpf -Ilib/librte_cfgfile -I../lib/librte_cfgfile -Ilib/librte_cmdline -I../lib/librte_cmdline -Ilib/librte_cryptodev -I../lib/librte_cryptodev -Ilib/librte_rcu -I../lib/librte_rcu -Ilib/librte_distributor -I../lib/librte_distributor -Ilib/librte_efd -I../lib/librte_efd -Ilib/librte_hash -I../lib/librte_hash -Ilib/librte_eventdev -I../lib/librte_eventdev -Ilib/librte_timer -I../lib/librte_timer -Ilib/librte_fib -I../lib/librte_fib -Ilib/librte_rib -I../lib/librte_rib -Ilib/librte_flow_classify -I../lib/librte_flow_classify -Ilib/librte_table -I../lib/librte_table -Ilib/librte_port -I../lib/librte_port -Ilib/librte_sched -I../lib/librte_sched -Ilib/librte_ip_frag -I../lib/librte_ip_frag -Ilib/librte_kni -I../lib/librte_kni -Ilib/librte_lpm -I../lib/librte_lpm -Ilib/librte_graph -I../lib/librte_graph -Ilib/librte_ipsec -I../lib/librte_ipsec -Ilib/librte_security -I../lib/librte_security -Ilib/librte_latencystats -I../lib/librte_latencystats -Ilib/librte_member -I../lib/librte_member -Ilib/librte_node -I../lib/librte_node -Ilib/librte_pipeline -I../lib/librte_pipeline -Ilib/librte_rawdev -I../lib/librte_rawdev -Ilib/librte_reorder -I../lib/librte_reorder -Ilib/librte_stack -I../lib/librte_stack -Idrivers/mempool/ring -I../drivers/mempool/ring -Idrivers/mempool/stack -I../drivers/mempool/stack -Idrivers/event/skeleton -I../drivers/event/skeleton -Idrivers/net/bonding -I../drivers/net/bonding -Idrivers/net/ring -I../drivers/net/ring -Ilib/librte_power -I../lib/librte_power -Ilib/librte_pdump -I../lib/librte_pdump -Ilib/librte_compressdev -I../lib/librte_compressdev -Idrivers/crypto/scheduler -I../drivers/crypto/scheduler -fdiagnostics-color=always -pipe -D_FILE_OFFSET_BITS=64 -Wall -Winvalid-pch -Werror -O3 -include rte_config.h -Wextra -Wcast-qual -Wdeprecated -Wformat -Wformat-nonliteral -Wformat-security -Wmissing-declarations -Wmissing-prototypes -Wnested-externs -Wold-style-definition -Wpointer-arith -Wsign-compare -Wstrict-prototypes -Wundef -Wwrite-strings -Wno-packed-not-aligned -Wno-missing-field-initializers -march=native -DALLOW_EXPERIMENTAL_API -Wno-format-truncation -D_GNU_SOURCE -fno-strict-aliasing -DALLOW_INTERNAL_API -MD -MQ app/test/dpdk-test.p/test_mbuf.c.o -MF app/test/dpdk-test.p/test_mbuf.c.o.d -o app/test/dpdk-test.p/test_mbuf.c.o -c ../app/test/test_mbuf.c
../app/test/test_mbuf.c: In function ‘test_mbuf_dyn’:
../app/test/test_mbuf.c:2658:12: error: comparison of integer expressions of different signedness: ‘int’ and ‘uint32_t’ {aka ‘unsigned int’} [-Werror=sign-compare]
  if (flag3 != rte_bsf64(PKT_LAST_FREE))
            ^~
cc1: all warnings being treated as errors
[2568/2832] Compiling C object app/test/dpdk-test.p/test_ring_mt_peek_stress.c.o
[2569/2832] Compiling C object app/test/dpdk-test.p/test_ring_stress.c.o
[2570/2832] Compiling C object app/test/dpdk-test.p/test_ring_rts_stress.c.o
[2571/2832] Compiling C object app/test/dpdk-test.p/test_ring_st_peek_stress_zc.c.o
[2572/2832] Compiling C object app/test/dpdk-test.p/test_ring_st_peek_stress.c.o
[2573/2832] Compiling C object app/test/dpdk-test.p/test_cryptodev.c.o
[2574/2832] Compiling C object app/test/dpdk-test.p/test_memcpy_perf.c.o
[2575/2832] Compiling C object app/test/dpdk-test.p/test_ring_perf.c.o
[2576/2832] Compiling C object app/test/dpdk-test.p/test_ring.c.o
[2577/2832] Compiling C object drivers/libtmp_rte_event_octeontx2.a.p/event_octeontx2_otx2_worker.c.o
[2578/2832] Compiling C object drivers/libtmp_rte_event_octeontx2.a.p/event_octeontx2_otx2_worker_dual.c.o
ninja: build stopped




*Build Failed #15:
OS: UB2004-32
Target: i686-native-linuxapp-gcc
FAILED: app/test/dpdk-test.p/test_mbuf.c.o 
gcc -Iapp/test/dpdk-test.p -Iapp/test -I../app/test -Ilib/librte_acl -I../lib/librte_acl -I. -I.. -Iconfig -I../config -Ilib/librte_eal/include -I../lib/librte_eal/include -Ilib/librte_eal/linux/include -I../lib/librte_eal/linux/include -Ilib/librte_eal/x86/include -I../lib/librte_eal/x86/include -Ilib/librte_eal/common -I../lib/librte_eal/common -Ilib/librte_eal -I../lib/librte_eal -Ilib/librte_kvargs -I../lib/librte_kvargs -Ilib/librte_metrics -I../lib/librte_metrics -Ilib/librte_telemetry -I../lib/librte_telemetry -Idrivers/bus/pci -I../drivers/bus/pci -I../drivers/bus/pci/linux -Ilib/librte_pci -I../lib/librte_pci -Idrivers/bus/vdev -I../drivers/bus/vdev -Ilib/librte_bitratestats -I../lib/librte_bitratestats -Ilib/librte_ethdev -I../lib/librte_ethdev -Ilib/librte_net -I../lib/librte_net -Ilib/librte_mbuf -I../lib/librte_mbuf -Ilib/librte_mempool -I../lib/librte_mempool -Ilib/librte_ring -I../lib/librte_ring -Ilib/librte_meter -I../lib/librte_meter -Ilib/librte_bpf -I../lib/librte_bpf -Ilib/librte_cfgfile -I../lib/librte_cfgfile -Ilib/librte_cmdline -I../lib/librte_cmdline -Ilib/librte_cryptodev -I../lib/librte_cryptodev -Ilib/librte_rcu -I../lib/librte_rcu -Ilib/librte_distributor -I../lib/librte_distributor -Ilib/librte_efd -I../lib/librte_efd -Ilib/librte_hash -I../lib/librte_hash -Ilib/librte_eventdev -I../lib/librte_eventdev -Ilib/librte_timer -I../lib/librte_timer -Ilib/librte_fib -I../lib/librte_fib -Ilib/librte_rib -I../lib/librte_rib -Ilib/librte_flow_classify -I../lib/librte_flow_classify -Ilib/librte_table -I../lib/librte_table -Ilib/librte_port -I../lib/librte_port -Ilib/librte_sched -I../lib/librte_sched -Ilib/librte_ip_frag -I../lib/librte_ip_frag -Ilib/librte_lpm -I../lib/librte_lpm -Ilib/librte_graph -I../lib/librte_graph -Ilib/librte_ipsec -I../lib/librte_ipsec -Ilib/librte_security -I../lib/librte_security -Ilib/librte_latencystats -I../lib/librte_latencystats -Ilib/librte_member -I../lib/librte_member -Ilib/librte_node -I../lib/librte_node -Ilib/librte_pipeline -I../lib/librte_pipeline -Ilib/librte_rawdev -I../lib/librte_rawdev -Ilib/librte_reorder -I../lib/librte_reorder -Ilib/librte_stack -I../lib/librte_stack -Idrivers/mempool/ring -I../drivers/mempool/ring -Idrivers/mempool/stack -I../drivers/mempool/stack -Idrivers/event/skeleton -I../drivers/event/skeleton -Idrivers/net/bonding -I../drivers/net/bonding -Idrivers/net/ring -I../drivers/net/ring -Ilib/librte_power -I../lib/librte_power -Ilib/librte_pdump -I../lib/librte_pdump -Idrivers/crypto/scheduler -I../drivers/crypto/scheduler -fdiagnostics-color=always -pipe -D_FILE_OFFSET_BITS=64 -Wall -Winvalid-pch -Werror -O3 -include rte_config.h -Wextra -Wcast-qual -Wdeprecated -Wformat -Wformat-nonliteral -Wformat-security -Wmissing-declarations -Wmissing-prototypes -Wnested-externs -Wold-style-definition -Wpointer-arith -Wsign-compare -Wstrict-prototypes -Wundef -Wwrite-strings -Wno-address-of-packed-member -Wno-packed-not-aligned -Wno-missing-field-initializers -Wno-pointer-to-int-cast -m32 -march=native -DALLOW_EXPERIMENTAL_API -Wno-format-truncation -D_GNU_SOURCE -fno-strict-aliasing -DALLOW_INTERNAL_API -MD -MQ app/test/dpdk-test.p/test_mbuf.c.o -MF app/test/dpdk-test.p/test_mbuf.c.o.d -o app/test/dpdk-test.p/test_mbuf.c.o -c ../app/test/test_mbuf.c
../app/test/test_mbuf.c: In function ‘test_mbuf_dyn’:
../app/test/test_mbuf.c:2658:12: error: comparison of integer expressions of different signedness: ‘int’ and ‘uint32_t’ {aka ‘unsigned int’} [-Werror=sign-compare]
 2658 |  if (flag3 != rte_bsf64(PKT_LAST_FREE))
      |            ^~
cc1: all warnings being treated as errors
[2159/2374] Compiling C object app/test/dpdk-test.p/test_ring_st_peek_stress.c.o
[2160/2374] Compiling C object app/test/dpdk-test.p/test_spinlock.c.o
[2161/2374] Compiling C object app/test/dpdk-test.p/test_sched.c.o
[2162/2374] Compiling C object app/test/dpdk-test.p/test_service_cores.c.o
[2163/2374] Compiling C object app/test/dpdk-test.p/test_security.c.o
[2164/2374] Compiling C object app/test/dpdk-test.p/test_cryptodev.c.o
[2165/2374] Compiling C object app/test/dpdk-test.p/test_memcpy_perf.c.o
[2166/2374] Compiling C object app/test/dpdk-test.p/test_ring_perf.c.o
[2167/2374] Compiling C object app/test/dpdk-test.p/test_ring.c.o
ninja: build stopped




*Build Failed #16:
OS: UB2004-64
Target: x86_64-native-linuxapp-clang
FAILED: app/test/dpdk-test.p/test_mbuf.c.o 
clang -Iapp/test/dpdk-test.p -Iapp/test -I../app/test -Ilib/librte_acl -I../lib/librte_acl -I. -I.. -Iconfig -I../config -Ilib/librte_eal/include -I../lib/librte_eal/include -Ilib/librte_eal/linux/include -I../lib/librte_eal/linux/include -Ilib/librte_eal/x86/include -I../lib/librte_eal/x86/include -Ilib/librte_eal/common -I../lib/librte_eal/common -Ilib/librte_eal -I../lib/librte_eal -Ilib/librte_kvargs -I../lib/librte_kvargs -Ilib/librte_metrics -I../lib/librte_metrics -Ilib/librte_telemetry -I../lib/librte_telemetry -Idrivers/bus/pci -I../drivers/bus/pci -I../drivers/bus/pci/linux -Ilib/librte_pci -I../lib/librte_pci -Idrivers/bus/vdev -I../drivers/bus/vdev -Ilib/librte_bitratestats -I../lib/librte_bitratestats -Ilib/librte_ethdev -I../lib/librte_ethdev -Ilib/librte_net -I../lib/librte_net -Ilib/librte_mbuf -I../lib/librte_mbuf -Ilib/librte_mempool -I../lib/librte_mempool -Ilib/librte_ring -I../lib/librte_ring -Ilib/librte_meter -I../lib/librte_meter -Ilib/librte_bpf -I../lib/librte_bpf -Ilib/librte_cfgfile -I../lib/librte_cfgfile -Ilib/librte_cmdline -I../lib/librte_cmdline -Ilib/librte_cryptodev -I../lib/librte_cryptodev -Ilib/librte_rcu -I../lib/librte_rcu -Ilib/librte_distributor -I../lib/librte_distributor -Ilib/librte_efd -I../lib/librte_efd -Ilib/librte_hash -I../lib/librte_hash -Ilib/librte_eventdev -I../lib/librte_eventdev -Ilib/librte_timer -I../lib/librte_timer -Ilib/librte_fib -I../lib/librte_fib -Ilib/librte_rib -I../lib/librte_rib -Ilib/librte_flow_classify -I../lib/librte_flow_classify -Ilib/librte_table -I../lib/librte_table -Ilib/librte_port -I../lib/librte_port -Ilib/librte_sched -I../lib/librte_sched -Ilib/librte_ip_frag -I../lib/librte_ip_frag -Ilib/librte_kni -I../lib/librte_kni -Ilib/librte_lpm -I../lib/librte_lpm -Ilib/librte_graph -I../lib/librte_graph -Ilib/librte_ipsec -I../lib/librte_ipsec -Ilib/librte_security -I../lib/librte_security -Ilib/librte_latencystats -I../lib/librte_latencystats -Ilib/librte_member -I../lib/librte_member -Ilib/librte_node -I../lib/librte_node -Ilib/librte_pipeline -I../lib/librte_pipeline -Ilib/librte_rawdev -I../lib/librte_rawdev -Ilib/librte_reorder -I../lib/librte_reorder -Ilib/librte_stack -I../lib/librte_stack -Idrivers/mempool/ring -I../drivers/mempool/ring -Idrivers/mempool/stack -I../drivers/mempool/stack -Idrivers/event/skeleton -I../drivers/event/skeleton -Idrivers/net/bonding -I../drivers/net/bonding -Idrivers/net/ring -I../drivers/net/ring -Ilib/librte_power -I../lib/librte_power -Ilib/librte_pdump -I../lib/librte_pdump -Ilib/librte_compressdev -I../lib/librte_compressdev -Idrivers/crypto/scheduler -I../drivers/crypto/scheduler -Xclang -fcolor-diagnostics -pipe -D_FILE_OFFSET_BITS=64 -Wall -Winvalid-pch -Werror -O3 -include rte_config.h -Wextra -Wcast-qual -Wdeprecated -Wformat -Wformat-nonliteral -Wformat-security -Wmissing-declarations -Wmissing-prototypes -Wnested-externs -Wold-style-definition -Wpointer-arith -Wsign-compare -Wstrict-prototypes -Wundef -Wwrite-strings -Wno-address-of-packed-member -Wno-missing-field-initializers -march=native -DALLOW_EXPERIMENTAL_API -D_GNU_SOURCE -fno-strict-aliasing -DALLOW_INTERNAL_API -MD -MQ app/test/dpdk-test.p/test_mbuf.c.o -MF app/test/dpdk-test.p/test_mbuf.c.o.d -o app/test/dpdk-test.p/test_mbuf.c.o -c ../app/test/test_mbuf.c
../app/test/test_mbuf.c:2658:12: error: comparison of integers of different signs: 'int' and 'uint32_t' (aka 'unsigned int') [-Werror,-Wsign-compare]
        if (flag3 != rte_bsf64(PKT_LAST_FREE))
            ~~~~~ ^  ~~~~~~~~~~~~~~~~~~~~~~~~
1 error generated.
[2531/2828] Compiling C object app/test/dpdk-test.p/test_lpm.c.o
[2532/2828] Compiling C object app/test/dpdk-test.p/test_memcpy.c.o
[2533/2828] Compiling C object app/test/dpdk-test.p/test_lpm_perf.c.o
[2534/2828] Compiling C object app/test/dpdk-test.p/test_member.c.o
[2535/2828] Compiling C object app/test/dpdk-test.p/test_cryptodev.c.o
[2536/2828] Compiling C object app/test/dpdk-test.p/test_member_perf.c.o
[2537/2828] Compiling C object app/test/dpdk-test.p/test_memcpy_perf.c.o
[2538/2828] Compiling C object drivers/libtmp_rte_event_octeontx2.a.p/event_octeontx2_otx2_worker.c.o
[2539/2828] Compiling C object drivers/libtmp_rte_event_octeontx2.a.p/event_octeontx2_otx2_worker_dual.c.o
ninja: build stopped




*Build Failed #17:
OS: UB2004-64
Target: x86_64-native-linuxapp-gcc
FAILED: app/test/dpdk-test.p/test_mbuf.c.o 
gcc -Iapp/test/dpdk-test.p -Iapp/test -I../app/test -Ilib/librte_acl -I../lib/librte_acl -I. -I.. -Iconfig -I../config -Ilib/librte_eal/include -I../lib/librte_eal/include -Ilib/librte_eal/linux/include -I../lib/librte_eal/linux/include -Ilib/librte_eal/x86/include -I../lib/librte_eal/x86/include -Ilib/librte_eal/common -I../lib/librte_eal/common -Ilib/librte_eal -I../lib/librte_eal -Ilib/librte_kvargs -I../lib/librte_kvargs -Ilib/librte_metrics -I../lib/librte_metrics -Ilib/librte_telemetry -I../lib/librte_telemetry -Idrivers/bus/pci -I../drivers/bus/pci -I../drivers/bus/pci/linux -Ilib/librte_pci -I../lib/librte_pci -Idrivers/bus/vdev -I../drivers/bus/vdev -Ilib/librte_bitratestats -I../lib/librte_bitratestats -Ilib/librte_ethdev -I../lib/librte_ethdev -Ilib/librte_net -I../lib/librte_net -Ilib/librte_mbuf -I../lib/librte_mbuf -Ilib/librte_mempool -I../lib/librte_mempool -Ilib/librte_ring -I../lib/librte_ring -Ilib/librte_meter -I../lib/librte_meter -Ilib/librte_bpf -I../lib/librte_bpf -Ilib/librte_cfgfile -I../lib/librte_cfgfile -Ilib/librte_cmdline -I../lib/librte_cmdline -Ilib/librte_cryptodev -I../lib/librte_cryptodev -Ilib/librte_rcu -I../lib/librte_rcu -Ilib/librte_distributor -I../lib/librte_distributor -Ilib/librte_efd -I../lib/librte_efd -Ilib/librte_hash -I../lib/librte_hash -Ilib/librte_eventdev -I../lib/librte_eventdev -Ilib/librte_timer -I../lib/librte_timer -Ilib/librte_fib -I../lib/librte_fib -Ilib/librte_rib -I../lib/librte_rib -Ilib/librte_flow_classify -I../lib/librte_flow_classify -Ilib/librte_table -I../lib/librte_table -Ilib/librte_port -I../lib/librte_port -Ilib/librte_sched -I../lib/librte_sched -Ilib/librte_ip_frag -I../lib/librte_ip_frag -Ilib/librte_kni -I../lib/librte_kni -Ilib/librte_lpm -I../lib/librte_lpm -Ilib/librte_graph -I../lib/librte_graph -Ilib/librte_ipsec -I../lib/librte_ipsec -Ilib/librte_security -I../lib/librte_security -Ilib/librte_latencystats -I../lib/librte_latencystats -Ilib/librte_member -I../lib/librte_member -Ilib/librte_node -I../lib/librte_node -Ilib/librte_pipeline -I../lib/librte_pipeline -Ilib/librte_rawdev -I../lib/librte_rawdev -Ilib/librte_reorder -I../lib/librte_reorder -Ilib/librte_stack -I../lib/librte_stack -Idrivers/mempool/ring -I../drivers/mempool/ring -Idrivers/mempool/stack -I../drivers/mempool/stack -Idrivers/event/skeleton -I../drivers/event/skeleton -Idrivers/net/bonding -I../drivers/net/bonding -Idrivers/net/ring -I../drivers/net/ring -Ilib/librte_power -I../lib/librte_power -Ilib/librte_pdump -I../lib/librte_pdump -Ilib/librte_compressdev -I../lib/librte_compressdev -Idrivers/crypto/scheduler -I../drivers/crypto/scheduler -fdiagnostics-color=always -pipe -D_FILE_OFFSET_BITS=64 -Wall -Winvalid-pch -Werror -O3 -include rte_config.h -Wextra -Wcast-qual -Wdeprecated -Wformat -Wformat-nonliteral -Wformat-security -Wmissing-declarations -Wmissing-prototypes -Wnested-externs -Wold-style-definition -Wpointer-arith -Wsign-compare -Wstrict-prototypes -Wundef -Wwrite-strings -Wno-address-of-packed-member -Wno-packed-not-aligned -Wno-missing-field-initializers -Wno-zero-length-bounds -march=native -DALLOW_EXPERIMENTAL_API -Wno-format-truncation -D_GNU_SOURCE -fno-strict-aliasing -DALLOW_INTERNAL_API -MD -MQ app/test/dpdk-test.p/test_mbuf.c.o -MF app/test/dpdk-test.p/test_mbuf.c.o.d -o app/test/dpdk-test.p/test_mbuf.c.o -c ../app/test/test_mbuf.c
../app/test/test_mbuf.c: In function ‘test_mbuf_dyn’:
../app/test/test_mbuf.c:2658:12: error: comparison of integer expressions of different signedness: ‘int’ and ‘uint32_t’ {aka ‘unsigned int’} [-Werror=sign-compare]
 2658 |  if (flag3 != rte_bsf64(PKT_LAST_FREE))
      |            ^~
cc1: all warnings being treated as errors
[2563/2828] Compiling C object app/test/dpdk-test.p/test_ring_mpmc_stress.c.o
[2564/2828] Compiling C object app/test/dpdk-test.p/test_ring_hts_stress.c.o
[2565/2828] Compiling C object app/test/dpdk-test.p/test_ring_mt_peek_stress_zc.c.o
[2566/2828] Compiling C object app/test/dpdk-test.p/test_ring_mt_peek_stress.c.o
[2567/2828] Compiling C object app/test/dpdk-test.p/test_cryptodev.c.o
[2568/2828] Compiling C object app/test/dpdk-test.p/test_memcpy_perf.c.o
[2569/2828] Compiling C object app/test/dpdk-test.p/test_ring.c.o
[2570/2828] Compiling C object drivers/libtmp_rte_event_octeontx2.a.p/event_octeontx2_otx2_worker.c.o
[2571/2828] Compiling C object drivers/libtmp_rte_event_octeontx2.a.p/event_octeontx2_otx2_worker_dual.c.o
ninja: build stopped




*Build Failed #18:
OS: UB2004-64
Target: x86_64-native-linuxapp-doc
FAILED: app/test/dpdk-test.p/test_mbuf.c.o 
gcc -Iapp/test/dpdk-test.p -Iapp/test -I../app/test -Ilib/librte_acl -I../lib/librte_acl -I. -I.. -Iconfig -I../config -Ilib/librte_eal/include -I../lib/librte_eal/include -Ilib/librte_eal/linux/include -I../lib/librte_eal/linux/include -Ilib/librte_eal/x86/include -I../lib/librte_eal/x86/include -Ilib/librte_eal/common -I../lib/librte_eal/common -Ilib/librte_eal -I../lib/librte_eal -Ilib/librte_kvargs -I../lib/librte_kvargs -Ilib/librte_metrics -I../lib/librte_metrics -Ilib/librte_telemetry -I../lib/librte_telemetry -Idrivers/bus/pci -I../drivers/bus/pci -I../drivers/bus/pci/linux -Ilib/librte_pci -I../lib/librte_pci -Idrivers/bus/vdev -I../drivers/bus/vdev -Ilib/librte_bitratestats -I../lib/librte_bitratestats -Ilib/librte_ethdev -I../lib/librte_ethdev -Ilib/librte_net -I../lib/librte_net -Ilib/librte_mbuf -I../lib/librte_mbuf -Ilib/librte_mempool -I../lib/librte_mempool -Ilib/librte_ring -I../lib/librte_ring -Ilib/librte_meter -I../lib/librte_meter -Ilib/librte_bpf -I../lib/librte_bpf -Ilib/librte_cfgfile -I../lib/librte_cfgfile -Ilib/librte_cmdline -I../lib/librte_cmdline -Ilib/librte_cryptodev -I../lib/librte_cryptodev -Ilib/librte_rcu -I../lib/librte_rcu -Ilib/librte_distributor -I../lib/librte_distributor -Ilib/librte_efd -I../lib/librte_efd -Ilib/librte_hash -I../lib/librte_hash -Ilib/librte_eventdev -I../lib/librte_eventdev -Ilib/librte_timer -I../lib/librte_timer -Ilib/librte_fib -I../lib/librte_fib -Ilib/librte_rib -I../lib/librte_rib -Ilib/librte_flow_classify -I../lib/librte_flow_classify -Ilib/librte_table -I../lib/librte_table -Ilib/librte_port -I../lib/librte_port -Ilib/librte_sched -I../lib/librte_sched -Ilib/librte_ip_frag -I../lib/librte_ip_frag -Ilib/librte_kni -I../lib/librte_kni -Ilib/librte_lpm -I../lib/librte_lpm -Ilib/librte_graph -I../lib/librte_graph -Ilib/librte_ipsec -I../lib/librte_ipsec -Ilib/librte_security -I../lib/librte_security -Ilib/librte_latencystats -I../lib/librte_latencystats -Ilib/librte_member -I../lib/librte_member -Ilib/librte_node -I../lib/librte_node -Ilib/librte_pipeline -I../lib/librte_pipeline -Ilib/librte_rawdev -I../lib/librte_rawdev -Ilib/librte_reorder -I../lib/librte_reorder -Ilib/librte_stack -I../lib/librte_stack -Idrivers/mempool/ring -I../drivers/mempool/ring -Idrivers/mempool/stack -I../drivers/mempool/stack -Idrivers/event/skeleton -I../drivers/event/skeleton -Idrivers/net/bonding -I../drivers/net/bonding -Idrivers/net/ring -I../drivers/net/ring -Ilib/librte_power -I../lib/librte_power -Ilib/librte_pdump -I../lib/librte_pdump -Ilib/librte_compressdev -I../lib/librte_compressdev -Idrivers/crypto/scheduler -I../drivers/crypto/scheduler -fdiagnostics-color=always -pipe -D_FILE_OFFSET_BITS=64 -Wall -Winvalid-pch -Werror -O3 -include rte_config.h -Wextra -Wcast-qual -Wdeprecated -Wformat -Wformat-nonliteral -Wformat-security -Wmissing-declarations -Wmissing-prototypes -Wnested-externs -Wold-style-definition -Wpointer-arith -Wsign-compare -Wstrict-prototypes -Wundef -Wwrite-strings -Wno-address-of-packed-member -Wno-packed-not-aligned -Wno-missing-field-initializers -march=native -DALLOW_EXPERIMENTAL_API -Wno-format-truncation -D_GNU_SOURCE -fno-strict-aliasing -DALLOW_INTERNAL_API -MD -MQ app/test/dpdk-test.p/test_mbuf.c.o -MF app/test/dpdk-test.p/test_mbuf.c.o.d -o app/test/dpdk-test.p/test_mbuf.c.o -c ../app/test/test_mbuf.c
../app/test/test_mbuf.c: In function ‘test_mbuf_dyn’:
../app/test/test_mbuf.c:2658:12: error: comparison of integer expressions of different signedness: ‘int’ and ‘uint32_t’ {aka ‘unsigned int’} [-Werror=sign-compare]
 2658 |  if (flag3 != rte_bsf64(PKT_LAST_FREE))
      |            ^~
cc1: all warnings being treated as errors
[2559/2638] Compiling C object app/test/dpdk-test.p/test_ring_hts_stress.c.o
[2560/2638] Compiling C object app/test/dpdk-test.p/test_ring_mpmc_stress.c.o
[2561/2638] Compiling C object app/test/dpdk-test.p/test_cryptodev.c.o
[2562/2638] Compiling C object app/test/dpdk-test.p/test_ring_mt_peek_stress_zc.c.o
[2563/2638] Compiling C object app/test/dpdk-test.p/test_ring_mt_peek_stress.c.o
[2564/2638] Compiling C object app/test/dpdk-test.p/test_memcpy_perf.c.o
[2565/2638] Compiling C object app/test/dpdk-test.p/test_ring.c.o
[2566/2638] Compiling C object drivers/libtmp_rte_event_octeontx2.a.p/event_octeontx2_otx2_worker.c.o
[2567/2638] Compiling C object drivers/libtmp_rte_event_octeontx2.a.p/event_octeontx2_otx2_worker_dual.c.o
ninja: build stopped




*Build Failed #19:
OS: UB2010-64
Target: x86_64-native-linuxapp-gcc
FAILED: app/test/3062f5d@@dpdk-test at exe/test_mbuf.c.o 
gcc -Iapp/test/3062f5d@@dpdk-test at exe -Iapp/test -I../app/test -Ilib/librte_acl -I../lib/librte_acl -I. -I../ -Iconfig -I../config -Ilib/librte_eal/include -I../lib/librte_eal/include -Ilib/librte_eal/linux/include -I../lib/librte_eal/linux/include -Ilib/librte_eal/x86/include -I../lib/librte_eal/x86/include -Ilib/librte_eal/common -I../lib/librte_eal/common -Ilib/librte_eal -I../lib/librte_eal -Ilib/librte_kvargs -I../lib/librte_kvargs -Ilib/librte_telemetry/../librte_metrics -I../lib/librte_telemetry/../librte_metrics -Ilib/librte_telemetry -I../lib/librte_telemetry -Idrivers/bus/pci -I../drivers/bus/pci -I../drivers/bus/pci/linux -Ilib/librte_pci -I../lib/librte_pci -Idrivers/bus/vdev -I../drivers/bus/vdev -Ilib/librte_bitratestats -I../lib/librte_bitratestats -Ilib/librte_ethdev -I../lib/librte_ethdev -Ilib/librte_net -I../lib/librte_net -Ilib/librte_mbuf -I../lib/librte_mbuf -Ilib/librte_mempool -I../lib/librte_mempool -Ilib/librte_ring -I../lib/librte_ring -Ilib/librte_meter -I../lib/librte_meter -Ilib/librte_metrics -I../lib/librte_metrics -Ilib/librte_bpf -I../lib/librte_bpf -Ilib/librte_cfgfile -I../lib/librte_cfgfile -Ilib/librte_cmdline -I../lib/librte_cmdline -Ilib/librte_cryptodev -I../lib/librte_cryptodev -Ilib/librte_rcu -I../lib/librte_rcu -Ilib/librte_distributor -I../lib/librte_distributor -Ilib/librte_efd -I../lib/librte_efd -Ilib/librte_hash -I../lib/librte_hash -Ilib/librte_eventdev -I../lib/librte_eventdev -Ilib/librte_timer -I../lib/librte_timer -Ilib/librte_fib -I../lib/librte_fib -Ilib/librte_rib -I../lib/librte_rib -Ilib/librte_flow_classify -I../lib/librte_flow_classify -Ilib/librte_table -I../lib/librte_table -Ilib/librte_port -I../lib/librte_port -Ilib/librte_sched -I../lib/librte_sched -Ilib/librte_ip_frag -I../lib/librte_ip_frag -Ilib/librte_kni -I../lib/librte_kni -Ilib/librte_lpm -I../lib/librte_lpm -Ilib/librte_graph -I../lib/librte_graph -Ilib/librte_ipsec -I../lib/librte_ipsec -Ilib/librte_security -I../lib/librte_security -Ilib/librte_latencystats -I../lib/librte_latencystats -Ilib/librte_member -I../lib/librte_member -Ilib/librte_node -I../lib/librte_node -Ilib/librte_pipeline -I../lib/librte_pipeline -Ilib/librte_rawdev -I../lib/librte_rawdev -Ilib/librte_reorder -I../lib/librte_reorder -Ilib/librte_stack -I../lib/librte_stack -Idrivers/mempool/ring -I../drivers/mempool/ring -Idrivers/mempool/stack -I../drivers/mempool/stack -Idrivers/event/skeleton -I../drivers/event/skeleton -Idrivers/net/bonding -I../drivers/net/bonding -Idrivers/net/ring -I../drivers/net/ring -Ilib/librte_power -I../lib/librte_power -Ilib/librte_pdump -I../lib/librte_pdump -Ilib/librte_compressdev -I../lib/librte_compressdev -Idrivers/crypto/scheduler -I../drivers/crypto/scheduler -fdiagnostics-color=always -pipe -D_FILE_OFFSET_BITS=64 -Wall -Winvalid-pch -Werror -O3 -include rte_config.h -Wextra -Wcast-qual -Wdeprecated -Wformat -Wformat-nonliteral -Wformat-security -Wmissing-declarations -Wmissing-prototypes -Wnested-externs -Wold-style-definition -Wpointer-arith -Wsign-compare -Wstrict-prototypes -Wundef -Wwrite-strings -Wno-address-of-packed-member -Wno-packed-not-aligned -Wno-missing-field-initializers -Wno-zero-length-bounds -march=native -DALLOW_EXPERIMENTAL_API -Wno-format-truncation -D_GNU_SOURCE -fno-strict-aliasing -DALLOW_INTERNAL_API -MD -MQ 'app/test/3062f5d@@dpdk-test at exe/test_mbuf.c.o' -MF 'app/test/3062f5d@@dpdk-test at exe/test_mbuf.c.o.d' -o 'app/test/3062f5d@@dpdk-test at exe/test_mbuf.c.o' -c ../app/test/test_mbuf.c
../app/test/test_mbuf.c: In function ‘test_mbuf_dyn’:
../app/test/test_mbuf.c:2658:12: error: comparison of integer expressions of different signedness: ‘int’ and ‘uint32_t’ {aka ‘unsigned int’} [-Werror=sign-compare]
 2658 |  if (flag3 != rte_bsf64(PKT_LAST_FREE))
      |            ^~
cc1: all warnings being treated as errors
[2574/2831] Compiling C object 'app/test/3062f5d@@dpdk-test at exe/test_sched.c.o'.
[2575/2831] Compiling C object 'app/test/3062f5d@@dpdk-test at exe/test_spinlock.c.o'.
[2576/2831] Compiling C object 'app/test/3062f5d@@dpdk-test at exe/test_service_cores.c.o'.
[2577/2831] Compiling C object 'app/test/3062f5d@@dpdk-test at exe/test_security.c.o'.
[2578/2831] Compiling C object 'app/test/3062f5d@@dpdk-test at exe/test_memcpy_perf.c.o'.
[2579/2831] Compiling C object 'app/test/3062f5d@@dpdk-test at exe/test_ring_perf.c.o'.
[2580/2831] Compiling C object 'app/test/3062f5d@@dpdk-test at exe/test_ring.c.o'.
[2581/2831] Compiling C object 'drivers/a715181@@tmp_rte_event_octeontx2 at sta/event_octeontx2_otx2_worker.c.o'.
[2582/2831] Compiling C object 'drivers/a715181@@tmp_rte_event_octeontx2 at sta/event_octeontx2_otx2_worker_dual.c.o'.
ninja: build stopped


DPDK STV team


More information about the test-report mailing list