[dpdk-test-report] |FAILURE| pw(88940) [8/8] drivers: add common driver API to get efx family

sys_stv at intel.com sys_stv at intel.com
Thu Mar 11 12:50:08 CET 2021


Test-Label: Intel-compilation
Test-Status: FAILURE
http://dpdk.org/patch/88940

_Compilation issues_

Submitter: Andrew Rybchenko <Andrew.Rybchenko at oktetlabs.ru>
Date: 2021-03-11 11:03:25
Reply_mail: 20210311110325.3291203-9-andrew.rybchenko at oktetlabs.ru

DPDK git baseline: Repo:dpdk-next-net, CommitID: 222e4ce24cd0f511f85bae63585005f9d2e5df99


Meson Build Summary: 22 Builds Done, 21 Successful, 1 Failures, 0 Blocked

+------------------+------------+--------------+------------+------------+-----------+----------+
| os               | gcc-static | clang-static | icc-static | gcc-shared | gcc-debug | document |
+------------------+------------+--------------+------------+------------+-----------+----------+
| UB2004-64        | pass       | pass         | pass       |            |           | pass     |
| RHEL83-64        | pass       |              |            |            |           |          |
| FC33-64          | pass       | pass         |            |            |           |          |
| CentOsStream8-64 | pass       |              |            |            |           |          |
| UB2010-64        | pass       |              |            |            |           |          |
| WIN10-64         |            | FAIL         |            |            |           |          |
| UB2004-32        | pass       |              |            |            |           |          |
| CENTOS83-64      | pass       | pass         | pass       | pass       | pass      |          |
| FreeBSD1201-64   | pass       | pass         |            | pass       | pass      |          |
| SUSE15-64        | pass       | pass         |            |            |           |          |
+------------------+------------+--------------+------------+------------+-----------+----------+
Test environment and configuration as below:


OS: UB2004-64
	Kernel Version: 5.6.0-050600-generic
	GCC Version: gcc (Ubuntu 10-20200416-0ubuntu1) 10.0.1 20200416 (experimental) [master revision 3c3f12e2a76:dcee354ce56:44b326839d864fc10c459916abcc97f35a9ac3de]
	Clang Version: 10.0.0-4ubuntu1
	x86_64-native-linuxapp-clang
	x86_64-native-linuxapp-gcc
	x86_64-native-linuxapp-icc
	x86_64-native-linuxapp-doc

OS: RHEL83-64
	Kernel Version: 4.18.0-240.el8.x86_64
	GCC Version: gcc (GCC) 8.3.1 20191121 (Red Hat 8.3.1-5)
	Clang Version: 10.0.1 (Red Hat 10.0.1-1.module+el8.3.0+7459+90c24896)
	x86_64-native-linuxapp-gcc

OS: FC33-64
	Kernel Version: 5.8.16-300.fc33.x86_64
	GCC Version: gcc (GCC) 10.2.1 20201005 (Red Hat 10.2.1-5)
	Clang Version: 11.0.0 (Fedora 11.0.0-1.fc33)
	x86_64-native-linuxapp-gcc
	x86_64-native-linuxapp-clang

OS: CentOsStream8-64
	Kernel Version: 4.18.0-257.el8.x86_64
	GCC Version: gcc (GCC) 8.4.1 20200928 (Red Hat 8.4.1-1)
	Clang Version: 11.0.0 (Red Hat 11.0.0-0.2.rc2.module_el8.4.0+533+50191577)
	x86_64-native-linuxapp-gcc

OS: UB2010-64
	Kernel Version: 5.8.0-25-generic
	GCC Version: gcc (Ubuntu 10.2.0-13ubuntu1) 10.2.0
	Clang Version: 11.0.0-2
	x86_64-native-linuxapp-gcc

OS: WIN10-64
	Kernel Version: N/A
	GCC Version: N/A
	Clang Version: Clang 8.0.0
	x86_64-windows-clang

OS: UB2004-32
	Kernel Version: 5.6.0-050600-generic
	GCC Version: gcc (Ubuntu 9.3.0-10ubuntu2) 9.3.0
	Clang Version: 10.0.0-4ubuntu1
	i686-native-linuxapp-gcc

OS: CENTOS83-64
	Kernel Version: 4.18.0-240.1.1.el8_3.x86_64
	GCC Version: gcc (GCC) 8.3.1 20191121 (Red Hat 8.3.1-5)
	Clang Version: 10.0.1 (Red Hat 10.0.1-1.module_el8.3.0+467+cb298d5b)
	x86_64-native-linuxapp-gcc
	x86_64-native-linuxapp-clang
	x86_64-native-linuxapp-icc
	x86_64-native-linuxapp-gcc+shared
	x86_64-native-linuxapp-gcc+debug

OS: FreeBSD1201-64
	Kernel Version: 12.1-RELEASE
	GCC Version: gcc (FreeBSD Ports Collection) 9.2.0
	Clang Version: 8.0.1 (tags/RELEASE_801/final 366581) (based on LLVM 8.0.1)
	x86_64-native-bsdapp-gcc
	x86_64-native-bsdapp-clang
	x86_64-native-bsdapp-gcc+shared
	x86_64-native-bsdapp-gcc+debug

OS: SUSE15-64
	Kernel Version: 5.3.18-lp152.57-default
	GCC Version: gcc (SUSE Linux) 7.5.0
	Clang Version: 9.0.1
	x86_64-native-linuxapp-clang
	x86_64-native-linuxapp-gcc



*Build Failed #1:
OS: WIN10-64
Target: x86_64-windows-clang
FAILED: drivers/rte_common_sfc_efx-21.dll 
"clang" @drivers/rte_common_sfc_efx-21.dll.rsp
rte_common_sfc_efx_exports.def : error LNK2001: unresolved external symbol efx_virtio_fini
rte_common_sfc_efx_exports.def : error LNK2001: unresolved external symbol efx_virtio_get_doorbell_offset
rte_common_sfc_efx_exports.def : error LNK2001: unresolved external symbol efx_virtio_get_features
rte_common_sfc_efx_exports.def : error LNK2001: unresolved external symbol efx_virtio_init
rte_common_sfc_efx_exports.def : error LNK2001: unresolved external symbol efx_virtio_qcreate
rte_common_sfc_efx_exports.def : error LNK2001: unresolved external symbol efx_virtio_qdestroy
rte_common_sfc_efx_exports.def : error LNK2001: unresolved external symbol efx_virtio_qstart
rte_common_sfc_efx_exports.def : error LNK2001: unresolved external symbol efx_virtio_qstop
rte_common_sfc_efx_exports.def : error LNK2001: unresolved external symbol efx_virtio_verify_features
drivers\rte_common_sfc_efx.lib : fatal error LNK1120: 9 unresolved externals
clang: error: linker command failed with exit code 1120 (use -v to see invocation)
[285/297] Compiling C object drivers/net/i40e/base/libi40e_base.a.p/i40e_common.c.obj
[286/297] Generating rte_mempool_ring.pmd.c with a custom command (wrapped by meson to set PATH)
[287/297] Generating rte_net_i40e.pmd.c with a custom command (wrapped by meson to set PATH)
ninja: build stopped


DPDK STV team


More information about the test-report mailing list