compilation|FAILURE| pw(170561) sid(39492) job(PER_PATCH_BUILD20395)[2/2] crypto/ipsec_mb: Add SHAKE support.

sys_stv at intel.com sys_stv at intel.com
Mon Oct 5 15:06:12 CEST 2026


Test-Label: Intel-compilation
Test-Status: FAILURE
http://dpdk.org/patch/170561

_Compilation issues_

Submitter: Emma Finn <emma.finn at intel.com>
Date: 2026-10-05 12:30:40
Reply_mail: <20261005123041.429121-2-emma.finn at intel.com>

DPDK git baseline: Repo:dpdk, CommitID: 49bb9a5f7ae51128de7132ffe265192413643bcb


Meson Build Summary: 23 Builds Done, 1 Successful, 22 Failures, 0 Blocked

+-------------------+------------+--------------+------------+------------+-----------+----------+------------+
| os                | gcc-static | clang-static | icc-static | gcc-shared | gcc-debug | document | gcc-16byte |
+-------------------+------------+--------------+------------+------------+-----------+----------+------------+
| OpenAnolis8.10-64 | fail       |              |            |            |           |          |            |
| FreeBSD15-64      | fail       | fail         |            | fail       | fail      |          |            |
| RHEL9.8-64        | fail       | fail         |            | fail       | fail      |          |            |
| SUSE16-64         | fail       | fail         |            |            |           |          |            |
| AzureLinux4.0-64  | fail       |              |            |            |           |          |            |
| UB2604-32         | pass       |              |            |            |           |          |            |
| RHEL10.2-64       | fail       |              |            |            |           |          |            |
| UB2604-64         | fail       | fail         |            |            |           | fail     | fail       |
| RHEL10.2-64RT     | fail       |              |            |            |           |          |            |
| UB2404-64         | fail       |              |            |            |           |          |            |
| Fedora44-64       | fail       | fail         |            |            |           |          |            |
| OpenEuler2404-64  | fail       |              |            |            |           |          |            |
+-------------------+------------+--------------+------------+------------+-----------+----------+------------+

Comments: 
Because of DPDK bug (https://bugs.dpdk.org/show_bug.cgi?id=928),
All the dpdk-next-* branch add `Ddisable_drivers=event/cnxk` option when build with ICC complier. 
 
Test environment and configuration as below:


OS: OpenAnolis8.10-64
	Kernel Version: 5.10.134-18.an8.x86_64
	GCC Version: gcc (GCC) 8.5.0 20210514 (Anolis 8.5.0-24.0.1)
	Clang Version: 18.1.8 (Red Hat 18.1.8-1.0.1.module+an8.9.0+11287+9d0292d3)
	x86_64-native-linuxapp-gcc

OS: FreeBSD15-64
	Kernel Version: 15.1-RELEASE-p3
	GCC Version: gcc (FreeBSD Ports Collection) 14.2.0
	Clang Version: 19.1.7 (https://github.com/llvm/llvm-project.git llvmorg-19.1.7-0-gcd708029e0b2)
	x86_64-native-bsdapp-gcc
	x86_64-native-bsdapp-clang
	x86_64-native-bsdapp-gcc+shared
	x86_64-native-bsdapp-gcc+debug

OS: RHEL9.8-64
	Kernel Version: 5.14.0-687.5.3.el9_8.x86_64
	GCC Version: gcc (GCC) 11.5.0 20240719 (Red Hat 11.5.0-14)
	Clang Version: 21.1.8 (Red Hat, Inc. 21.1.8-2.el9)
	x86_64-native-linuxapp-gcc
	x86_64-native-linuxapp-clang
	x86_64-native-linuxapp-gcc+shared
	x86_64-native-linuxapp-gcc+debug

OS: SUSE16-64
	Kernel Version: 6.12.0-160000.26-default
	GCC Version: gcc (SUSE Linux) 15.2.0
	Clang Version: 19.1.7
	x86_64-native-linuxapp-clang
	x86_64-native-linuxapp-gcc

OS: AzureLinux4.0-64
	Kernel Version: 6.18.31-1.3.azl4.x86_64
	GCC Version: gcc (GCC) 15.2.1 20260123 (Red Hat 15.2.1-7)
	Clang Version: 21.1.8 (Microsoft Corporation 21.1.8-8.azl4)
	x86_64-native-linuxapp-gcc

OS: UB2604-32
	Kernel Version: 7.0.0-31-generic
	GCC Version: gcc (Ubuntu 15.2.0-16ubuntu1) 15.2.0
	Clang Version: 21.1.8 (6ubuntu1)
	i686-native-linuxapp-gcc

OS: RHEL10.2-64
	Kernel Version: 6.12.0-211.7.3.el10_2.x86_64
	GCC Version: gcc (GCC) 14.3.1 20251022 (Red Hat 14.3.1-4)
	Clang Version: 21.1.8 (Red Hat, Inc. 21.1.8-1.el10)
	x86_64-native-linuxapp-gcc

OS: UB2604-64
	Kernel Version: 7.0.0-31-generic
	GCC Version: gcc (Ubuntu 15.2.0-16ubuntu1) 15.2.0
	Clang Version: 21.1.8 (6ubuntu1)
	x86_64-native-linuxapp-gcc+16byte
	x86_64-native-linuxapp-gcc
	x86_64-native-linuxapp-clang
	x86_64-native-linuxapp-doc

OS: RHEL10.2-64RT
	Kernel Version: 6.12.0-211.7.3.el10_2.x86_64+rt
	GCC Version: gcc (GCC) 14.3.1 20251022 (Red Hat 14.3.1-4)
	Clang Version: 21.1.8 (Red Hat, Inc. 21.1.8-1.el10)
	x86_64-native-linuxapp-gcc

OS: UB2404-64
	Kernel Version: 6.8.0-139-generic
	GCC Version: gcc (Ubuntu 13.3.0-6ubuntu2~24.04.1) 13.3.0
	Clang Version: 18.1.3 (1ubuntu1)
	x86_64-native-linuxapp-gcc

OS: Fedora44-64
	Kernel Version: 6.19.10-300.fc44.x86_64
	GCC Version: gcc (GCC) 16.0.1 20260321 (Red Hat 16.0.1-0)
	Clang Version: 22.1.8 (Fedora 22.1.8-4.fc44)
	x86_64-native-linuxapp-gcc
	x86_64-native-linuxapp-clang

OS: OpenEuler2404-64
	Kernel Version: 6.6.0-159.4.13.167.oe2403sp4.x86_64
	GCC Version: gcc (GCC) 12.3.1 (openEuler 12.3.1-110.oe2403sp4)
	Clang Version: 17.0.6 ( 17.0.6-67.oe2403sp4)
	x86_64-native-linuxapp-gcc



*Build Failed #1:
OS: OpenAnolis8.10-64
Target: x86_64-native-linuxapp-gcc
FAILED: drivers/libtmp_rte_crypto_ipsec_mb.a.p/crypto_ipsec_mb_pmd_aesni_mb.c.o 
gcc -Idrivers/libtmp_rte_crypto_ipsec_mb.a.p -Idrivers -I../drivers -Idrivers/crypto/ipsec_mb -I../drivers/crypto/ipsec_mb -Ilib/cryptodev -I../lib/cryptodev -Ilib/eal/common -I../lib/eal/common -I. -I.. -Iconfig -I../config -Ilib/eal/include -I../lib/eal/include -Ilib/eal/linux/include -I../lib/eal/linux/include -Ilib/eal/x86/include -I../lib/eal/x86/include -I../kernel/linux -Ilib/eal -I../lib/eal -Ilib/kvargs -I../lib/kvargs -Ilib/log -I../lib/log -Ilib/metrics -I../lib/metrics -Ilib/telemetry -I../lib/telemetry -Ilib/argparse -I../lib/argparse -Ilib/mbuf -I../lib/mbuf -Ilib/mempool -I../lib/mempool -Ilib/ring -I../lib/ring -Ilib/rcu -I../lib/rcu -Idrivers/bus/vdev -I../drivers/bus/vdev -Ilib/net -I../lib/net -Ilib/security -I../lib/security -fdiagnostics-color=always -D_FILE_OFFSET_BITS=64 -Wall -Winvalid-pch -Wextra -Werror -std=c11 -O3 -include rte_config.h -Wvla -Wcast-qual -Wdeprecated -Wformat -Wformat-nonliteral -Wformat-security -Wmissing-declarations -Wmissing-prototypes -Wnested-externs -Wold-style-definition -Wpointer-arith -Wshadow -Wsign-compare -Wstrict-prototypes -Wundef -Wwrite-strings -Wno-packed-not-aligned -Wno-missing-field-initializers -D_GNU_SOURCE -fPIC -march=native -mrtm -DALLOW_EXPERIMENTAL_API -DALLOW_INTERNAL_API -Wno-format-truncation -Wno-vla -DRTE_COMPONENT_CLASS=pmd_crypto -DRTE_COMPONENT_NAME=ipsec_mb -DRTE_LOG_DEFAULT_LOGTYPE=pmd.crypto.ipsec_mb -MD -MQ drivers/libtmp_rte_crypto_ipsec_mb.a.p/crypto_ipsec_mb_pmd_aesni_mb.c.o -MF drivers/libtmp_rte_crypto_ipsec_mb.a.p/crypto_ipsec_mb_pmd_aesni_mb.c.o.d -o drivers/libtmp_rte_crypto_ipsec_mb.a.p/crypto_ipsec_mb_pmd_aesni_mb.c.o -c ../drivers/crypto/ipsec_mb/pmd_aesni_mb.c
In file included from ../drivers/crypto/ipsec_mb/pmd_aesni_mb.c:7:
../drivers/crypto/ipsec_mb/pmd_aesni_mb_priv.h:1107:4: error: ‘IMB_AUTH_ZUC_EIA3’ undeclared here (not in a function); did you mean ‘IMB_AUTH_HMAC_SM3’?
   [IMB_AUTH_ZUC_EIA3]  = 16,
    ^~~~~~~~~~~~~~~~~
    IMB_AUTH_HMAC_SM3
../drivers/crypto/ipsec_mb/pmd_aesni_mb_priv.h:1107:4: error: array index in initializer not of integer type
../drivers/crypto/ipsec_mb/pmd_aesni_mb_priv.h:1107:4: note: (near initialization for ‘auth_blocksize’)
../drivers/crypto/ipsec_mb/pmd_aesni_mb_priv.h:1108:4: error: ‘IMB_AUTH_SNOW3G_UIA2’ undeclared here (not in a function); did you mean ‘IMB_AUTH_SNOW_V_AEAD’?
   [IMB_AUTH_SNOW3G_UIA2] = 16,
    ^~~~~~~~~~~~~~~~~~~~
    IMB_AUTH_SNOW_V_AEAD
../drivers/crypto/ipsec_mb/pmd_aesni_mb_priv.h:1108:4: error: array index in initializer not of integer type
../drivers/crypto/ipsec_mb/pmd_aesni_mb_priv.h:1108:4: note: (near initialization for ‘auth_blocksize’)
../drivers/crypto/ipsec_mb/pmd_aesni_mb_priv.h:1153:4: error: array index in initializer not of integer type
   [IMB_AUTH_ZUC_EIA3]  = 4,
    ^~~~~~~~~~~~~~~~~
../drivers/crypto/ipsec_mb/pmd_aesni_mb_priv.h:1153:4: note: (near initialization for ‘auth_truncated_digest_byte_lengths’)
../drivers/crypto/ipsec_mb/pmd_aesni_mb_priv.h:1154:4: error: array index in initializer not of integer type
   [IMB_AUTH_SNOW3G_UIA2] = 4,
    ^~~~~~~~~~~~~~~~~~~~
../drivers/crypto/ipsec_mb/pmd_aesni_mb_priv.h:1154:4: note: (near initialization for ‘auth_truncated_digest_byte_lengths’)
In file included from ../drivers/crypto/ipsec_mb/pmd_aesni_mb.c:7:
../drivers/crypto/ipsec_mb/pmd_aesni_mb_priv.h:5: error: unterminated #ifndef
 #ifndef _PMD_AESNI_MB_PRIV_H_
 
../drivers/crypto/ipsec_mb/pmd_aesni_mb.c:298: error: unterminated #if
 #if IMB_VERSION(1, 5, 0) <= IMB_VERSION_NUM
 
[2754/3706] Compiling C object drivers/libtmp_rte_crypto_ipsec_mb.a.p/crypto_ipsec_mb_ipsec_mb_private.c.o
[2755/3706] Compiling C object drivers/libtmp_rte_crypto_nitrox.a.p/crypto_nitrox_nitrox_sym_capabilities.c.o
[2756/3706] Generating drivers/rte_crypto_ionic.sym_chk with a custom command (wrapped by meson to capture output)
[2757/3706] Compiling C object drivers/libtmp_rte_crypto_ipsec_mb.a.p/crypto_ipsec_mb_pmd_aesni_gcm.c.o
[2758/3706] Compiling C object drivers/libtmp_rte_crypto_dpaa_sec.a.p/crypto_dpaa_sec_dpaa_sec.c.o
[2759/3706] Compiling C object drivers/libtmp_rte_crypto_dpaa2_sec.a.p/crypto_dpaa2_sec_dpaa2_sec_dpseci.c.o
[2760/3706] Compiling C object drivers/libtmp_rte_crypto_cnxk.a.p/crypto_cnxk_cn9k_cryptodev_ops.c.o
[2761/3706] Compiling C object drivers/libtmp_rte_crypto_cnxk.a.p/crypto_cnxk_cn20k_cryptodev_ops.c.o
[2762/3706] Compiling C object drivers/libtmp_rte_crypto_cnxk.a.p/crypto_cnxk_cn10k_cryptodev_ops.c.o
ninja: build stopped




*Build Failed #2:
OS: FreeBSD15-64
Target: x86_64-native-bsdapp-gcc
FAILED: [code=1] drivers/libtmp_rte_crypto_ipsec_mb.a.p/crypto_ipsec_mb_pmd_aesni_mb.c.o 
gcc -Idrivers/libtmp_rte_crypto_ipsec_mb.a.p -Idrivers -I../drivers -Idrivers/crypto/ipsec_mb -I../drivers/crypto/ipsec_mb -Ilib/cryptodev -I../lib/cryptodev -Ilib/eal/common -I../lib/eal/common -I. -I.. -Iconfig -I../config -Ilib/eal/include -I../lib/eal/include -Ilib/eal/freebsd/include -I../lib/eal/freebsd/include -Ilib/eal/x86/include -I../lib/eal/x86/include -Ilib/eal -I../lib/eal -Ilib/kvargs -I../lib/kvargs -Ilib/log -I../lib/log -Ilib/metrics -I../lib/metrics -Ilib/telemetry -I../lib/telemetry -Ilib/argparse -I../lib/argparse -Ilib/mbuf -I../lib/mbuf -Ilib/mempool -I../lib/mempool -Ilib/ring -I../lib/ring -Ilib/rcu -I../lib/rcu -Idrivers/bus/vdev -I../drivers/bus/vdev -Ilib/net -I../lib/net -Ilib/security -I../lib/security -fdiagnostics-color=always -D_FILE_OFFSET_BITS=64 -Wall -Winvalid-pch -Wextra -Werror -std=c11 -O3 -include rte_config.h -Wvla -Wcast-qual -Wdeprecated -Wformat -Wformat-nonliteral -Wformat-security -Wmissing-declarations -Wmissing-prototypes -Wnested-externs -Wold-style-definition -Wpointer-arith -Wshadow -Wsign-compare -Wstrict-prototypes -Wundef -Wwrite-strings -Wno-packed-not-aligned -Wno-missing-field-initializers -D_GNU_SOURCE -D__BSD_VISIBLE -fPIC -march=native -mno-avx512f -mrtm -DALLOW_EXPERIMENTAL_API -DALLOW_INTERNAL_API -Wno-format-truncation -Wno-address-of-packed-member -Wno-vla -DRTE_COMPONENT_CLASS=pmd_crypto -DRTE_COMPONENT_NAME=ipsec_mb -DRTE_LOG_DEFAULT_LOGTYPE=pmd.crypto.ipsec_mb -MD -MQ drivers/libtmp_rte_crypto_ipsec_mb.a.p/crypto_ipsec_mb_pmd_aesni_mb.c.o -MF drivers/libtmp_rte_crypto_ipsec_mb.a.p/crypto_ipsec_mb_pmd_aesni_mb.c.o.d -o drivers/libtmp_rte_crypto_ipsec_mb.a.p/crypto_ipsec_mb_pmd_aesni_mb.c.o -c ../drivers/crypto/ipsec_mb/pmd_aesni_mb.c
In file included from ../drivers/crypto/ipsec_mb/pmd_aesni_mb.c:7:
../drivers/crypto/ipsec_mb/pmd_aesni_mb_priv.h:1107:18: error: 'IMB_AUTH_ZUC_EIA3' undeclared here (not in a function)
 1107 |                 [IMB_AUTH_ZUC_EIA3]             = 16,
      |                  ^~~~~~~~~~~~~~~~~
../drivers/crypto/ipsec_mb/pmd_aesni_mb_priv.h:1107:18: error: array index in initializer not of integer type
../drivers/crypto/ipsec_mb/pmd_aesni_mb_priv.h:1107:18: note: (near initialization for 'auth_blocksize')
../drivers/crypto/ipsec_mb/pmd_aesni_mb_priv.h:1108:18: error: 'IMB_AUTH_SNOW3G_UIA2' undeclared here (not in a function); did you mean 'IMB_AUTH_SNOW_V_AEAD'?
 1108 |                 [IMB_AUTH_SNOW3G_UIA2]  = 16,
      |                  ^~~~~~~~~~~~~~~~~~~~
      |                  IMB_AUTH_SNOW_V_AEAD
../drivers/crypto/ipsec_mb/pmd_aesni_mb_priv.h:1108:18: error: array index in initializer not of integer type
../drivers/crypto/ipsec_mb/pmd_aesni_mb_priv.h:1108:18: note: (near initialization for 'auth_blocksize')
../drivers/crypto/ipsec_mb/pmd_aesni_mb_priv.h:1153:18: error: array index in initializer not of integer type
 1153 |                 [IMB_AUTH_ZUC_EIA3]             = 4,
      |                  ^~~~~~~~~~~~~~~~~
../drivers/crypto/ipsec_mb/pmd_aesni_mb_priv.h:1153:18: note: (near initialization for 'auth_truncated_digest_byte_lengths')
../drivers/crypto/ipsec_mb/pmd_aesni_mb_priv.h:1154:18: error: array index in initializer not of integer type
 1154 |                 [IMB_AUTH_SNOW3G_UIA2]  = 4,
      |                  ^~~~~~~~~~~~~~~~~~~~
../drivers/crypto/ipsec_mb/pmd_aesni_mb_priv.h:1154:18: note: (near initialization for 'auth_truncated_digest_byte_lengths')
../drivers/crypto/ipsec_mb/pmd_aesni_mb_priv.h:5: error: unterminated #ifndef
    5 | #ifndef _PMD_AESNI_MB_PRIV_H_
In file included from ../lib/eal/include/rte_lcore.h:17,
                 from ../lib/eal/include/generic/rte_spinlock.h:24,
                 from ../lib/eal/x86/include/rte_spinlock.h:8,
                 from ../lib/mempool/rte_mempool.h:44,
                 from ../lib/mbuf/rte_mbuf.h:39,
                 from ../lib/cryptodev/rte_crypto.h:15,
                 from ../lib/security/rte_security.h:19,
                 from ../drivers/crypto/ipsec_mb/pmd_aesni_mb_priv.h:8:
../lib/eal/include/rte_per_lcore.h:34:9: error: expected expression before '__thread'
   34 |         __thread type per_lcore_##name
      |         ^~~~~~~~
../drivers/crypto/ipsec_mb/pmd_aesni_mb.c:9:1: note: in expansion of macro 'RTE_DEFINE_PER_LCORE'
    9 | RTE_DEFINE_PER_LCORE(pid_t, pid);
      | ^~~~~~~~~~~~~~~~~~~~
../drivers/crypto/ipsec_mb/pmd_aesni_mb.c:298: error: unterminated #if
  298 | #if IMB_VERSION(1, 5, 0) <= IMB_VERSION_NUM
[798/2246] Compiling C object drivers/libtmp_rte_crypto_ionic.a.p/crypto_ionic_ionic_crypto_ops.c.o
[799/2246] Compiling C object drivers/libtmp_rte_crypto_ipsec_mb.a.p/crypto_ipsec_mb_ipsec_mb_ops.c.o
[800/2246] Compiling C object drivers/libtmp_rte_crypto_ionic.a.p/crypto_ionic_ionic_crypto_main.c.o
[801/2246] Compiling C object drivers/libtmp_rte_net_vmxnet3.a.p/net_vmxnet3_vmxnet3_rxtx.c.o
[802/2246] Compiling C object drivers/libtmp_rte_raw_ntb.a.p/raw_ntb_ntb.c.o
[803/2246] Compiling C object drivers/libtmp_rte_net_virtio.a.p/net_virtio_virtio_rxtx.c.o
[804/2246] Compiling C object drivers/libtmp_rte_crypto_ipsec_mb.a.p/crypto_ipsec_mb_ipsec_mb_private.c.o
[805/2246] Compiling C object drivers/libtmp_rte_crypto_ipsec_mb.a.p/crypto_ipsec_mb_pmd_aesni_gcm.c.o
[806/2246] Compiling C object drivers/libtmp_rte_crypto_null.a.p/crypto_null_null_crypto_pmd.c.o
ninja: build stopped




*Build Failed #3:
OS: FreeBSD15-64
Target: x86_64-native-bsdapp-clang
FAILED: [code=1] drivers/libtmp_rte_crypto_ipsec_mb.a.p/crypto_ipsec_mb_pmd_aesni_mb.c.o 
clang -Idrivers/libtmp_rte_crypto_ipsec_mb.a.p -Idrivers -I../drivers -Idrivers/crypto/ipsec_mb -I../drivers/crypto/ipsec_mb -Ilib/cryptodev -I../lib/cryptodev -Ilib/eal/common -I../lib/eal/common -I. -I.. -Iconfig -I../config -Ilib/eal/include -I../lib/eal/include -Ilib/eal/freebsd/include -I../lib/eal/freebsd/include -Ilib/eal/x86/include -I../lib/eal/x86/include -Ilib/eal -I../lib/eal -Ilib/kvargs -I../lib/kvargs -Ilib/log -I../lib/log -Ilib/metrics -I../lib/metrics -Ilib/telemetry -I../lib/telemetry -Ilib/argparse -I../lib/argparse -Ilib/mbuf -I../lib/mbuf -Ilib/mempool -I../lib/mempool -Ilib/ring -I../lib/ring -Ilib/rcu -I../lib/rcu -Idrivers/bus/vdev -I../drivers/bus/vdev -Ilib/net -I../lib/net -Ilib/security -I../lib/security -fdiagnostics-color=always -D_FILE_OFFSET_BITS=64 -Wall -Winvalid-pch -Wextra -Werror -std=c11 -O3 -include rte_config.h -Wvla -Wcast-qual -Wcomma -Wdeprecated -Wformat -Wformat-nonliteral -Wformat-security -Wmissing-declarations -Wmissing-prototypes -Wnested-externs -Wold-style-definition -Wpointer-arith -Wshadow -Wsign-compare -Wstrict-prototypes -Wundef -Wwrite-strings -Wno-missing-field-initializers -D_GNU_SOURCE -D__BSD_VISIBLE -fPIC -march=native -mrtm -DALLOW_EXPERIMENTAL_API -DALLOW_INTERNAL_API -Wno-format-truncation -Wno-address-of-packed-member -Wno-vla -DRTE_COMPONENT_CLASS=pmd_crypto -DRTE_COMPONENT_NAME=ipsec_mb -DRTE_LOG_DEFAULT_LOGTYPE=pmd.crypto.ipsec_mb -DRTE_ANNOTATE_LOCKS -Wthread-safety -MD -MQ drivers/libtmp_rte_crypto_ipsec_mb.a.p/crypto_ipsec_mb_pmd_aesni_mb.c.o -MF drivers/libtmp_rte_crypto_ipsec_mb.a.p/crypto_ipsec_mb_pmd_aesni_mb.c.o.d -o drivers/libtmp_rte_crypto_ipsec_mb.a.p/crypto_ipsec_mb_pmd_aesni_mb.c.o -c ../drivers/crypto/ipsec_mb/pmd_aesni_mb.c
In file included from ../drivers/crypto/ipsec_mb/pmd_aesni_mb.c:7:
../drivers/crypto/ipsec_mb/pmd_aesni_mb_priv.h:1107:4: error: use of undeclared identifier 'IMB_AUTH_ZUC_EIA3'
 1107 |                 [IMB_AUTH_ZUC_EIA3]             = 16,
      |                  ^
../drivers/crypto/ipsec_mb/pmd_aesni_mb_priv.h:1108:4: error: use of undeclared identifier 'IMB_AUTH_SNOW3G_UIA2'; did you mean 'IMB_AUTH_SNOW_V_AEAD'?
 1108 |                 [IMB_AUTH_SNOW3G_UIA2]  = 16,
      |                  ^~~~~~~~~~~~~~~~~~~~
      |                  IMB_AUTH_SNOW_V_AEAD
/usr/include/intel-ipsec-mb.h:325:9: note: 'IMB_AUTH_SNOW_V_AEAD' declared here
  325 |         IMB_AUTH_SNOW_V_AEAD,           /**< SNOW-V-AEAD */
      |         ^
In file included from ../drivers/crypto/ipsec_mb/pmd_aesni_mb.c:7:
../drivers/crypto/ipsec_mb/pmd_aesni_mb_priv.h:1153:4: error: use of undeclared identifier 'IMB_AUTH_ZUC_EIA3'
 1153 |                 [IMB_AUTH_ZUC_EIA3]             = 4,
      |                  ^
../drivers/crypto/ipsec_mb/pmd_aesni_mb_priv.h:1154:4: error: use of undeclared identifier 'IMB_AUTH_SNOW3G_UIA2'; did you mean 'IMB_AUTH_SNOW_V_AEAD'?
 1154 |                 [IMB_AUTH_SNOW3G_UIA2]  = 4,
      |                  ^~~~~~~~~~~~~~~~~~~~
      |                  IMB_AUTH_SNOW_V_AEAD
/usr/include/intel-ipsec-mb.h:325:9: note: 'IMB_AUTH_SNOW_V_AEAD' declared here
  325 |         IMB_AUTH_SNOW_V_AEAD,           /**< SNOW-V-AEAD */
      |         ^
In file included from ../drivers/crypto/ipsec_mb/pmd_aesni_mb.c:7:
../drivers/crypto/ipsec_mb/pmd_aesni_mb_priv.h:5:2: error: unterminated conditional directive
    5 | #ifndef _PMD_AESNI_MB_PRIV_H_
      |  ^
../drivers/crypto/ipsec_mb/pmd_aesni_mb.c:9:1: error: expected expression
    9 | RTE_DEFINE_PER_LCORE(pid_t, pid);
      | ^
../lib/eal/include/rte_per_lcore.h:34:2: note: expanded from macro 'RTE_DEFINE_PER_LCORE'
   34 |         __thread type per_lcore_##name
      |         ^
../drivers/crypto/ipsec_mb/pmd_aesni_mb.c:298:2: error: unterminated conditional directive
  298 | #if IMB_VERSION(1, 5, 0) <= IMB_VERSION_NUM
      |  ^
../drivers/crypto/ipsec_mb/pmd_aesni_mb.c:2627:2: error: expected '}'
 2627 | }
      |  ^
../drivers/crypto/ipsec_mb/pmd_aesni_mb_priv.h:1183:56: note: to match this '{'
 1183 | static const unsigned int auth_digest_byte_lengths[] = {
      |                                                        ^
../drivers/crypto/ipsec_mb/pmd_aesni_mb.c:297:9: error: expected ';' after top level declarator
  297 |                 break;
      |                       ^
      |                       ;
9 errors generated.
[804/2267] Compiling C object drivers/libtmp_rte_crypto_ionic.a.p/crypto_ionic_ionic_crypto_main.c.o
[805/2267] Compiling C object drivers/libtmp_rte_crypto_ipsec_mb.a.p/crypto_ipsec_mb_ipsec_mb_ops.c.o
[806/2267] Compiling C object drivers/libtmp_rte_crypto_ipsec_mb.a.p/crypto_ipsec_mb_ipsec_mb_private.c.o
[807/2267] Compiling C object drivers/libtmp_rte_crypto_null.a.p/crypto_null_null_crypto_pmd_ops.c.o
[808/2267] Compiling C object drivers/libtmp_rte_crypto_null.a.p/crypto_null_null_crypto_pmd.c.o
[809/2267] Compiling C object drivers/libtmp_rte_crypto_ipsec_mb.a.p/crypto_ipsec_mb_pmd_aesni_gcm.c.o
[810/2267] Compiling C object drivers/libtmp_rte_crypto_scheduler.a.p/crypto_scheduler_rte_cryptodev_scheduler.c.o
[811/2267] Compiling C object drivers/libtmp_rte_crypto_scheduler.a.p/crypto_scheduler_scheduler_failover.c.o
[812/2267] Compiling C object drivers/libtmp_rte_crypto_scheduler.a.p/crypto_scheduler_scheduler_multicore.c.o
ninja: build stopped




*Build Failed #4:
OS: FreeBSD15-64
Target: x86_64-native-bsdapp-gcc+shared
FAILED: [code=1] drivers/libtmp_rte_crypto_ipsec_mb.a.p/crypto_ipsec_mb_pmd_aesni_mb.c.o 
gcc -Idrivers/libtmp_rte_crypto_ipsec_mb.a.p -Idrivers -I../drivers -Idrivers/crypto/ipsec_mb -I../drivers/crypto/ipsec_mb -Ilib/cryptodev -I../lib/cryptodev -Ilib/eal/common -I../lib/eal/common -I. -I.. -Iconfig -I../config -Ilib/eal/include -I../lib/eal/include -Ilib/eal/freebsd/include -I../lib/eal/freebsd/include -Ilib/eal/x86/include -I../lib/eal/x86/include -Ilib/eal -I../lib/eal -Ilib/kvargs -I../lib/kvargs -Ilib/log -I../lib/log -Ilib/metrics -I../lib/metrics -Ilib/telemetry -I../lib/telemetry -Ilib/argparse -I../lib/argparse -Ilib/mbuf -I../lib/mbuf -Ilib/mempool -I../lib/mempool -Ilib/ring -I../lib/ring -Ilib/rcu -I../lib/rcu -Idrivers/bus/vdev -I../drivers/bus/vdev -Ilib/net -I../lib/net -Ilib/security -I../lib/security -fdiagnostics-color=always -D_FILE_OFFSET_BITS=64 -Wall -Winvalid-pch -Wextra -Werror -std=c11 -O3 -include rte_config.h -Wvla -Wcast-qual -Wdeprecated -Wformat -Wformat-nonliteral -Wformat-security -Wmissing-declarations -Wmissing-prototypes -Wnested-externs -Wold-style-definition -Wpointer-arith -Wshadow -Wsign-compare -Wstrict-prototypes -Wundef -Wwrite-strings -Wno-packed-not-aligned -Wno-missing-field-initializers -D_GNU_SOURCE -D__BSD_VISIBLE -fPIC -march=native -mno-avx512f -mrtm -DALLOW_EXPERIMENTAL_API -DALLOW_INTERNAL_API -Wno-format-truncation -Wno-address-of-packed-member -Wno-vla -DRTE_COMPONENT_CLASS=pmd_crypto -DRTE_COMPONENT_NAME=ipsec_mb -DRTE_LOG_DEFAULT_LOGTYPE=pmd.crypto.ipsec_mb -MD -MQ drivers/libtmp_rte_crypto_ipsec_mb.a.p/crypto_ipsec_mb_pmd_aesni_mb.c.o -MF drivers/libtmp_rte_crypto_ipsec_mb.a.p/crypto_ipsec_mb_pmd_aesni_mb.c.o.d -o drivers/libtmp_rte_crypto_ipsec_mb.a.p/crypto_ipsec_mb_pmd_aesni_mb.c.o -c ../drivers/crypto/ipsec_mb/pmd_aesni_mb.c
In file included from ../drivers/crypto/ipsec_mb/pmd_aesni_mb.c:7:
../drivers/crypto/ipsec_mb/pmd_aesni_mb_priv.h:1107:18: error: 'IMB_AUTH_ZUC_EIA3' undeclared here (not in a function)
 1107 |                 [IMB_AUTH_ZUC_EIA3]             = 16,
      |                  ^~~~~~~~~~~~~~~~~
../drivers/crypto/ipsec_mb/pmd_aesni_mb_priv.h:1107:18: error: array index in initializer not of integer type
../drivers/crypto/ipsec_mb/pmd_aesni_mb_priv.h:1107:18: note: (near initialization for 'auth_blocksize')
../drivers/crypto/ipsec_mb/pmd_aesni_mb_priv.h:1108:18: error: 'IMB_AUTH_SNOW3G_UIA2' undeclared here (not in a function); did you mean 'IMB_AUTH_SNOW_V_AEAD'?
 1108 |                 [IMB_AUTH_SNOW3G_UIA2]  = 16,
      |                  ^~~~~~~~~~~~~~~~~~~~
      |                  IMB_AUTH_SNOW_V_AEAD
../drivers/crypto/ipsec_mb/pmd_aesni_mb_priv.h:1108:18: error: array index in initializer not of integer type
../drivers/crypto/ipsec_mb/pmd_aesni_mb_priv.h:1108:18: note: (near initialization for 'auth_blocksize')
../drivers/crypto/ipsec_mb/pmd_aesni_mb_priv.h:1153:18: error: array index in initializer not of integer type
 1153 |                 [IMB_AUTH_ZUC_EIA3]             = 4,
      |                  ^~~~~~~~~~~~~~~~~
../drivers/crypto/ipsec_mb/pmd_aesni_mb_priv.h:1153:18: note: (near initialization for 'auth_truncated_digest_byte_lengths')
../drivers/crypto/ipsec_mb/pmd_aesni_mb_priv.h:1154:18: error: array index in initializer not of integer type
 1154 |                 [IMB_AUTH_SNOW3G_UIA2]  = 4,
      |                  ^~~~~~~~~~~~~~~~~~~~
../drivers/crypto/ipsec_mb/pmd_aesni_mb_priv.h:1154:18: note: (near initialization for 'auth_truncated_digest_byte_lengths')
../drivers/crypto/ipsec_mb/pmd_aesni_mb_priv.h:5: error: unterminated #ifndef
    5 | #ifndef _PMD_AESNI_MB_PRIV_H_
In file included from ../lib/eal/include/rte_lcore.h:17,
                 from ../lib/eal/include/generic/rte_spinlock.h:24,
                 from ../lib/eal/x86/include/rte_spinlock.h:8,
                 from ../lib/mempool/rte_mempool.h:44,
                 from ../lib/mbuf/rte_mbuf.h:39,
                 from ../lib/cryptodev/rte_crypto.h:15,
                 from ../lib/security/rte_security.h:19,
                 from ../drivers/crypto/ipsec_mb/pmd_aesni_mb_priv.h:8:
../lib/eal/include/rte_per_lcore.h:34:9: error: expected expression before '__thread'
   34 |         __thread type per_lcore_##name
      |         ^~~~~~~~
../drivers/crypto/ipsec_mb/pmd_aesni_mb.c:9:1: note: in expansion of macro 'RTE_DEFINE_PER_LCORE'
    9 | RTE_DEFINE_PER_LCORE(pid_t, pid);
      | ^~~~~~~~~~~~~~~~~~~~
../drivers/crypto/ipsec_mb/pmd_aesni_mb.c:298: error: unterminated #if
  298 | #if IMB_VERSION(1, 5, 0) <= IMB_VERSION_NUM
[910/2123] Generating drivers/rte_crypto_scheduler.pmd.c with a custom command
[911/2123] Compiling C object drivers/libtmp_rte_crypto_ipsec_mb.a.p/crypto_ipsec_mb_ipsec_mb_private.c.o
[912/2123] Compiling C object drivers/libtmp_rte_crypto_ipsec_mb.a.p/crypto_ipsec_mb_ipsec_mb_ops.c.o
[913/2123] Compiling C object drivers/libtmp_rte_raw_ntb.a.p/raw_ntb_ntb.c.o
[914/2123] Compiling C object drivers/libtmp_rte_crypto_null.a.p/crypto_null_null_crypto_pmd_ops.c.o
[915/2123] Compiling C object drivers/libtmp_rte_crypto_ipsec_mb.a.p/crypto_ipsec_mb_pmd_aesni_gcm.c.o
[916/2123] Compiling C object drivers/libtmp_rte_net_virtio.a.p/net_virtio_virtio_rxtx.c.o
[917/2123] Compiling C object drivers/libtmp_rte_crypto_virtio.a.p/crypto_virtio_virtio_cryptodev.c.o
[918/2123] Compiling C object drivers/libtmp_rte_crypto_null.a.p/crypto_null_null_crypto_pmd.c.o
ninja: build stopped




*Build Failed #5:
OS: FreeBSD15-64
Target: x86_64-native-bsdapp-gcc+debug
FAILED: [code=1] drivers/libtmp_rte_crypto_ipsec_mb.a.p/crypto_ipsec_mb_pmd_aesni_mb.c.o 
gcc -Idrivers/libtmp_rte_crypto_ipsec_mb.a.p -Idrivers -I../drivers -Idrivers/crypto/ipsec_mb -I../drivers/crypto/ipsec_mb -Ilib/cryptodev -I../lib/cryptodev -Ilib/eal/common -I../lib/eal/common -I. -I.. -Iconfig -I../config -Ilib/eal/include -I../lib/eal/include -Ilib/eal/freebsd/include -I../lib/eal/freebsd/include -Ilib/eal/x86/include -I../lib/eal/x86/include -Ilib/eal -I../lib/eal -Ilib/kvargs -I../lib/kvargs -Ilib/log -I../lib/log -Ilib/metrics -I../lib/metrics -Ilib/telemetry -I../lib/telemetry -Ilib/argparse -I../lib/argparse -Ilib/mbuf -I../lib/mbuf -Ilib/mempool -I../lib/mempool -Ilib/ring -I../lib/ring -Ilib/rcu -I../lib/rcu -Idrivers/bus/vdev -I../drivers/bus/vdev -Ilib/net -I../lib/net -Ilib/security -I../lib/security -fdiagnostics-color=always -D_FILE_OFFSET_BITS=64 -Wall -Winvalid-pch -Wextra -Werror -std=c11 -O2 -g -include rte_config.h -Wvla -Wcast-qual -Wdeprecated -Wformat -Wformat-nonliteral -Wformat-security -Wmissing-declarations -Wmissing-prototypes -Wnested-externs -Wold-style-definition -Wpointer-arith -Wshadow -Wsign-compare -Wstrict-prototypes -Wundef -Wwrite-strings -Wno-packed-not-aligned -Wno-missing-field-initializers -D_GNU_SOURCE -D__BSD_VISIBLE -fPIC -march=native -mno-avx512f -mrtm -DALLOW_EXPERIMENTAL_API -DALLOW_INTERNAL_API -Wno-format-truncation -Wno-address-of-packed-member -Wno-vla -DRTE_COMPONENT_CLASS=pmd_crypto -DRTE_COMPONENT_NAME=ipsec_mb -DRTE_LOG_DEFAULT_LOGTYPE=pmd.crypto.ipsec_mb -MD -MQ drivers/libtmp_rte_crypto_ipsec_mb.a.p/crypto_ipsec_mb_pmd_aesni_mb.c.o -MF drivers/libtmp_rte_crypto_ipsec_mb.a.p/crypto_ipsec_mb_pmd_aesni_mb.c.o.d -o drivers/libtmp_rte_crypto_ipsec_mb.a.p/crypto_ipsec_mb_pmd_aesni_mb.c.o -c ../drivers/crypto/ipsec_mb/pmd_aesni_mb.c
In file included from ../drivers/crypto/ipsec_mb/pmd_aesni_mb.c:7:
../drivers/crypto/ipsec_mb/pmd_aesni_mb_priv.h:1107:18: error: 'IMB_AUTH_ZUC_EIA3' undeclared here (not in a function)
 1107 |                 [IMB_AUTH_ZUC_EIA3]             = 16,
      |                  ^~~~~~~~~~~~~~~~~
../drivers/crypto/ipsec_mb/pmd_aesni_mb_priv.h:1107:18: error: array index in initializer not of integer type
../drivers/crypto/ipsec_mb/pmd_aesni_mb_priv.h:1107:18: note: (near initialization for 'auth_blocksize')
../drivers/crypto/ipsec_mb/pmd_aesni_mb_priv.h:1108:18: error: 'IMB_AUTH_SNOW3G_UIA2' undeclared here (not in a function); did you mean 'IMB_AUTH_SNOW_V_AEAD'?
 1108 |                 [IMB_AUTH_SNOW3G_UIA2]  = 16,
      |                  ^~~~~~~~~~~~~~~~~~~~
      |                  IMB_AUTH_SNOW_V_AEAD
../drivers/crypto/ipsec_mb/pmd_aesni_mb_priv.h:1108:18: error: array index in initializer not of integer type
../drivers/crypto/ipsec_mb/pmd_aesni_mb_priv.h:1108:18: note: (near initialization for 'auth_blocksize')
../drivers/crypto/ipsec_mb/pmd_aesni_mb_priv.h:1153:18: error: array index in initializer not of integer type
 1153 |                 [IMB_AUTH_ZUC_EIA3]             = 4,
      |                  ^~~~~~~~~~~~~~~~~
../drivers/crypto/ipsec_mb/pmd_aesni_mb_priv.h:1153:18: note: (near initialization for 'auth_truncated_digest_byte_lengths')
../drivers/crypto/ipsec_mb/pmd_aesni_mb_priv.h:1154:18: error: array index in initializer not of integer type
 1154 |                 [IMB_AUTH_SNOW3G_UIA2]  = 4,
      |                  ^~~~~~~~~~~~~~~~~~~~
../drivers/crypto/ipsec_mb/pmd_aesni_mb_priv.h:1154:18: note: (near initialization for 'auth_truncated_digest_byte_lengths')
../drivers/crypto/ipsec_mb/pmd_aesni_mb_priv.h:5: error: unterminated #ifndef
    5 | #ifndef _PMD_AESNI_MB_PRIV_H_
In file included from ../lib/eal/include/rte_lcore.h:17,
                 from ../lib/eal/include/generic/rte_spinlock.h:24,
                 from ../lib/eal/x86/include/rte_spinlock.h:8,
                 from ../lib/mempool/rte_mempool.h:44,
                 from ../lib/mbuf/rte_mbuf.h:39,
                 from ../lib/cryptodev/rte_crypto.h:15,
                 from ../lib/security/rte_security.h:19,
                 from ../drivers/crypto/ipsec_mb/pmd_aesni_mb_priv.h:8:
../lib/eal/include/rte_per_lcore.h:34:9: error: expected expression before '__thread'
   34 |         __thread type per_lcore_##name
      |         ^~~~~~~~
../drivers/crypto/ipsec_mb/pmd_aesni_mb.c:9:1: note: in expansion of macro 'RTE_DEFINE_PER_LCORE'
    9 | RTE_DEFINE_PER_LCORE(pid_t, pid);
      | ^~~~~~~~~~~~~~~~~~~~
../drivers/crypto/ipsec_mb/pmd_aesni_mb.c:298: error: unterminated #if
  298 | #if IMB_VERSION(1, 5, 0) <= IMB_VERSION_NUM
[804/2246] Compiling C object drivers/libtmp_rte_crypto_null.a.p/crypto_null_null_crypto_pmd_ops.c.o
[805/2246] Compiling C object drivers/libtmp_rte_crypto_ipsec_mb.a.p/crypto_ipsec_mb_ipsec_mb_private.c.o
[806/2246] Compiling C object drivers/libtmp_rte_crypto_scheduler.a.p/crypto_scheduler_scheduler_pmd.c.o
[807/2246] Compiling C object drivers/libtmp_rte_crypto_scheduler.a.p/crypto_scheduler_rte_cryptodev_scheduler.c.o
[808/2246] Compiling C object drivers/libtmp_rte_crypto_scheduler.a.p/crypto_scheduler_scheduler_failover.c.o
[809/2246] Compiling C object drivers/libtmp_rte_crypto_scheduler.a.p/crypto_scheduler_scheduler_pkt_size_distr.c.o
[810/2246] Compiling C object drivers/libtmp_rte_crypto_ipsec_mb.a.p/crypto_ipsec_mb_pmd_aesni_gcm.c.o
[811/2246] Compiling C object drivers/libtmp_rte_crypto_null.a.p/crypto_null_null_crypto_pmd.c.o
[812/2246] Compiling C object drivers/libtmp_rte_crypto_scheduler.a.p/crypto_scheduler_scheduler_multicore.c.o
ninja: build stopped




*Build Failed #6:
OS: RHEL9.8-64
Target: x86_64-native-linuxapp-gcc
FAILED: drivers/libtmp_rte_crypto_ipsec_mb.a.p/crypto_ipsec_mb_pmd_aesni_mb.c.o 
gcc -Idrivers/libtmp_rte_crypto_ipsec_mb.a.p -Idrivers -I../drivers -Idrivers/crypto/ipsec_mb -I../drivers/crypto/ipsec_mb -Ilib/cryptodev -I../lib/cryptodev -Ilib/eal/common -I../lib/eal/common -I. -I.. -Iconfig -I../config -Ilib/eal/include -I../lib/eal/include -Ilib/eal/linux/include -I../lib/eal/linux/include -Ilib/eal/x86/include -I../lib/eal/x86/include -I../kernel/linux -Ilib/eal -I../lib/eal -Ilib/kvargs -I../lib/kvargs -Ilib/log -I../lib/log -Ilib/metrics -I../lib/metrics -Ilib/telemetry -I../lib/telemetry -Ilib/argparse -I../lib/argparse -Ilib/mbuf -I../lib/mbuf -Ilib/mempool -I../lib/mempool -Ilib/ring -I../lib/ring -Ilib/rcu -I../lib/rcu -Idrivers/bus/vdev -I../drivers/bus/vdev -Ilib/net -I../lib/net -Ilib/security -I../lib/security -fdiagnostics-color=always -D_FILE_OFFSET_BITS=64 -Wall -Winvalid-pch -Wextra -Werror -std=c11 -O3 -include rte_config.h -Wvla -Wcast-qual -Wdeprecated -Wformat -Wformat-nonliteral -Wformat-security -Wmissing-declarations -Wmissing-prototypes -Wnested-externs -Wold-style-definition -Wpointer-arith -Wshadow -Wsign-compare -Wstrict-prototypes -Wundef -Wwrite-strings -Wno-packed-not-aligned -Wno-missing-field-initializers -D_GNU_SOURCE -fPIC -march=native -mrtm -DALLOW_EXPERIMENTAL_API -DALLOW_INTERNAL_API -Wno-format-truncation -Wno-address-of-packed-member -Wno-vla -DRTE_COMPONENT_CLASS=pmd_crypto -DRTE_COMPONENT_NAME=ipsec_mb -DRTE_LOG_DEFAULT_LOGTYPE=pmd.crypto.ipsec_mb -MD -MQ drivers/libtmp_rte_crypto_ipsec_mb.a.p/crypto_ipsec_mb_pmd_aesni_mb.c.o -MF drivers/libtmp_rte_crypto_ipsec_mb.a.p/crypto_ipsec_mb_pmd_aesni_mb.c.o.d -o drivers/libtmp_rte_crypto_ipsec_mb.a.p/crypto_ipsec_mb_pmd_aesni_mb.c.o -c ../drivers/crypto/ipsec_mb/pmd_aesni_mb.c
In file included from ../drivers/crypto/ipsec_mb/pmd_aesni_mb.c:7:
../drivers/crypto/ipsec_mb/pmd_aesni_mb_priv.h:1107:18: error: ‘IMB_AUTH_ZUC_EIA3’ undeclared here (not in a function)
 1107 |                 [IMB_AUTH_ZUC_EIA3]             = 16,
      |                  ^~~~~~~~~~~~~~~~~
../drivers/crypto/ipsec_mb/pmd_aesni_mb_priv.h:1107:18: error: array index in initializer not of integer type
../drivers/crypto/ipsec_mb/pmd_aesni_mb_priv.h:1107:18: note: (near initialization for ‘auth_blocksize’)
../drivers/crypto/ipsec_mb/pmd_aesni_mb_priv.h:1108:18: error: ‘IMB_AUTH_SNOW3G_UIA2’ undeclared here (not in a function); did you mean ‘IMB_AUTH_SNOW_V_AEAD’?
 1108 |                 [IMB_AUTH_SNOW3G_UIA2]  = 16,
      |                  ^~~~~~~~~~~~~~~~~~~~
      |                  IMB_AUTH_SNOW_V_AEAD
../drivers/crypto/ipsec_mb/pmd_aesni_mb_priv.h:1108:18: error: array index in initializer not of integer type
../drivers/crypto/ipsec_mb/pmd_aesni_mb_priv.h:1108:18: note: (near initialization for ‘auth_blocksize’)
../drivers/crypto/ipsec_mb/pmd_aesni_mb_priv.h:1153:18: error: array index in initializer not of integer type
 1153 |                 [IMB_AUTH_ZUC_EIA3]             = 4,
      |                  ^~~~~~~~~~~~~~~~~
../drivers/crypto/ipsec_mb/pmd_aesni_mb_priv.h:1153:18: note: (near initialization for ‘auth_truncated_digest_byte_lengths’)
../drivers/crypto/ipsec_mb/pmd_aesni_mb_priv.h:1154:18: error: array index in initializer not of integer type
 1154 |                 [IMB_AUTH_SNOW3G_UIA2]  = 4,
      |                  ^~~~~~~~~~~~~~~~~~~~
../drivers/crypto/ipsec_mb/pmd_aesni_mb_priv.h:1154:18: note: (near initialization for ‘auth_truncated_digest_byte_lengths’)
In file included from ../drivers/crypto/ipsec_mb/pmd_aesni_mb.c:7:
../drivers/crypto/ipsec_mb/pmd_aesni_mb_priv.h:5: error: unterminated #ifndef
    5 | #ifndef _PMD_AESNI_MB_PRIV_H_
      | 
../drivers/crypto/ipsec_mb/pmd_aesni_mb.c:298: error: unterminated #if
  298 | #if IMB_VERSION(1, 5, 0) <= IMB_VERSION_NUM
      | 
[2688/3647] Linking static target drivers/librte_crypto_ionic.a
[2689/3647] Compiling C object drivers/librte_crypto_ionic.so.27.0.p/meson-generated_.._rte_crypto_ionic.pmd.c.o
[2690/3647] Compiling C object drivers/libtmp_rte_crypto_ipsec_mb.a.p/crypto_ipsec_mb_ipsec_mb_private.c.o
[2691/3647] Compiling C object drivers/libtmp_rte_crypto_ipsec_mb.a.p/crypto_ipsec_mb_pmd_aesni_gcm.c.o
[2692/3647] Compiling C object drivers/libtmp_rte_crypto_dpaa_sec.a.p/crypto_dpaa_sec_dpaa_sec.c.o
[2693/3647] Compiling C object drivers/libtmp_rte_crypto_dpaa2_sec.a.p/crypto_dpaa2_sec_dpaa2_sec_dpseci.c.o
[2694/3647] Compiling C object drivers/libtmp_rte_crypto_cnxk.a.p/crypto_cnxk_cn9k_cryptodev_ops.c.o
[2695/3647] Compiling C object drivers/libtmp_rte_crypto_cnxk.a.p/crypto_cnxk_cn20k_cryptodev_ops.c.o
[2696/3647] Compiling C object drivers/libtmp_rte_crypto_cnxk.a.p/crypto_cnxk_cn10k_cryptodev_ops.c.o
ninja: build stopped




*Build Failed #7:
OS: RHEL9.8-64
Target: x86_64-native-linuxapp-clang
FAILED: drivers/libtmp_rte_crypto_ipsec_mb.a.p/crypto_ipsec_mb_pmd_aesni_mb.c.o 
clang -Idrivers/libtmp_rte_crypto_ipsec_mb.a.p -Idrivers -I../drivers -Idrivers/crypto/ipsec_mb -I../drivers/crypto/ipsec_mb -Ilib/cryptodev -I../lib/cryptodev -Ilib/eal/common -I../lib/eal/common -I. -I.. -Iconfig -I../config -Ilib/eal/include -I../lib/eal/include -Ilib/eal/linux/include -I../lib/eal/linux/include -Ilib/eal/x86/include -I../lib/eal/x86/include -I../kernel/linux -Ilib/eal -I../lib/eal -Ilib/kvargs -I../lib/kvargs -Ilib/log -I../lib/log -Ilib/metrics -I../lib/metrics -Ilib/telemetry -I../lib/telemetry -Ilib/argparse -I../lib/argparse -Ilib/mbuf -I../lib/mbuf -Ilib/mempool -I../lib/mempool -Ilib/ring -I../lib/ring -Ilib/rcu -I../lib/rcu -Idrivers/bus/vdev -I../drivers/bus/vdev -Ilib/net -I../lib/net -Ilib/security -I../lib/security -fdiagnostics-color=always -D_FILE_OFFSET_BITS=64 -Wall -Winvalid-pch -Wextra -Werror -std=c11 -O3 -include rte_config.h -Wvla -Wcast-qual -Wcomma -Wdeprecated -Wformat -Wformat-nonliteral -Wformat-security -Wmissing-declarations -Wmissing-prototypes -Wnested-externs -Wold-style-definition -Wpointer-arith -Wshadow -Wsign-compare -Wstrict-prototypes -Wundef -Wwrite-strings -Wno-missing-field-initializers -D_GNU_SOURCE -fPIC -march=native -mrtm -DALLOW_EXPERIMENTAL_API -DALLOW_INTERNAL_API -Wno-format-truncation -Wno-address-of-packed-member -Wno-vla -DRTE_COMPONENT_CLASS=pmd_crypto -DRTE_COMPONENT_NAME=ipsec_mb -DRTE_LOG_DEFAULT_LOGTYPE=pmd.crypto.ipsec_mb -DRTE_ANNOTATE_LOCKS -Wthread-safety -MD -MQ drivers/libtmp_rte_crypto_ipsec_mb.a.p/crypto_ipsec_mb_pmd_aesni_mb.c.o -MF drivers/libtmp_rte_crypto_ipsec_mb.a.p/crypto_ipsec_mb_pmd_aesni_mb.c.o.d -o drivers/libtmp_rte_crypto_ipsec_mb.a.p/crypto_ipsec_mb_pmd_aesni_mb.c.o -c ../drivers/crypto/ipsec_mb/pmd_aesni_mb.c
In file included from ../drivers/crypto/ipsec_mb/pmd_aesni_mb.c:7:
../drivers/crypto/ipsec_mb/pmd_aesni_mb_priv.h:1107:4: error: use of undeclared identifier 'IMB_AUTH_ZUC_EIA3'
 1107 |                 [IMB_AUTH_ZUC_EIA3]             = 16,
      |                  ^~~~~~~~~~~~~~~~~
../drivers/crypto/ipsec_mb/pmd_aesni_mb_priv.h:1153:4: error: use of undeclared identifier 'IMB_AUTH_ZUC_EIA3'
 1153 |                 [IMB_AUTH_ZUC_EIA3]             = 4,
      |                  ^~~~~~~~~~~~~~~~~
../drivers/crypto/ipsec_mb/pmd_aesni_mb_priv.h:5:2: error: unterminated conditional directive
    5 | #ifndef _PMD_AESNI_MB_PRIV_H_
      |  ^
../drivers/crypto/ipsec_mb/pmd_aesni_mb.c:298:2: error: unterminated conditional directive
  298 | #if IMB_VERSION(1, 5, 0) <= IMB_VERSION_NUM
      |  ^
4 errors generated.
[2693/3647] Linking target drivers/librte_crypto_ionic.so.27.0
[2694/3647] Compiling C object drivers/libtmp_rte_crypto_nitrox.a.p/crypto_nitrox_nitrox_sym_capabilities.c.o
[2695/3647] Compiling C object drivers/libtmp_rte_crypto_ipsec_mb.a.p/crypto_ipsec_mb_pmd_aesni_gcm.c.o
[2696/3647] Compiling C object drivers/libtmp_rte_crypto_nitrox.a.p/crypto_nitrox_nitrox_sym.c.o
[2697/3647] Compiling C object drivers/libtmp_rte_crypto_dpaa2_sec.a.p/crypto_dpaa2_sec_dpaa2_sec_dpseci.c.o
[2698/3647] Compiling C object drivers/libtmp_rte_crypto_cnxk.a.p/crypto_cnxk_cn9k_cryptodev_ops.c.o
[2699/3647] Compiling C object drivers/libtmp_rte_crypto_dpaa_sec.a.p/crypto_dpaa_sec_dpaa_sec.c.o
[2700/3647] Compiling C object drivers/libtmp_rte_crypto_cnxk.a.p/crypto_cnxk_cn20k_cryptodev_ops.c.o
[2701/3647] Compiling C object drivers/libtmp_rte_crypto_cnxk.a.p/crypto_cnxk_cn10k_cryptodev_ops.c.o
ninja: build stopped




*Build Failed #8:
OS: RHEL9.8-64
Target: x86_64-native-linuxapp-gcc+shared
FAILED: drivers/libtmp_rte_crypto_ipsec_mb.a.p/crypto_ipsec_mb_pmd_aesni_mb.c.o 
gcc -Idrivers/libtmp_rte_crypto_ipsec_mb.a.p -Idrivers -I../drivers -Idrivers/crypto/ipsec_mb -I../drivers/crypto/ipsec_mb -Ilib/cryptodev -I../lib/cryptodev -Ilib/eal/common -I../lib/eal/common -I. -I.. -Iconfig -I../config -Ilib/eal/include -I../lib/eal/include -Ilib/eal/linux/include -I../lib/eal/linux/include -Ilib/eal/x86/include -I../lib/eal/x86/include -I../kernel/linux -Ilib/eal -I../lib/eal -Ilib/kvargs -I../lib/kvargs -Ilib/log -I../lib/log -Ilib/metrics -I../lib/metrics -Ilib/telemetry -I../lib/telemetry -Ilib/argparse -I../lib/argparse -Ilib/mbuf -I../lib/mbuf -Ilib/mempool -I../lib/mempool -Ilib/ring -I../lib/ring -Ilib/rcu -I../lib/rcu -Idrivers/bus/vdev -I../drivers/bus/vdev -Ilib/net -I../lib/net -Ilib/security -I../lib/security -fdiagnostics-color=always -D_FILE_OFFSET_BITS=64 -Wall -Winvalid-pch -Wextra -Werror -std=c11 -O3 -include rte_config.h -Wvla -Wcast-qual -Wdeprecated -Wformat -Wformat-nonliteral -Wformat-security -Wmissing-declarations -Wmissing-prototypes -Wnested-externs -Wold-style-definition -Wpointer-arith -Wshadow -Wsign-compare -Wstrict-prototypes -Wundef -Wwrite-strings -Wno-packed-not-aligned -Wno-missing-field-initializers -D_GNU_SOURCE -fPIC -march=native -mrtm -DALLOW_EXPERIMENTAL_API -DALLOW_INTERNAL_API -Wno-format-truncation -Wno-address-of-packed-member -Wno-vla -DRTE_COMPONENT_CLASS=pmd_crypto -DRTE_COMPONENT_NAME=ipsec_mb -DRTE_LOG_DEFAULT_LOGTYPE=pmd.crypto.ipsec_mb -MD -MQ drivers/libtmp_rte_crypto_ipsec_mb.a.p/crypto_ipsec_mb_pmd_aesni_mb.c.o -MF drivers/libtmp_rte_crypto_ipsec_mb.a.p/crypto_ipsec_mb_pmd_aesni_mb.c.o.d -o drivers/libtmp_rte_crypto_ipsec_mb.a.p/crypto_ipsec_mb_pmd_aesni_mb.c.o -c ../drivers/crypto/ipsec_mb/pmd_aesni_mb.c
In file included from ../drivers/crypto/ipsec_mb/pmd_aesni_mb.c:7:
../drivers/crypto/ipsec_mb/pmd_aesni_mb_priv.h:1107:18: error: ‘IMB_AUTH_ZUC_EIA3’ undeclared here (not in a function)
 1107 |                 [IMB_AUTH_ZUC_EIA3]             = 16,
      |                  ^~~~~~~~~~~~~~~~~
../drivers/crypto/ipsec_mb/pmd_aesni_mb_priv.h:1107:18: error: array index in initializer not of integer type
../drivers/crypto/ipsec_mb/pmd_aesni_mb_priv.h:1107:18: note: (near initialization for ‘auth_blocksize’)
../drivers/crypto/ipsec_mb/pmd_aesni_mb_priv.h:1108:18: error: ‘IMB_AUTH_SNOW3G_UIA2’ undeclared here (not in a function); did you mean ‘IMB_AUTH_SNOW_V_AEAD’?
 1108 |                 [IMB_AUTH_SNOW3G_UIA2]  = 16,
      |                  ^~~~~~~~~~~~~~~~~~~~
      |                  IMB_AUTH_SNOW_V_AEAD
../drivers/crypto/ipsec_mb/pmd_aesni_mb_priv.h:1108:18: error: array index in initializer not of integer type
../drivers/crypto/ipsec_mb/pmd_aesni_mb_priv.h:1108:18: note: (near initialization for ‘auth_blocksize’)
../drivers/crypto/ipsec_mb/pmd_aesni_mb_priv.h:1153:18: error: array index in initializer not of integer type
 1153 |                 [IMB_AUTH_ZUC_EIA3]             = 4,
      |                  ^~~~~~~~~~~~~~~~~
../drivers/crypto/ipsec_mb/pmd_aesni_mb_priv.h:1153:18: note: (near initialization for ‘auth_truncated_digest_byte_lengths’)
../drivers/crypto/ipsec_mb/pmd_aesni_mb_priv.h:1154:18: error: array index in initializer not of integer type
 1154 |                 [IMB_AUTH_SNOW3G_UIA2]  = 4,
      |                  ^~~~~~~~~~~~~~~~~~~~
../drivers/crypto/ipsec_mb/pmd_aesni_mb_priv.h:1154:18: note: (near initialization for ‘auth_truncated_digest_byte_lengths’)
In file included from ../drivers/crypto/ipsec_mb/pmd_aesni_mb.c:7:
../drivers/crypto/ipsec_mb/pmd_aesni_mb_priv.h:5: error: unterminated #ifndef
    5 | #ifndef _PMD_AESNI_MB_PRIV_H_
      | 
../drivers/crypto/ipsec_mb/pmd_aesni_mb.c:298: error: unterminated #if
  298 | #if IMB_VERSION(1, 5, 0) <= IMB_VERSION_NUM
      | 
[2715/3500] Generating drivers/rte_crypto_ionic.sym_chk with a custom command (wrapped by meson to capture output)
[2716/3500] Compiling C object drivers/libtmp_rte_crypto_ipsec_mb.a.p/crypto_ipsec_mb_ipsec_mb_private.c.o
[2717/3500] Compiling C object drivers/libtmp_rte_crypto_nitrox.a.p/crypto_nitrox_nitrox_sym_capabilities.c.o
[2718/3500] Compiling C object drivers/libtmp_rte_crypto_ipsec_mb.a.p/crypto_ipsec_mb_pmd_aesni_gcm.c.o
[2719/3500] Compiling C object drivers/libtmp_rte_crypto_dpaa_sec.a.p/crypto_dpaa_sec_dpaa_sec.c.o
[2720/3500] Compiling C object drivers/libtmp_rte_crypto_dpaa2_sec.a.p/crypto_dpaa2_sec_dpaa2_sec_dpseci.c.o
[2721/3500] Compiling C object drivers/libtmp_rte_crypto_cnxk.a.p/crypto_cnxk_cn9k_cryptodev_ops.c.o
[2722/3500] Compiling C object drivers/libtmp_rte_crypto_cnxk.a.p/crypto_cnxk_cn20k_cryptodev_ops.c.o
[2723/3500] Compiling C object drivers/libtmp_rte_crypto_cnxk.a.p/crypto_cnxk_cn10k_cryptodev_ops.c.o
ninja: build stopped




*Build Failed #9:
OS: RHEL9.8-64
Target: x86_64-native-linuxapp-gcc+debug
FAILED: drivers/libtmp_rte_crypto_ipsec_mb.a.p/crypto_ipsec_mb_pmd_aesni_mb.c.o 
gcc -Idrivers/libtmp_rte_crypto_ipsec_mb.a.p -Idrivers -I../drivers -Idrivers/crypto/ipsec_mb -I../drivers/crypto/ipsec_mb -Ilib/cryptodev -I../lib/cryptodev -Ilib/eal/common -I../lib/eal/common -I. -I.. -Iconfig -I../config -Ilib/eal/include -I../lib/eal/include -Ilib/eal/linux/include -I../lib/eal/linux/include -Ilib/eal/x86/include -I../lib/eal/x86/include -I../kernel/linux -Ilib/eal -I../lib/eal -Ilib/kvargs -I../lib/kvargs -Ilib/log -I../lib/log -Ilib/metrics -I../lib/metrics -Ilib/telemetry -I../lib/telemetry -Ilib/argparse -I../lib/argparse -Ilib/mbuf -I../lib/mbuf -Ilib/mempool -I../lib/mempool -Ilib/ring -I../lib/ring -Ilib/rcu -I../lib/rcu -Idrivers/bus/vdev -I../drivers/bus/vdev -Ilib/net -I../lib/net -Ilib/security -I../lib/security -fdiagnostics-color=always -D_FILE_OFFSET_BITS=64 -Wall -Winvalid-pch -Wextra -Werror -std=c11 -O2 -g -include rte_config.h -Wvla -Wcast-qual -Wdeprecated -Wformat -Wformat-nonliteral -Wformat-security -Wmissing-declarations -Wmissing-prototypes -Wnested-externs -Wold-style-definition -Wpointer-arith -Wshadow -Wsign-compare -Wstrict-prototypes -Wundef -Wwrite-strings -Wno-packed-not-aligned -Wno-missing-field-initializers -D_GNU_SOURCE -fPIC -march=native -mrtm -DALLOW_EXPERIMENTAL_API -DALLOW_INTERNAL_API -Wno-format-truncation -Wno-address-of-packed-member -Wno-vla -DRTE_COMPONENT_CLASS=pmd_crypto -DRTE_COMPONENT_NAME=ipsec_mb -DRTE_LOG_DEFAULT_LOGTYPE=pmd.crypto.ipsec_mb -MD -MQ drivers/libtmp_rte_crypto_ipsec_mb.a.p/crypto_ipsec_mb_pmd_aesni_mb.c.o -MF drivers/libtmp_rte_crypto_ipsec_mb.a.p/crypto_ipsec_mb_pmd_aesni_mb.c.o.d -o drivers/libtmp_rte_crypto_ipsec_mb.a.p/crypto_ipsec_mb_pmd_aesni_mb.c.o -c ../drivers/crypto/ipsec_mb/pmd_aesni_mb.c
In file included from ../drivers/crypto/ipsec_mb/pmd_aesni_mb.c:7:
../drivers/crypto/ipsec_mb/pmd_aesni_mb_priv.h:1107:18: error: ‘IMB_AUTH_ZUC_EIA3’ undeclared here (not in a function)
 1107 |                 [IMB_AUTH_ZUC_EIA3]             = 16,
      |                  ^~~~~~~~~~~~~~~~~
../drivers/crypto/ipsec_mb/pmd_aesni_mb_priv.h:1107:18: error: array index in initializer not of integer type
../drivers/crypto/ipsec_mb/pmd_aesni_mb_priv.h:1107:18: note: (near initialization for ‘auth_blocksize’)
../drivers/crypto/ipsec_mb/pmd_aesni_mb_priv.h:1108:18: error: ‘IMB_AUTH_SNOW3G_UIA2’ undeclared here (not in a function); did you mean ‘IMB_AUTH_SNOW_V_AEAD’?
 1108 |                 [IMB_AUTH_SNOW3G_UIA2]  = 16,
      |                  ^~~~~~~~~~~~~~~~~~~~
      |                  IMB_AUTH_SNOW_V_AEAD
../drivers/crypto/ipsec_mb/pmd_aesni_mb_priv.h:1108:18: error: array index in initializer not of integer type
../drivers/crypto/ipsec_mb/pmd_aesni_mb_priv.h:1108:18: note: (near initialization for ‘auth_blocksize’)
../drivers/crypto/ipsec_mb/pmd_aesni_mb_priv.h:1153:18: error: array index in initializer not of integer type
 1153 |                 [IMB_AUTH_ZUC_EIA3]             = 4,
      |                  ^~~~~~~~~~~~~~~~~
../drivers/crypto/ipsec_mb/pmd_aesni_mb_priv.h:1153:18: note: (near initialization for ‘auth_truncated_digest_byte_lengths’)
../drivers/crypto/ipsec_mb/pmd_aesni_mb_priv.h:1154:18: error: array index in initializer not of integer type
 1154 |                 [IMB_AUTH_SNOW3G_UIA2]  = 4,
      |                  ^~~~~~~~~~~~~~~~~~~~
../drivers/crypto/ipsec_mb/pmd_aesni_mb_priv.h:1154:18: note: (near initialization for ‘auth_truncated_digest_byte_lengths’)
In file included from ../drivers/crypto/ipsec_mb/pmd_aesni_mb.c:7:
../drivers/crypto/ipsec_mb/pmd_aesni_mb_priv.h:5: error: unterminated #ifndef
    5 | #ifndef _PMD_AESNI_MB_PRIV_H_
      | 
../drivers/crypto/ipsec_mb/pmd_aesni_mb.c:298: error: unterminated #if
  298 | #if IMB_VERSION(1, 5, 0) <= IMB_VERSION_NUM
      | 
[2694/3647] Compiling C object drivers/libtmp_rte_crypto_ipsec_mb.a.p/crypto_ipsec_mb_ipsec_mb_private.c.o
[2695/3647] Compiling C object drivers/libtmp_rte_crypto_nitrox.a.p/crypto_nitrox_nitrox_sym_capabilities.c.o
[2696/3647] Compiling C object drivers/libtmp_rte_crypto_nitrox.a.p/crypto_nitrox_nitrox_sym.c.o
[2697/3647] Compiling C object drivers/libtmp_rte_crypto_ipsec_mb.a.p/crypto_ipsec_mb_pmd_aesni_gcm.c.o
[2698/3647] Compiling C object drivers/libtmp_rte_crypto_dpaa_sec.a.p/crypto_dpaa_sec_dpaa_sec.c.o
[2699/3647] Compiling C object drivers/libtmp_rte_crypto_dpaa2_sec.a.p/crypto_dpaa2_sec_dpaa2_sec_dpseci.c.o
[2700/3647] Compiling C object drivers/libtmp_rte_crypto_cnxk.a.p/crypto_cnxk_cn9k_cryptodev_ops.c.o
[2701/3647] Compiling C object drivers/libtmp_rte_crypto_cnxk.a.p/crypto_cnxk_cn20k_cryptodev_ops.c.o
[2702/3647] Compiling C object drivers/libtmp_rte_crypto_cnxk.a.p/crypto_cnxk_cn10k_cryptodev_ops.c.o
ninja: build stopped




*Build Failed #10:
OS: SUSE16-64
Target: x86_64-native-linuxapp-clang
FAILED: drivers/libtmp_rte_crypto_ipsec_mb.a.p/crypto_ipsec_mb_pmd_aesni_mb.c.o 
clang -Idrivers/libtmp_rte_crypto_ipsec_mb.a.p -Idrivers -I../drivers -Idrivers/crypto/ipsec_mb -I../drivers/crypto/ipsec_mb -Ilib/cryptodev -I../lib/cryptodev -Ilib/eal/common -I../lib/eal/common -I. -I.. -Iconfig -I../config -Ilib/eal/include -I../lib/eal/include -Ilib/eal/linux/include -I../lib/eal/linux/include -Ilib/eal/x86/include -I../lib/eal/x86/include -I../kernel/linux -Ilib/eal -I../lib/eal -Ilib/kvargs -I../lib/kvargs -Ilib/log -I../lib/log -Ilib/metrics -I../lib/metrics -Ilib/telemetry -I../lib/telemetry -Ilib/argparse -I../lib/argparse -Ilib/mbuf -I../lib/mbuf -Ilib/mempool -I../lib/mempool -Ilib/ring -I../lib/ring -Ilib/rcu -I../lib/rcu -Idrivers/bus/vdev -I../drivers/bus/vdev -Ilib/net -I../lib/net -Ilib/security -I../lib/security -fdiagnostics-color=always -D_FILE_OFFSET_BITS=64 -Wall -Winvalid-pch -Wextra -Werror -std=c11 -O3 -include rte_config.h -Wvla -Wcast-qual -Wcomma -Wdeprecated -Wformat -Wformat-nonliteral -Wformat-security -Wmissing-declarations -Wmissing-prototypes -Wnested-externs -Wold-style-definition -Wpointer-arith -Wshadow -Wsign-compare -Wstrict-prototypes -Wundef -Wwrite-strings -Wno-missing-field-initializers -D_GNU_SOURCE -fPIC -march=native -mrtm -DALLOW_EXPERIMENTAL_API -DALLOW_INTERNAL_API -Wno-format-truncation -Wno-address-of-packed-member -Wno-vla -DRTE_COMPONENT_CLASS=pmd_crypto -DRTE_COMPONENT_NAME=ipsec_mb -DRTE_LOG_DEFAULT_LOGTYPE=pmd.crypto.ipsec_mb -DRTE_ANNOTATE_LOCKS -Wthread-safety -MD -MQ drivers/libtmp_rte_crypto_ipsec_mb.a.p/crypto_ipsec_mb_pmd_aesni_mb.c.o -MF drivers/libtmp_rte_crypto_ipsec_mb.a.p/crypto_ipsec_mb_pmd_aesni_mb.c.o.d -o drivers/libtmp_rte_crypto_ipsec_mb.a.p/crypto_ipsec_mb_pmd_aesni_mb.c.o -c ../drivers/crypto/ipsec_mb/pmd_aesni_mb.c
In file included from ../drivers/crypto/ipsec_mb/pmd_aesni_mb.c:7:
../drivers/crypto/ipsec_mb/pmd_aesni_mb_priv.h:1107:4: error: use of undeclared identifier 'IMB_AUTH_ZUC_EIA3'
 1107 |                 [IMB_AUTH_ZUC_EIA3]             = 16,
      |                  ^
../drivers/crypto/ipsec_mb/pmd_aesni_mb_priv.h:1108:4: error: use of undeclared identifier 'IMB_AUTH_SNOW3G_UIA2'; did you mean 'IMB_AUTH_SNOW_V_AEAD'?
 1108 |                 [IMB_AUTH_SNOW3G_UIA2]  = 16,
      |                  ^~~~~~~~~~~~~~~~~~~~
      |                  IMB_AUTH_SNOW_V_AEAD
/usr/include/intel-ipsec-mb.h:325:9: note: 'IMB_AUTH_SNOW_V_AEAD' declared here
  325 |         IMB_AUTH_SNOW_V_AEAD,           /**< SNOW-V-AEAD */
      |         ^
In file included from ../drivers/crypto/ipsec_mb/pmd_aesni_mb.c:7:
../drivers/crypto/ipsec_mb/pmd_aesni_mb_priv.h:1153:4: error: use of undeclared identifier 'IMB_AUTH_ZUC_EIA3'
 1153 |                 [IMB_AUTH_ZUC_EIA3]             = 4,
      |                  ^
../drivers/crypto/ipsec_mb/pmd_aesni_mb_priv.h:1154:4: error: use of undeclared identifier 'IMB_AUTH_SNOW3G_UIA2'; did you mean 'IMB_AUTH_SNOW_V_AEAD'?
 1154 |                 [IMB_AUTH_SNOW3G_UIA2]  = 4,
      |                  ^~~~~~~~~~~~~~~~~~~~
      |                  IMB_AUTH_SNOW_V_AEAD
/usr/include/intel-ipsec-mb.h:325:9: note: 'IMB_AUTH_SNOW_V_AEAD' declared here
  325 |         IMB_AUTH_SNOW_V_AEAD,           /**< SNOW-V-AEAD */
      |         ^
In file included from ../drivers/crypto/ipsec_mb/pmd_aesni_mb.c:7:
../drivers/crypto/ipsec_mb/pmd_aesni_mb_priv.h:5:2: error: unterminated conditional directive
    5 | #ifndef _PMD_AESNI_MB_PRIV_H_
      |  ^
../drivers/crypto/ipsec_mb/pmd_aesni_mb.c:9:1: error: expected expression
    9 | RTE_DEFINE_PER_LCORE(pid_t, pid);
      | ^
../lib/eal/include/rte_per_lcore.h:34:2: note: expanded from macro 'RTE_DEFINE_PER_LCORE'
   34 |         __thread type per_lcore_##name
      |         ^
../drivers/crypto/ipsec_mb/pmd_aesni_mb.c:298:2: error: unterminated conditional directive
  298 | #if IMB_VERSION(1, 5, 0) <= IMB_VERSION_NUM
      |  ^
../drivers/crypto/ipsec_mb/pmd_aesni_mb.c:2627:2: error: expected '}'
 2627 | }
      |  ^
../drivers/crypto/ipsec_mb/pmd_aesni_mb_priv.h:1183:56: note: to match this '{'
 1183 | static const unsigned int auth_digest_byte_lengths[] = {
      |                                                        ^
../drivers/crypto/ipsec_mb/pmd_aesni_mb.c:297:9: error: expected ';' after top level declarator
  297 |                 break;
      |                       ^
      |                       ;
9 errors generated.
[2675/3629] Compiling C object drivers/libtmp_rte_crypto_ipsec_mb.a.p/crypto_ipsec_mb_ipsec_mb_private.c.o
[2676/3629] Generating drivers/rte_crypto_ionic.pmd.c with a custom command
[2677/3629] Compiling C object drivers/libtmp_rte_crypto_nitrox.a.p/crypto_nitrox_nitrox_sym_capabilities.c.o
[2678/3629] Compiling C object drivers/libtmp_rte_crypto_ipsec_mb.a.p/crypto_ipsec_mb_pmd_aesni_gcm.c.o
[2679/3629] Compiling C object drivers/libtmp_rte_crypto_cnxk.a.p/crypto_cnxk_cn9k_cryptodev_ops.c.o
[2680/3629] Compiling C object drivers/libtmp_rte_crypto_dpaa2_sec.a.p/crypto_dpaa2_sec_dpaa2_sec_dpseci.c.o
[2681/3629] Compiling C object drivers/libtmp_rte_crypto_cnxk.a.p/crypto_cnxk_cn20k_cryptodev_ops.c.o
[2682/3629] Compiling C object drivers/libtmp_rte_crypto_dpaa_sec.a.p/crypto_dpaa_sec_dpaa_sec.c.o
[2683/3629] Compiling C object drivers/libtmp_rte_crypto_cnxk.a.p/crypto_cnxk_cn10k_cryptodev_ops.c.o
ninja: build stopped




*Build Failed #11:
OS: SUSE16-64
Target: x86_64-native-linuxapp-gcc
FAILED: drivers/libtmp_rte_crypto_ipsec_mb.a.p/crypto_ipsec_mb_pmd_aesni_mb.c.o 
gcc -Idrivers/libtmp_rte_crypto_ipsec_mb.a.p -Idrivers -I../drivers -Idrivers/crypto/ipsec_mb -I../drivers/crypto/ipsec_mb -Ilib/cryptodev -I../lib/cryptodev -Ilib/eal/common -I../lib/eal/common -I. -I.. -Iconfig -I../config -Ilib/eal/include -I../lib/eal/include -Ilib/eal/linux/include -I../lib/eal/linux/include -Ilib/eal/x86/include -I../lib/eal/x86/include -I../kernel/linux -Ilib/eal -I../lib/eal -Ilib/kvargs -I../lib/kvargs -Ilib/log -I../lib/log -Ilib/metrics -I../lib/metrics -Ilib/telemetry -I../lib/telemetry -Ilib/argparse -I../lib/argparse -Ilib/mbuf -I../lib/mbuf -Ilib/mempool -I../lib/mempool -Ilib/ring -I../lib/ring -Ilib/rcu -I../lib/rcu -Idrivers/bus/vdev -I../drivers/bus/vdev -Ilib/net -I../lib/net -Ilib/security -I../lib/security -fdiagnostics-color=always -D_FILE_OFFSET_BITS=64 -Wall -Winvalid-pch -Wextra -Werror -std=c11 -O3 -include rte_config.h -Wvla -Wcast-qual -Wdeprecated -Wformat -Wformat-nonliteral -Wformat-security -Wmissing-declarations -Wmissing-prototypes -Wnested-externs -Wold-style-definition -Wpointer-arith -Wshadow -Wsign-compare -Wstrict-prototypes -Wundef -Wwrite-strings -Wno-packed-not-aligned -Wno-missing-field-initializers -fzero-init-padding-bits=all -D_GNU_SOURCE -fPIC -march=native -mrtm -DALLOW_EXPERIMENTAL_API -DALLOW_INTERNAL_API -Wno-format-truncation -Wno-address-of-packed-member -Wno-vla -DRTE_COMPONENT_CLASS=pmd_crypto -DRTE_COMPONENT_NAME=ipsec_mb -DRTE_LOG_DEFAULT_LOGTYPE=pmd.crypto.ipsec_mb -MD -MQ drivers/libtmp_rte_crypto_ipsec_mb.a.p/crypto_ipsec_mb_pmd_aesni_mb.c.o -MF drivers/libtmp_rte_crypto_ipsec_mb.a.p/crypto_ipsec_mb_pmd_aesni_mb.c.o.d -o drivers/libtmp_rte_crypto_ipsec_mb.a.p/crypto_ipsec_mb_pmd_aesni_mb.c.o -c ../drivers/crypto/ipsec_mb/pmd_aesni_mb.c
In file included from ../drivers/crypto/ipsec_mb/pmd_aesni_mb.c:7:
../drivers/crypto/ipsec_mb/pmd_aesni_mb_priv.h:1107:18: error: ‘IMB_AUTH_ZUC_EIA3’ undeclared here (not in a function)
 1107 |                 [IMB_AUTH_ZUC_EIA3]             = 16,
      |                  ^~~~~~~~~~~~~~~~~
../drivers/crypto/ipsec_mb/pmd_aesni_mb_priv.h:1107:18: error: array index in initializer not of integer type
../drivers/crypto/ipsec_mb/pmd_aesni_mb_priv.h:1107:18: note: (near initialization for ‘auth_blocksize’)
../drivers/crypto/ipsec_mb/pmd_aesni_mb_priv.h:1108:18: error: ‘IMB_AUTH_SNOW3G_UIA2’ undeclared here (not in a function); did you mean ‘IMB_AUTH_SNOW_V_AEAD’?
 1108 |                 [IMB_AUTH_SNOW3G_UIA2]  = 16,
      |                  ^~~~~~~~~~~~~~~~~~~~
      |                  IMB_AUTH_SNOW_V_AEAD
../drivers/crypto/ipsec_mb/pmd_aesni_mb_priv.h:1108:18: error: array index in initializer not of integer type
../drivers/crypto/ipsec_mb/pmd_aesni_mb_priv.h:1108:18: note: (near initialization for ‘auth_blocksize’)
../drivers/crypto/ipsec_mb/pmd_aesni_mb_priv.h:1153:18: error: array index in initializer not of integer type
 1153 |                 [IMB_AUTH_ZUC_EIA3]             = 4,
      |                  ^~~~~~~~~~~~~~~~~
../drivers/crypto/ipsec_mb/pmd_aesni_mb_priv.h:1153:18: note: (near initialization for ‘auth_truncated_digest_byte_lengths’)
../drivers/crypto/ipsec_mb/pmd_aesni_mb_priv.h:1154:18: error: array index in initializer not of integer type
 1154 |                 [IMB_AUTH_SNOW3G_UIA2]  = 4,
      |                  ^~~~~~~~~~~~~~~~~~~~
../drivers/crypto/ipsec_mb/pmd_aesni_mb_priv.h:1154:18: note: (near initialization for ‘auth_truncated_digest_byte_lengths’)
../drivers/crypto/ipsec_mb/pmd_aesni_mb_priv.h:5: error: unterminated #ifndef
    5 | #ifndef _PMD_AESNI_MB_PRIV_H_
In file included from ../lib/eal/include/rte_lcore.h:17,
                 from ../lib/eal/include/generic/rte_spinlock.h:24,
                 from ../lib/eal/x86/include/rte_spinlock.h:8,
                 from ../lib/mempool/rte_mempool.h:44,
                 from ../lib/mbuf/rte_mbuf.h:39,
                 from ../lib/cryptodev/rte_crypto.h:15,
                 from ../lib/security/rte_security.h:19,
                 from ../drivers/crypto/ipsec_mb/pmd_aesni_mb_priv.h:8:
../lib/eal/include/rte_per_lcore.h:34:9: error: expected expression before ‘__thread’
   34 |         __thread type per_lcore_##name
      |         ^~~~~~~~
../drivers/crypto/ipsec_mb/pmd_aesni_mb.c:9:1: note: in expansion of macro ‘RTE_DEFINE_PER_LCORE’
    9 | RTE_DEFINE_PER_LCORE(pid_t, pid);
      | ^~~~~~~~~~~~~~~~~~~~
../drivers/crypto/ipsec_mb/pmd_aesni_mb.c:298: error: unterminated #if
  298 | #if IMB_VERSION(1, 5, 0) <= IMB_VERSION_NUM
[2681/3629] Compiling C object drivers/libtmp_rte_crypto_nitrox.a.p/crypto_nitrox_nitrox_sym_capabilities.c.o
[2682/3629] Compiling C object drivers/libtmp_rte_crypto_ipsec_mb.a.p/crypto_ipsec_mb_ipsec_mb_private.c.o
[2683/3629] Compiling C object drivers/libtmp_rte_crypto_nitrox.a.p/crypto_nitrox_nitrox_sym.c.o
[2684/3629] Compiling C object drivers/libtmp_rte_crypto_ipsec_mb.a.p/crypto_ipsec_mb_pmd_aesni_gcm.c.o
[2685/3629] Compiling C object drivers/libtmp_rte_crypto_dpaa_sec.a.p/crypto_dpaa_sec_dpaa_sec.c.o
[2686/3629] Compiling C object drivers/libtmp_rte_crypto_dpaa2_sec.a.p/crypto_dpaa2_sec_dpaa2_sec_dpseci.c.o
[2687/3629] Compiling C object drivers/libtmp_rte_crypto_cnxk.a.p/crypto_cnxk_cn9k_cryptodev_ops.c.o
[2688/3629] Compiling C object drivers/libtmp_rte_crypto_cnxk.a.p/crypto_cnxk_cn20k_cryptodev_ops.c.o
[2689/3629] Compiling C object drivers/libtmp_rte_crypto_cnxk.a.p/crypto_cnxk_cn10k_cryptodev_ops.c.o
ninja: build stopped




*Build Failed #12:
OS: AzureLinux4.0-64
Target: x86_64-native-linuxapp-gcc
FAILED: drivers/libtmp_rte_crypto_ipsec_mb.a.p/crypto_ipsec_mb_pmd_aesni_mb.c.o 
gcc -Idrivers/libtmp_rte_crypto_ipsec_mb.a.p -Idrivers -I../drivers -Idrivers/crypto/ipsec_mb -I../drivers/crypto/ipsec_mb -Ilib/cryptodev -I../lib/cryptodev -Ilib/eal/common -I../lib/eal/common -I. -I.. -Iconfig -I../config -Ilib/eal/include -I../lib/eal/include -Ilib/eal/linux/include -I../lib/eal/linux/include -Ilib/eal/x86/include -I../lib/eal/x86/include -I../kernel/linux -Ilib/eal -I../lib/eal -Ilib/kvargs -I../lib/kvargs -Ilib/log -I../lib/log -Ilib/metrics -I../lib/metrics -Ilib/telemetry -I../lib/telemetry -Ilib/argparse -I../lib/argparse -Ilib/mbuf -I../lib/mbuf -Ilib/mempool -I../lib/mempool -Ilib/ring -I../lib/ring -Ilib/rcu -I../lib/rcu -Idrivers/bus/vdev -I../drivers/bus/vdev -Ilib/net -I../lib/net -Ilib/security -I../lib/security -fdiagnostics-color=always -D_FILE_OFFSET_BITS=64 -Wall -Winvalid-pch -Wextra -Werror -std=c11 -O3 -include rte_config.h -Wvla -Wcast-qual -Wdeprecated -Wformat -Wformat-nonliteral -Wformat-security -Wmissing-declarations -Wmissing-prototypes -Wnested-externs -Wold-style-definition -Wpointer-arith -Wshadow -Wsign-compare -Wstrict-prototypes -Wundef -Wwrite-strings -Wno-packed-not-aligned -Wno-missing-field-initializers -fzero-init-padding-bits=all -D_GNU_SOURCE -fPIC -march=native -mrtm -DALLOW_EXPERIMENTAL_API -DALLOW_INTERNAL_API -Wno-format-truncation -Wno-address-of-packed-member -Wno-vla -DRTE_COMPONENT_CLASS=pmd_crypto -DRTE_COMPONENT_NAME=ipsec_mb -DRTE_LOG_DEFAULT_LOGTYPE=pmd.crypto.ipsec_mb -MD -MQ drivers/libtmp_rte_crypto_ipsec_mb.a.p/crypto_ipsec_mb_pmd_aesni_mb.c.o -MF drivers/libtmp_rte_crypto_ipsec_mb.a.p/crypto_ipsec_mb_pmd_aesni_mb.c.o.d -o drivers/libtmp_rte_crypto_ipsec_mb.a.p/crypto_ipsec_mb_pmd_aesni_mb.c.o -c ../drivers/crypto/ipsec_mb/pmd_aesni_mb.c
In file included from ../drivers/crypto/ipsec_mb/pmd_aesni_mb.c:7:
../drivers/crypto/ipsec_mb/pmd_aesni_mb_priv.h:1107:18: error: ‘IMB_AUTH_ZUC_EIA3’ undeclared here (not in a function)
 1107 |                 [IMB_AUTH_ZUC_EIA3]             = 16,
      |                  ^~~~~~~~~~~~~~~~~
../drivers/crypto/ipsec_mb/pmd_aesni_mb_priv.h:1107:18: error: array index in initializer not of integer type
../drivers/crypto/ipsec_mb/pmd_aesni_mb_priv.h:1107:18: note: (near initialization for ‘auth_blocksize’)
../drivers/crypto/ipsec_mb/pmd_aesni_mb_priv.h:1108:18: error: ‘IMB_AUTH_SNOW3G_UIA2’ undeclared here (not in a function); did you mean ‘IMB_AUTH_SNOW_V_AEAD’?
 1108 |                 [IMB_AUTH_SNOW3G_UIA2]  = 16,
      |                  ^~~~~~~~~~~~~~~~~~~~
      |                  IMB_AUTH_SNOW_V_AEAD
../drivers/crypto/ipsec_mb/pmd_aesni_mb_priv.h:1108:18: error: array index in initializer not of integer type
../drivers/crypto/ipsec_mb/pmd_aesni_mb_priv.h:1108:18: note: (near initialization for ‘auth_blocksize’)
../drivers/crypto/ipsec_mb/pmd_aesni_mb_priv.h:1153:18: error: array index in initializer not of integer type
 1153 |                 [IMB_AUTH_ZUC_EIA3]             = 4,
      |                  ^~~~~~~~~~~~~~~~~
../drivers/crypto/ipsec_mb/pmd_aesni_mb_priv.h:1153:18: note: (near initialization for ‘auth_truncated_digest_byte_lengths’)
../drivers/crypto/ipsec_mb/pmd_aesni_mb_priv.h:1154:18: error: array index in initializer not of integer type
 1154 |                 [IMB_AUTH_SNOW3G_UIA2]  = 4,
      |                  ^~~~~~~~~~~~~~~~~~~~
../drivers/crypto/ipsec_mb/pmd_aesni_mb_priv.h:1154:18: note: (near initialization for ‘auth_truncated_digest_byte_lengths’)
../drivers/crypto/ipsec_mb/pmd_aesni_mb_priv.h:5: error: unterminated #ifndef
    5 | #ifndef _PMD_AESNI_MB_PRIV_H_
In file included from ../lib/eal/include/rte_lcore.h:17,
                 from ../lib/eal/include/generic/rte_spinlock.h:24,
                 from ../lib/eal/x86/include/rte_spinlock.h:8,
                 from ../lib/mempool/rte_mempool.h:44,
                 from ../lib/mbuf/rte_mbuf.h:39,
                 from ../lib/cryptodev/rte_crypto.h:15,
                 from ../lib/security/rte_security.h:19,
                 from ../drivers/crypto/ipsec_mb/pmd_aesni_mb_priv.h:8:
../lib/eal/include/rte_per_lcore.h:34:9: error: expected expression before ‘__thread’
   34 |         __thread type per_lcore_##name
      |         ^~~~~~~~
../drivers/crypto/ipsec_mb/pmd_aesni_mb.c:9:1: note: in expansion of macro ‘RTE_DEFINE_PER_LCORE’
    9 | RTE_DEFINE_PER_LCORE(pid_t, pid);
      | ^~~~~~~~~~~~~~~~~~~~
../drivers/crypto/ipsec_mb/pmd_aesni_mb.c:298: error: unterminated #if
  298 | #if IMB_VERSION(1, 5, 0) <= IMB_VERSION_NUM
[2695/3647] Compiling C object drivers/libtmp_rte_crypto_ipsec_mb.a.p/crypto_ipsec_mb_ipsec_mb_private.c.o
[2696/3647] Compiling C object drivers/libtmp_rte_crypto_nitrox.a.p/crypto_nitrox_nitrox_sym_capabilities.c.o
[2697/3647] Compiling C object drivers/libtmp_rte_crypto_nitrox.a.p/crypto_nitrox_nitrox_sym.c.o
[2698/3647] Compiling C object drivers/libtmp_rte_crypto_ipsec_mb.a.p/crypto_ipsec_mb_pmd_aesni_gcm.c.o
[2699/3647] Compiling C object drivers/libtmp_rte_crypto_dpaa_sec.a.p/crypto_dpaa_sec_dpaa_sec.c.o
[2700/3647] Compiling C object drivers/libtmp_rte_crypto_dpaa2_sec.a.p/crypto_dpaa2_sec_dpaa2_sec_dpseci.c.o
[2701/3647] Compiling C object drivers/libtmp_rte_crypto_cnxk.a.p/crypto_cnxk_cn9k_cryptodev_ops.c.o
[2702/3647] Compiling C object drivers/libtmp_rte_crypto_cnxk.a.p/crypto_cnxk_cn20k_cryptodev_ops.c.o
[2703/3647] Compiling C object drivers/libtmp_rte_crypto_cnxk.a.p/crypto_cnxk_cn10k_cryptodev_ops.c.o
ninja: build stopped




*Build Failed #13:
OS: RHEL10.2-64
Target: x86_64-native-linuxapp-gcc
FAILED: drivers/libtmp_rte_crypto_ipsec_mb.a.p/crypto_ipsec_mb_pmd_aesni_mb.c.o 
gcc -Idrivers/libtmp_rte_crypto_ipsec_mb.a.p -Idrivers -I../drivers -Idrivers/crypto/ipsec_mb -I../drivers/crypto/ipsec_mb -Ilib/cryptodev -I../lib/cryptodev -Ilib/eal/common -I../lib/eal/common -I. -I.. -Iconfig -I../config -Ilib/eal/include -I../lib/eal/include -Ilib/eal/linux/include -I../lib/eal/linux/include -Ilib/eal/x86/include -I../lib/eal/x86/include -I../kernel/linux -Ilib/eal -I../lib/eal -Ilib/kvargs -I../lib/kvargs -Ilib/log -I../lib/log -Ilib/metrics -I../lib/metrics -Ilib/telemetry -I../lib/telemetry -Ilib/argparse -I../lib/argparse -Ilib/mbuf -I../lib/mbuf -Ilib/mempool -I../lib/mempool -Ilib/ring -I../lib/ring -Ilib/rcu -I../lib/rcu -Idrivers/bus/vdev -I../drivers/bus/vdev -Ilib/net -I../lib/net -Ilib/security -I../lib/security -fdiagnostics-color=always -D_FILE_OFFSET_BITS=64 -Wall -Winvalid-pch -Wextra -Werror -std=c11 -O3 -include rte_config.h -Wvla -Wcast-qual -Wdeprecated -Wformat -Wformat-nonliteral -Wformat-security -Wmissing-declarations -Wmissing-prototypes -Wnested-externs -Wold-style-definition -Wpointer-arith -Wshadow -Wsign-compare -Wstrict-prototypes -Wundef -Wwrite-strings -Wno-packed-not-aligned -Wno-missing-field-initializers -D_GNU_SOURCE -fPIC -march=native -mrtm -DALLOW_EXPERIMENTAL_API -DALLOW_INTERNAL_API -Wno-format-truncation -Wno-address-of-packed-member -Wno-vla -DRTE_COMPONENT_CLASS=pmd_crypto -DRTE_COMPONENT_NAME=ipsec_mb -DRTE_LOG_DEFAULT_LOGTYPE=pmd.crypto.ipsec_mb -MD -MQ drivers/libtmp_rte_crypto_ipsec_mb.a.p/crypto_ipsec_mb_pmd_aesni_mb.c.o -MF drivers/libtmp_rte_crypto_ipsec_mb.a.p/crypto_ipsec_mb_pmd_aesni_mb.c.o.d -o drivers/libtmp_rte_crypto_ipsec_mb.a.p/crypto_ipsec_mb_pmd_aesni_mb.c.o -c ../drivers/crypto/ipsec_mb/pmd_aesni_mb.c
In file included from ../drivers/crypto/ipsec_mb/pmd_aesni_mb.c:7:
../drivers/crypto/ipsec_mb/pmd_aesni_mb_priv.h:1107:18: error: ‘IMB_AUTH_ZUC_EIA3’ undeclared here (not in a function)
 1107 |                 [IMB_AUTH_ZUC_EIA3]             = 16,
      |                  ^~~~~~~~~~~~~~~~~
../drivers/crypto/ipsec_mb/pmd_aesni_mb_priv.h:1107:18: error: array index in initializer not of integer type
../drivers/crypto/ipsec_mb/pmd_aesni_mb_priv.h:1107:18: note: (near initialization for ‘auth_blocksize’)
../drivers/crypto/ipsec_mb/pmd_aesni_mb_priv.h:1108:18: error: ‘IMB_AUTH_SNOW3G_UIA2’ undeclared here (not in a function); did you mean ‘IMB_AUTH_SNOW_V_AEAD’?
 1108 |                 [IMB_AUTH_SNOW3G_UIA2]  = 16,
      |                  ^~~~~~~~~~~~~~~~~~~~
      |                  IMB_AUTH_SNOW_V_AEAD
../drivers/crypto/ipsec_mb/pmd_aesni_mb_priv.h:1108:18: error: array index in initializer not of integer type
../drivers/crypto/ipsec_mb/pmd_aesni_mb_priv.h:1108:18: note: (near initialization for ‘auth_blocksize’)
../drivers/crypto/ipsec_mb/pmd_aesni_mb_priv.h:1153:18: error: array index in initializer not of integer type
 1153 |                 [IMB_AUTH_ZUC_EIA3]             = 4,
      |                  ^~~~~~~~~~~~~~~~~
../drivers/crypto/ipsec_mb/pmd_aesni_mb_priv.h:1153:18: note: (near initialization for ‘auth_truncated_digest_byte_lengths’)
../drivers/crypto/ipsec_mb/pmd_aesni_mb_priv.h:1154:18: error: array index in initializer not of integer type
 1154 |                 [IMB_AUTH_SNOW3G_UIA2]  = 4,
      |                  ^~~~~~~~~~~~~~~~~~~~
../drivers/crypto/ipsec_mb/pmd_aesni_mb_priv.h:1154:18: note: (near initialization for ‘auth_truncated_digest_byte_lengths’)
../drivers/crypto/ipsec_mb/pmd_aesni_mb_priv.h:5: error: unterminated #ifndef
    5 | #ifndef _PMD_AESNI_MB_PRIV_H_
In file included from ../lib/eal/include/rte_lcore.h:17,
                 from ../lib/eal/include/generic/rte_spinlock.h:24,
                 from ../lib/eal/x86/include/rte_spinlock.h:8,
                 from ../lib/mempool/rte_mempool.h:44,
                 from ../lib/mbuf/rte_mbuf.h:39,
                 from ../lib/cryptodev/rte_crypto.h:15,
                 from ../lib/security/rte_security.h:19,
                 from ../drivers/crypto/ipsec_mb/pmd_aesni_mb_priv.h:8:
../lib/eal/include/rte_per_lcore.h:34:9: error: expected expression before ‘__thread’
   34 |         __thread type per_lcore_##name
      |         ^~~~~~~~
../drivers/crypto/ipsec_mb/pmd_aesni_mb.c:9:1: note: in expansion of macro ‘RTE_DEFINE_PER_LCORE’
    9 | RTE_DEFINE_PER_LCORE(pid_t, pid);
      | ^~~~~~~~~~~~~~~~~~~~
../drivers/crypto/ipsec_mb/pmd_aesni_mb.c:298: error: unterminated #if
  298 | #if IMB_VERSION(1, 5, 0) <= IMB_VERSION_NUM
[2691/3647] Generating drivers/rte_crypto_ionic.sym_chk with a custom command (wrapped by meson to capture output)
[2692/3647] Compiling C object drivers/libtmp_rte_crypto_ipsec_mb.a.p/crypto_ipsec_mb_ipsec_mb_private.c.o
[2693/3647] Compiling C object drivers/libtmp_rte_crypto_nitrox.a.p/crypto_nitrox_nitrox_sym_capabilities.c.o
[2694/3647] Compiling C object drivers/libtmp_rte_crypto_ipsec_mb.a.p/crypto_ipsec_mb_pmd_aesni_gcm.c.o
[2695/3647] Compiling C object drivers/libtmp_rte_crypto_dpaa_sec.a.p/crypto_dpaa_sec_dpaa_sec.c.o
[2696/3647] Compiling C object drivers/libtmp_rte_crypto_dpaa2_sec.a.p/crypto_dpaa2_sec_dpaa2_sec_dpseci.c.o
[2697/3647] Compiling C object drivers/libtmp_rte_crypto_cnxk.a.p/crypto_cnxk_cn9k_cryptodev_ops.c.o
[2698/3647] Compiling C object drivers/libtmp_rte_crypto_cnxk.a.p/crypto_cnxk_cn20k_cryptodev_ops.c.o
[2699/3647] Compiling C object drivers/libtmp_rte_crypto_cnxk.a.p/crypto_cnxk_cn10k_cryptodev_ops.c.o
ninja: build stopped




*Build Failed #14:
OS: UB2604-64
Target: x86_64-native-linuxapp-gcc+16byte
FAILED: drivers/libtmp_rte_crypto_ipsec_mb.a.p/crypto_ipsec_mb_pmd_aesni_mb.c.o 
gcc -Idrivers/libtmp_rte_crypto_ipsec_mb.a.p -Idrivers -I../drivers -Idrivers/crypto/ipsec_mb -I../drivers/crypto/ipsec_mb -Ilib/cryptodev -I../lib/cryptodev -Ilib/eal/common -I../lib/eal/common -I. -I.. -Iconfig -I../config -Ilib/eal/include -I../lib/eal/include -Ilib/eal/linux/include -I../lib/eal/linux/include -Ilib/eal/x86/include -I../lib/eal/x86/include -I../kernel/linux -Ilib/eal -I../lib/eal -Ilib/kvargs -I../lib/kvargs -Ilib/log -I../lib/log -Ilib/metrics -I../lib/metrics -Ilib/telemetry -I../lib/telemetry -Ilib/argparse -I../lib/argparse -Ilib/mbuf -I../lib/mbuf -Ilib/mempool -I../lib/mempool -Ilib/ring -I../lib/ring -Ilib/rcu -I../lib/rcu -Idrivers/bus/vdev -I../drivers/bus/vdev -Ilib/net -I../lib/net -Ilib/security -I../lib/security -fdiagnostics-color=always -D_FILE_OFFSET_BITS=64 -Wall -Winvalid-pch -Wextra -Werror -std=c11 -O3 -include rte_config.h -Wvla -Wcast-qual -Wdeprecated -Wformat -Wformat-nonliteral -Wformat-security -Wmissing-declarations -Wmissing-prototypes -Wnested-externs -Wold-style-definition -Wpointer-arith -Wshadow -Wsign-compare -Wstrict-prototypes -Wundef -Wwrite-strings -Wno-packed-not-aligned -Wno-missing-field-initializers -fzero-init-padding-bits=all -D_GNU_SOURCE -DRTE_LIBRTE_I40E_16BYTE_RX_DESC -DRTE_LIBRTE_ICE_16BYTE_RX_DESC -fPIC -march=native -mrtm -DALLOW_EXPERIMENTAL_API -DALLOW_INTERNAL_API -Wno-format-truncation -Wno-address-of-packed-member -Wno-vla -DRTE_COMPONENT_CLASS=pmd_crypto -DRTE_COMPONENT_NAME=ipsec_mb -DRTE_LOG_DEFAULT_LOGTYPE=pmd.crypto.ipsec_mb -MD -MQ drivers/libtmp_rte_crypto_ipsec_mb.a.p/crypto_ipsec_mb_pmd_aesni_mb.c.o -MF drivers/libtmp_rte_crypto_ipsec_mb.a.p/crypto_ipsec_mb_pmd_aesni_mb.c.o.d -o drivers/libtmp_rte_crypto_ipsec_mb.a.p/crypto_ipsec_mb_pmd_aesni_mb.c.o -c ../drivers/crypto/ipsec_mb/pmd_aesni_mb.c
In file included from ../drivers/crypto/ipsec_mb/pmd_aesni_mb.c:7:
../drivers/crypto/ipsec_mb/pmd_aesni_mb_priv.h:1107:18: error: ‘IMB_AUTH_ZUC_EIA3’ undeclared here (not in a function)
 1107 |                 [IMB_AUTH_ZUC_EIA3]             = 16,
      |                  ^~~~~~~~~~~~~~~~~
../drivers/crypto/ipsec_mb/pmd_aesni_mb_priv.h:1107:18: error: array index in initializer not of integer type
../drivers/crypto/ipsec_mb/pmd_aesni_mb_priv.h:1107:18: note: (near initialization for ‘auth_blocksize’)
../drivers/crypto/ipsec_mb/pmd_aesni_mb_priv.h:1108:18: error: ‘IMB_AUTH_SNOW3G_UIA2’ undeclared here (not in a function); did you mean ‘IMB_AUTH_SNOW_V_AEAD’?
 1108 |                 [IMB_AUTH_SNOW3G_UIA2]  = 16,
      |                  ^~~~~~~~~~~~~~~~~~~~
      |                  IMB_AUTH_SNOW_V_AEAD
../drivers/crypto/ipsec_mb/pmd_aesni_mb_priv.h:1108:18: error: array index in initializer not of integer type
../drivers/crypto/ipsec_mb/pmd_aesni_mb_priv.h:1108:18: note: (near initialization for ‘auth_blocksize’)
../drivers/crypto/ipsec_mb/pmd_aesni_mb_priv.h:1153:18: error: array index in initializer not of integer type
 1153 |                 [IMB_AUTH_ZUC_EIA3]             = 4,
      |                  ^~~~~~~~~~~~~~~~~
../drivers/crypto/ipsec_mb/pmd_aesni_mb_priv.h:1153:18: note: (near initialization for ‘auth_truncated_digest_byte_lengths’)
../drivers/crypto/ipsec_mb/pmd_aesni_mb_priv.h:1154:18: error: array index in initializer not of integer type
 1154 |                 [IMB_AUTH_SNOW3G_UIA2]  = 4,
      |                  ^~~~~~~~~~~~~~~~~~~~
../drivers/crypto/ipsec_mb/pmd_aesni_mb_priv.h:1154:18: note: (near initialization for ‘auth_truncated_digest_byte_lengths’)
../drivers/crypto/ipsec_mb/pmd_aesni_mb_priv.h:5: error: unterminated #ifndef
    5 | #ifndef _PMD_AESNI_MB_PRIV_H_
In file included from ../lib/eal/include/rte_lcore.h:17,
                 from ../lib/eal/include/generic/rte_spinlock.h:24,
                 from ../lib/eal/x86/include/rte_spinlock.h:8,
                 from ../lib/mempool/rte_mempool.h:44,
                 from ../lib/mbuf/rte_mbuf.h:39,
                 from ../lib/cryptodev/rte_crypto.h:15,
                 from ../lib/security/rte_security.h:19,
                 from ../drivers/crypto/ipsec_mb/pmd_aesni_mb_priv.h:8:
../lib/eal/include/rte_per_lcore.h:34:9: error: expected expression before ‘__thread’
   34 |         __thread type per_lcore_##name
      |         ^~~~~~~~
../drivers/crypto/ipsec_mb/pmd_aesni_mb.c:9:1: note: in expansion of macro ‘RTE_DEFINE_PER_LCORE’
    9 | RTE_DEFINE_PER_LCORE(pid_t, pid);
      | ^~~~~~~~~~~~~~~~~~~~
../drivers/crypto/ipsec_mb/pmd_aesni_mb.c:298: error: unterminated #if
  298 | #if IMB_VERSION(1, 5, 0) <= IMB_VERSION_NUM
[2883/3888] Compiling C object drivers/libtmp_rte_crypto_ipsec_mb.a.p/crypto_ipsec_mb_ipsec_mb_private.c.o
[2884/3888] Compiling C object drivers/libtmp_rte_crypto_mlx5.a.p/crypto_mlx5_mlx5_crypto.c.o
[2885/3888] Compiling C object drivers/libtmp_rte_crypto_mlx5.a.p/crypto_mlx5_mlx5_crypto_xts.c.o
[2886/3888] Compiling C object drivers/libtmp_rte_crypto_ipsec_mb.a.p/crypto_ipsec_mb_pmd_aesni_gcm.c.o
[2887/3888] Compiling C object drivers/libtmp_rte_crypto_dpaa_sec.a.p/crypto_dpaa_sec_dpaa_sec.c.o
[2888/3888] Compiling C object drivers/libtmp_rte_crypto_dpaa2_sec.a.p/crypto_dpaa2_sec_dpaa2_sec_dpseci.c.o
[2889/3888] Compiling C object drivers/libtmp_rte_crypto_cnxk.a.p/crypto_cnxk_cn9k_cryptodev_ops.c.o
[2890/3888] Compiling C object drivers/libtmp_rte_crypto_cnxk.a.p/crypto_cnxk_cn20k_cryptodev_ops.c.o
[2891/3888] Compiling C object drivers/libtmp_rte_crypto_cnxk.a.p/crypto_cnxk_cn10k_cryptodev_ops.c.o
ninja: build stopped




*Build Failed #15:
OS: UB2604-64
Target: x86_64-native-linuxapp-gcc
FAILED: drivers/libtmp_rte_crypto_ipsec_mb.a.p/crypto_ipsec_mb_pmd_aesni_mb.c.o 
gcc -Idrivers/libtmp_rte_crypto_ipsec_mb.a.p -Idrivers -I../drivers -Idrivers/crypto/ipsec_mb -I../drivers/crypto/ipsec_mb -Ilib/cryptodev -I../lib/cryptodev -Ilib/eal/common -I../lib/eal/common -I. -I.. -Iconfig -I../config -Ilib/eal/include -I../lib/eal/include -Ilib/eal/linux/include -I../lib/eal/linux/include -Ilib/eal/x86/include -I../lib/eal/x86/include -I../kernel/linux -Ilib/eal -I../lib/eal -Ilib/kvargs -I../lib/kvargs -Ilib/log -I../lib/log -Ilib/metrics -I../lib/metrics -Ilib/telemetry -I../lib/telemetry -Ilib/argparse -I../lib/argparse -Ilib/mbuf -I../lib/mbuf -Ilib/mempool -I../lib/mempool -Ilib/ring -I../lib/ring -Ilib/rcu -I../lib/rcu -Idrivers/bus/vdev -I../drivers/bus/vdev -Ilib/net -I../lib/net -Ilib/security -I../lib/security -fdiagnostics-color=always -D_FILE_OFFSET_BITS=64 -Wall -Winvalid-pch -Wextra -Werror -std=c11 -O3 -include rte_config.h -Wvla -Wcast-qual -Wdeprecated -Wformat -Wformat-nonliteral -Wformat-security -Wmissing-declarations -Wmissing-prototypes -Wnested-externs -Wold-style-definition -Wpointer-arith -Wshadow -Wsign-compare -Wstrict-prototypes -Wundef -Wwrite-strings -Wno-packed-not-aligned -Wno-missing-field-initializers -fzero-init-padding-bits=all -D_GNU_SOURCE -fPIC -march=native -mrtm -DALLOW_EXPERIMENTAL_API -DALLOW_INTERNAL_API -Wno-format-truncation -Wno-address-of-packed-member -Wno-vla -DRTE_COMPONENT_CLASS=pmd_crypto -DRTE_COMPONENT_NAME=ipsec_mb -DRTE_LOG_DEFAULT_LOGTYPE=pmd.crypto.ipsec_mb -MD -MQ drivers/libtmp_rte_crypto_ipsec_mb.a.p/crypto_ipsec_mb_pmd_aesni_mb.c.o -MF drivers/libtmp_rte_crypto_ipsec_mb.a.p/crypto_ipsec_mb_pmd_aesni_mb.c.o.d -o drivers/libtmp_rte_crypto_ipsec_mb.a.p/crypto_ipsec_mb_pmd_aesni_mb.c.o -c ../drivers/crypto/ipsec_mb/pmd_aesni_mb.c
In file included from ../drivers/crypto/ipsec_mb/pmd_aesni_mb.c:7:
../drivers/crypto/ipsec_mb/pmd_aesni_mb_priv.h:1107:18: error: ‘IMB_AUTH_ZUC_EIA3’ undeclared here (not in a function)
 1107 |                 [IMB_AUTH_ZUC_EIA3]             = 16,
      |                  ^~~~~~~~~~~~~~~~~
../drivers/crypto/ipsec_mb/pmd_aesni_mb_priv.h:1107:18: error: array index in initializer not of integer type
../drivers/crypto/ipsec_mb/pmd_aesni_mb_priv.h:1107:18: note: (near initialization for ‘auth_blocksize’)
../drivers/crypto/ipsec_mb/pmd_aesni_mb_priv.h:1108:18: error: ‘IMB_AUTH_SNOW3G_UIA2’ undeclared here (not in a function); did you mean ‘IMB_AUTH_SNOW_V_AEAD’?
 1108 |                 [IMB_AUTH_SNOW3G_UIA2]  = 16,
      |                  ^~~~~~~~~~~~~~~~~~~~
      |                  IMB_AUTH_SNOW_V_AEAD
../drivers/crypto/ipsec_mb/pmd_aesni_mb_priv.h:1108:18: error: array index in initializer not of integer type
../drivers/crypto/ipsec_mb/pmd_aesni_mb_priv.h:1108:18: note: (near initialization for ‘auth_blocksize’)
../drivers/crypto/ipsec_mb/pmd_aesni_mb_priv.h:1153:18: error: array index in initializer not of integer type
 1153 |                 [IMB_AUTH_ZUC_EIA3]             = 4,
      |                  ^~~~~~~~~~~~~~~~~
../drivers/crypto/ipsec_mb/pmd_aesni_mb_priv.h:1153:18: note: (near initialization for ‘auth_truncated_digest_byte_lengths’)
../drivers/crypto/ipsec_mb/pmd_aesni_mb_priv.h:1154:18: error: array index in initializer not of integer type
 1154 |                 [IMB_AUTH_SNOW3G_UIA2]  = 4,
      |                  ^~~~~~~~~~~~~~~~~~~~
../drivers/crypto/ipsec_mb/pmd_aesni_mb_priv.h:1154:18: note: (near initialization for ‘auth_truncated_digest_byte_lengths’)
../drivers/crypto/ipsec_mb/pmd_aesni_mb_priv.h:5: error: unterminated #ifndef
    5 | #ifndef _PMD_AESNI_MB_PRIV_H_
In file included from ../lib/eal/include/rte_lcore.h:17,
                 from ../lib/eal/include/generic/rte_spinlock.h:24,
                 from ../lib/eal/x86/include/rte_spinlock.h:8,
                 from ../lib/mempool/rte_mempool.h:44,
                 from ../lib/mbuf/rte_mbuf.h:39,
                 from ../lib/cryptodev/rte_crypto.h:15,
                 from ../lib/security/rte_security.h:19,
                 from ../drivers/crypto/ipsec_mb/pmd_aesni_mb_priv.h:8:
../lib/eal/include/rte_per_lcore.h:34:9: error: expected expression before ‘__thread’
   34 |         __thread type per_lcore_##name
      |         ^~~~~~~~
../drivers/crypto/ipsec_mb/pmd_aesni_mb.c:9:1: note: in expansion of macro ‘RTE_DEFINE_PER_LCORE’
    9 | RTE_DEFINE_PER_LCORE(pid_t, pid);
      | ^~~~~~~~~~~~~~~~~~~~
../drivers/crypto/ipsec_mb/pmd_aesni_mb.c:298: error: unterminated #if
  298 | #if IMB_VERSION(1, 5, 0) <= IMB_VERSION_NUM
[2882/3888] Compiling C object drivers/libtmp_rte_crypto_ipsec_mb.a.p/crypto_ipsec_mb_ipsec_mb_private.c.o
[2883/3888] Compiling C object drivers/libtmp_rte_crypto_mlx5.a.p/crypto_mlx5_mlx5_crypto.c.o
[2884/3888] Compiling C object drivers/libtmp_rte_crypto_mlx5.a.p/crypto_mlx5_mlx5_crypto_xts.c.o
[2885/3888] Compiling C object drivers/libtmp_rte_crypto_ipsec_mb.a.p/crypto_ipsec_mb_pmd_aesni_gcm.c.o
[2886/3888] Compiling C object drivers/libtmp_rte_crypto_dpaa_sec.a.p/crypto_dpaa_sec_dpaa_sec.c.o
[2887/3888] Compiling C object drivers/libtmp_rte_crypto_dpaa2_sec.a.p/crypto_dpaa2_sec_dpaa2_sec_dpseci.c.o
[2888/3888] Compiling C object drivers/libtmp_rte_crypto_cnxk.a.p/crypto_cnxk_cn9k_cryptodev_ops.c.o
[2889/3888] Compiling C object drivers/libtmp_rte_crypto_cnxk.a.p/crypto_cnxk_cn20k_cryptodev_ops.c.o
[2890/3888] Compiling C object drivers/libtmp_rte_crypto_cnxk.a.p/crypto_cnxk_cn10k_cryptodev_ops.c.o
ninja: build stopped




*Build Failed #16:
OS: UB2604-64
Target: x86_64-native-linuxapp-clang
FAILED: drivers/libtmp_rte_crypto_ipsec_mb.a.p/crypto_ipsec_mb_pmd_aesni_mb.c.o 
clang -Idrivers/libtmp_rte_crypto_ipsec_mb.a.p -Idrivers -I../drivers -Idrivers/crypto/ipsec_mb -I../drivers/crypto/ipsec_mb -Ilib/cryptodev -I../lib/cryptodev -Ilib/eal/common -I../lib/eal/common -I. -I.. -Iconfig -I../config -Ilib/eal/include -I../lib/eal/include -Ilib/eal/linux/include -I../lib/eal/linux/include -Ilib/eal/x86/include -I../lib/eal/x86/include -I../kernel/linux -Ilib/eal -I../lib/eal -Ilib/kvargs -I../lib/kvargs -Ilib/log -I../lib/log -Ilib/metrics -I../lib/metrics -Ilib/telemetry -I../lib/telemetry -Ilib/argparse -I../lib/argparse -Ilib/mbuf -I../lib/mbuf -Ilib/mempool -I../lib/mempool -Ilib/ring -I../lib/ring -Ilib/rcu -I../lib/rcu -Idrivers/bus/vdev -I../drivers/bus/vdev -Ilib/net -I../lib/net -Ilib/security -I../lib/security -fdiagnostics-color=always -D_FILE_OFFSET_BITS=64 -Wall -Winvalid-pch -Wextra -Werror -std=c11 -O3 -include rte_config.h -Wvla -Wcast-qual -Wcomma -Wdeprecated -Wformat -Wformat-nonliteral -Wformat-security -Wmissing-declarations -Wmissing-prototypes -Wnested-externs -Wold-style-definition -Wpointer-arith -Wshadow -Wsign-compare -Wstrict-prototypes -Wundef -Wwrite-strings -Wno-missing-field-initializers -D_GNU_SOURCE -fPIC -march=native -mrtm -DALLOW_EXPERIMENTAL_API -DALLOW_INTERNAL_API -Wno-format-truncation -Wno-address-of-packed-member -Wno-vla -DRTE_COMPONENT_CLASS=pmd_crypto -DRTE_COMPONENT_NAME=ipsec_mb -DRTE_LOG_DEFAULT_LOGTYPE=pmd.crypto.ipsec_mb -DRTE_ANNOTATE_LOCKS -Wthread-safety -MD -MQ drivers/libtmp_rte_crypto_ipsec_mb.a.p/crypto_ipsec_mb_pmd_aesni_mb.c.o -MF drivers/libtmp_rte_crypto_ipsec_mb.a.p/crypto_ipsec_mb_pmd_aesni_mb.c.o.d -o drivers/libtmp_rte_crypto_ipsec_mb.a.p/crypto_ipsec_mb_pmd_aesni_mb.c.o -c ../drivers/crypto/ipsec_mb/pmd_aesni_mb.c
In file included from ../drivers/crypto/ipsec_mb/pmd_aesni_mb.c:7:
../drivers/crypto/ipsec_mb/pmd_aesni_mb_priv.h:1107:4: error: use of undeclared identifier 'IMB_AUTH_ZUC_EIA3'
 1107 |                 [IMB_AUTH_ZUC_EIA3]             = 16,
      |                  ^~~~~~~~~~~~~~~~~
../drivers/crypto/ipsec_mb/pmd_aesni_mb_priv.h:1153:4: error: use of undeclared identifier 'IMB_AUTH_ZUC_EIA3'
 1153 |                 [IMB_AUTH_ZUC_EIA3]             = 4,
      |                  ^~~~~~~~~~~~~~~~~
../drivers/crypto/ipsec_mb/pmd_aesni_mb_priv.h:5:2: error: unterminated conditional directive
    5 | #ifndef _PMD_AESNI_MB_PRIV_H_
      |  ^
../drivers/crypto/ipsec_mb/pmd_aesni_mb.c:9:1: error: expected expression
    9 | RTE_DEFINE_PER_LCORE(pid_t, pid);
      | ^
../lib/eal/include/rte_per_lcore.h:34:2: note: expanded from macro 'RTE_DEFINE_PER_LCORE'
   34 |         __thread type per_lcore_##name
      |         ^
../drivers/crypto/ipsec_mb/pmd_aesni_mb.c:298:2: error: unterminated conditional directive
  298 | #if IMB_VERSION(1, 5, 0) <= IMB_VERSION_NUM
      |  ^
../drivers/crypto/ipsec_mb/pmd_aesni_mb.c:2627:2: error: expected '}'
 2627 | }
      |  ^
../drivers/crypto/ipsec_mb/pmd_aesni_mb_priv.h:1183:56: note: to match this '{'
 1183 | static const unsigned int auth_digest_byte_lengths[] = {
      |                                                        ^
../drivers/crypto/ipsec_mb/pmd_aesni_mb.c:297:9: error: expected ';' after top level declarator
  297 |                 break;
      |                       ^
      |                       ;
7 errors generated.
[2885/3889] Linking target drivers/librte_crypto_ionic.so.27.0
[2886/3889] Compiling C object drivers/libtmp_rte_crypto_mlx5.a.p/crypto_mlx5_mlx5_crypto_xts.c.o
[2887/3889] Compiling C object drivers/libtmp_rte_crypto_mlx5.a.p/crypto_mlx5_mlx5_crypto.c.o
[2888/3889] Compiling C object drivers/libtmp_rte_crypto_ipsec_mb.a.p/crypto_ipsec_mb_pmd_aesni_gcm.c.o
[2889/3889] Compiling C object drivers/libtmp_rte_crypto_cnxk.a.p/crypto_cnxk_cn9k_cryptodev_ops.c.o
[2890/3889] Compiling C object drivers/libtmp_rte_crypto_dpaa2_sec.a.p/crypto_dpaa2_sec_dpaa2_sec_dpseci.c.o
[2891/3889] Compiling C object drivers/libtmp_rte_crypto_dpaa_sec.a.p/crypto_dpaa_sec_dpaa_sec.c.o
[2892/3889] Compiling C object drivers/libtmp_rte_crypto_cnxk.a.p/crypto_cnxk_cn20k_cryptodev_ops.c.o
[2893/3889] Compiling C object drivers/libtmp_rte_crypto_cnxk.a.p/crypto_cnxk_cn10k_cryptodev_ops.c.o
ninja: build stopped




*Build Failed #17:
OS: UB2604-64
Target: x86_64-native-linuxapp-doc
FAILED: drivers/libtmp_rte_crypto_ipsec_mb.a.p/crypto_ipsec_mb_pmd_aesni_mb.c.o 
gcc -Idrivers/libtmp_rte_crypto_ipsec_mb.a.p -Idrivers -I../drivers -Idrivers/crypto/ipsec_mb -I../drivers/crypto/ipsec_mb -Ilib/cryptodev -I../lib/cryptodev -Ilib/eal/common -I../lib/eal/common -I. -I.. -Iconfig -I../config -Ilib/eal/include -I../lib/eal/include -Ilib/eal/linux/include -I../lib/eal/linux/include -Ilib/eal/x86/include -I../lib/eal/x86/include -I../kernel/linux -Ilib/eal -I../lib/eal -Ilib/kvargs -I../lib/kvargs -Ilib/log -I../lib/log -Ilib/metrics -I../lib/metrics -Ilib/telemetry -I../lib/telemetry -Ilib/argparse -I../lib/argparse -Ilib/mbuf -I../lib/mbuf -Ilib/mempool -I../lib/mempool -Ilib/ring -I../lib/ring -Ilib/rcu -I../lib/rcu -Idrivers/bus/vdev -I../drivers/bus/vdev -Ilib/net -I../lib/net -Ilib/security -I../lib/security -fdiagnostics-color=always -D_FILE_OFFSET_BITS=64 -Wall -Winvalid-pch -Wextra -Werror -std=c11 -O3 -include rte_config.h -Wvla -Wcast-qual -Wdeprecated -Wformat -Wformat-nonliteral -Wformat-security -Wmissing-declarations -Wmissing-prototypes -Wnested-externs -Wold-style-definition -Wpointer-arith -Wshadow -Wsign-compare -Wstrict-prototypes -Wundef -Wwrite-strings -Wno-packed-not-aligned -Wno-missing-field-initializers -fzero-init-padding-bits=all -D_GNU_SOURCE -fPIC -march=native -mrtm -DALLOW_EXPERIMENTAL_API -DALLOW_INTERNAL_API -Wno-format-truncation -Wno-address-of-packed-member -Wno-vla -DRTE_COMPONENT_CLASS=pmd_crypto -DRTE_COMPONENT_NAME=ipsec_mb -DRTE_LOG_DEFAULT_LOGTYPE=pmd.crypto.ipsec_mb -MD -MQ drivers/libtmp_rte_crypto_ipsec_mb.a.p/crypto_ipsec_mb_pmd_aesni_mb.c.o -MF drivers/libtmp_rte_crypto_ipsec_mb.a.p/crypto_ipsec_mb_pmd_aesni_mb.c.o.d -o drivers/libtmp_rte_crypto_ipsec_mb.a.p/crypto_ipsec_mb_pmd_aesni_mb.c.o -c ../drivers/crypto/ipsec_mb/pmd_aesni_mb.c
In file included from ../drivers/crypto/ipsec_mb/pmd_aesni_mb.c:7:
../drivers/crypto/ipsec_mb/pmd_aesni_mb_priv.h:1107:18: error: ‘IMB_AUTH_ZUC_EIA3’ undeclared here (not in a function)
 1107 |                 [IMB_AUTH_ZUC_EIA3]             = 16,
      |                  ^~~~~~~~~~~~~~~~~
../drivers/crypto/ipsec_mb/pmd_aesni_mb_priv.h:1107:18: error: array index in initializer not of integer type
../drivers/crypto/ipsec_mb/pmd_aesni_mb_priv.h:1107:18: note: (near initialization for ‘auth_blocksize’)
../drivers/crypto/ipsec_mb/pmd_aesni_mb_priv.h:1108:18: error: ‘IMB_AUTH_SNOW3G_UIA2’ undeclared here (not in a function); did you mean ‘IMB_AUTH_SNOW_V_AEAD’?
 1108 |                 [IMB_AUTH_SNOW3G_UIA2]  = 16,
      |                  ^~~~~~~~~~~~~~~~~~~~
      |                  IMB_AUTH_SNOW_V_AEAD
../drivers/crypto/ipsec_mb/pmd_aesni_mb_priv.h:1108:18: error: array index in initializer not of integer type
../drivers/crypto/ipsec_mb/pmd_aesni_mb_priv.h:1108:18: note: (near initialization for ‘auth_blocksize’)
../drivers/crypto/ipsec_mb/pmd_aesni_mb_priv.h:1153:18: error: array index in initializer not of integer type
 1153 |                 [IMB_AUTH_ZUC_EIA3]             = 4,
      |                  ^~~~~~~~~~~~~~~~~
../drivers/crypto/ipsec_mb/pmd_aesni_mb_priv.h:1153:18: note: (near initialization for ‘auth_truncated_digest_byte_lengths’)
../drivers/crypto/ipsec_mb/pmd_aesni_mb_priv.h:1154:18: error: array index in initializer not of integer type
 1154 |                 [IMB_AUTH_SNOW3G_UIA2]  = 4,
      |                  ^~~~~~~~~~~~~~~~~~~~
../drivers/crypto/ipsec_mb/pmd_aesni_mb_priv.h:1154:18: note: (near initialization for ‘auth_truncated_digest_byte_lengths’)
../drivers/crypto/ipsec_mb/pmd_aesni_mb_priv.h:5: error: unterminated #ifndef
    5 | #ifndef _PMD_AESNI_MB_PRIV_H_
In file included from ../lib/eal/include/rte_lcore.h:17,
                 from ../lib/eal/include/generic/rte_spinlock.h:24,
                 from ../lib/eal/x86/include/rte_spinlock.h:8,
                 from ../lib/mempool/rte_mempool.h:44,
                 from ../lib/mbuf/rte_mbuf.h:39,
                 from ../lib/cryptodev/rte_crypto.h:15,
                 from ../lib/security/rte_security.h:19,
                 from ../drivers/crypto/ipsec_mb/pmd_aesni_mb_priv.h:8:
../lib/eal/include/rte_per_lcore.h:34:9: error: expected expression before ‘__thread’
   34 |         __thread type per_lcore_##name
      |         ^~~~~~~~
../drivers/crypto/ipsec_mb/pmd_aesni_mb.c:9:1: note: in expansion of macro ‘RTE_DEFINE_PER_LCORE’
    9 | RTE_DEFINE_PER_LCORE(pid_t, pid);
      | ^~~~~~~~~~~~~~~~~~~~
../drivers/crypto/ipsec_mb/pmd_aesni_mb.c:298: error: unterminated #if
  298 | #if IMB_VERSION(1, 5, 0) <= IMB_VERSION_NUM
[2873/3711] Generating drivers/rte_crypto_ionic.sym_chk with a custom command (wrapped by meson to capture output)
[2874/3711] Generating drivers/rte_crypto_ipsec_mb_map with a custom command
[2875/3711] Compiling C object drivers/libtmp_rte_crypto_ipsec_mb.a.p/crypto_ipsec_mb_ipsec_mb_private.c.o
[2876/3711] Compiling C object drivers/libtmp_rte_crypto_ipsec_mb.a.p/crypto_ipsec_mb_pmd_aesni_gcm.c.o
[2877/3711] Compiling C object drivers/libtmp_rte_crypto_dpaa_sec.a.p/crypto_dpaa_sec_dpaa_sec.c.o
[2878/3711] Compiling C object drivers/libtmp_rte_crypto_dpaa2_sec.a.p/crypto_dpaa2_sec_dpaa2_sec_dpseci.c.o
[2879/3711] Compiling C object drivers/libtmp_rte_crypto_cnxk.a.p/crypto_cnxk_cn9k_cryptodev_ops.c.o
[2880/3711] Compiling C object drivers/libtmp_rte_crypto_cnxk.a.p/crypto_cnxk_cn20k_cryptodev_ops.c.o
[2881/3711] Compiling C object drivers/libtmp_rte_crypto_cnxk.a.p/crypto_cnxk_cn10k_cryptodev_ops.c.o
ninja: build stopped




*Build Failed #18:
OS: RHEL10.2-64RT
Target: x86_64-native-linuxapp-gcc
FAILED: drivers/libtmp_rte_crypto_ipsec_mb.a.p/crypto_ipsec_mb_pmd_aesni_mb.c.o 
gcc -Idrivers/libtmp_rte_crypto_ipsec_mb.a.p -Idrivers -I../drivers -Idrivers/crypto/ipsec_mb -I../drivers/crypto/ipsec_mb -Ilib/cryptodev -I../lib/cryptodev -Ilib/eal/common -I../lib/eal/common -I. -I.. -Iconfig -I../config -Ilib/eal/include -I../lib/eal/include -Ilib/eal/linux/include -I../lib/eal/linux/include -Ilib/eal/x86/include -I../lib/eal/x86/include -I../kernel/linux -Ilib/eal -I../lib/eal -Ilib/kvargs -I../lib/kvargs -Ilib/log -I../lib/log -Ilib/metrics -I../lib/metrics -Ilib/telemetry -I../lib/telemetry -Ilib/argparse -I../lib/argparse -Ilib/mbuf -I../lib/mbuf -Ilib/mempool -I../lib/mempool -Ilib/ring -I../lib/ring -Ilib/rcu -I../lib/rcu -Idrivers/bus/vdev -I../drivers/bus/vdev -Ilib/net -I../lib/net -Ilib/security -I../lib/security -fdiagnostics-color=always -D_FILE_OFFSET_BITS=64 -Wall -Winvalid-pch -Wextra -Werror -std=c11 -O3 -include rte_config.h -Wvla -Wcast-qual -Wdeprecated -Wformat -Wformat-nonliteral -Wformat-security -Wmissing-declarations -Wmissing-prototypes -Wnested-externs -Wold-style-definition -Wpointer-arith -Wshadow -Wsign-compare -Wstrict-prototypes -Wundef -Wwrite-strings -Wno-packed-not-aligned -Wno-missing-field-initializers -D_GNU_SOURCE -fPIC -march=native -mrtm -DALLOW_EXPERIMENTAL_API -DALLOW_INTERNAL_API -Wno-format-truncation -Wno-address-of-packed-member -Wno-vla -DRTE_COMPONENT_CLASS=pmd_crypto -DRTE_COMPONENT_NAME=ipsec_mb -DRTE_LOG_DEFAULT_LOGTYPE=pmd.crypto.ipsec_mb -MD -MQ drivers/libtmp_rte_crypto_ipsec_mb.a.p/crypto_ipsec_mb_pmd_aesni_mb.c.o -MF drivers/libtmp_rte_crypto_ipsec_mb.a.p/crypto_ipsec_mb_pmd_aesni_mb.c.o.d -o drivers/libtmp_rte_crypto_ipsec_mb.a.p/crypto_ipsec_mb_pmd_aesni_mb.c.o -c ../drivers/crypto/ipsec_mb/pmd_aesni_mb.c
In file included from ../drivers/crypto/ipsec_mb/pmd_aesni_mb.c:7:
../drivers/crypto/ipsec_mb/pmd_aesni_mb_priv.h:1107:18: error: ‘IMB_AUTH_ZUC_EIA3’ undeclared here (not in a function)
 1107 |                 [IMB_AUTH_ZUC_EIA3]             = 16,
      |                  ^~~~~~~~~~~~~~~~~
../drivers/crypto/ipsec_mb/pmd_aesni_mb_priv.h:1107:18: error: array index in initializer not of integer type
../drivers/crypto/ipsec_mb/pmd_aesni_mb_priv.h:1107:18: note: (near initialization for ‘auth_blocksize’)
../drivers/crypto/ipsec_mb/pmd_aesni_mb_priv.h:1108:18: error: ‘IMB_AUTH_SNOW3G_UIA2’ undeclared here (not in a function); did you mean ‘IMB_AUTH_SNOW_V_AEAD’?
 1108 |                 [IMB_AUTH_SNOW3G_UIA2]  = 16,
      |                  ^~~~~~~~~~~~~~~~~~~~
      |                  IMB_AUTH_SNOW_V_AEAD
../drivers/crypto/ipsec_mb/pmd_aesni_mb_priv.h:1108:18: error: array index in initializer not of integer type
../drivers/crypto/ipsec_mb/pmd_aesni_mb_priv.h:1108:18: note: (near initialization for ‘auth_blocksize’)
../drivers/crypto/ipsec_mb/pmd_aesni_mb_priv.h:1153:18: error: array index in initializer not of integer type
 1153 |                 [IMB_AUTH_ZUC_EIA3]             = 4,
      |                  ^~~~~~~~~~~~~~~~~
../drivers/crypto/ipsec_mb/pmd_aesni_mb_priv.h:1153:18: note: (near initialization for ‘auth_truncated_digest_byte_lengths’)
../drivers/crypto/ipsec_mb/pmd_aesni_mb_priv.h:1154:18: error: array index in initializer not of integer type
 1154 |                 [IMB_AUTH_SNOW3G_UIA2]  = 4,
      |                  ^~~~~~~~~~~~~~~~~~~~
../drivers/crypto/ipsec_mb/pmd_aesni_mb_priv.h:1154:18: note: (near initialization for ‘auth_truncated_digest_byte_lengths’)
../drivers/crypto/ipsec_mb/pmd_aesni_mb_priv.h:5: error: unterminated #ifndef
    5 | #ifndef _PMD_AESNI_MB_PRIV_H_
In file included from ../lib/eal/include/rte_lcore.h:17,
                 from ../lib/eal/include/generic/rte_spinlock.h:24,
                 from ../lib/eal/x86/include/rte_spinlock.h:8,
                 from ../lib/mempool/rte_mempool.h:44,
                 from ../lib/mbuf/rte_mbuf.h:39,
                 from ../lib/cryptodev/rte_crypto.h:15,
                 from ../lib/security/rte_security.h:19,
                 from ../drivers/crypto/ipsec_mb/pmd_aesni_mb_priv.h:8:
../lib/eal/include/rte_per_lcore.h:34:9: error: expected expression before ‘__thread’
   34 |         __thread type per_lcore_##name
      |         ^~~~~~~~
../drivers/crypto/ipsec_mb/pmd_aesni_mb.c:9:1: note: in expansion of macro ‘RTE_DEFINE_PER_LCORE’
    9 | RTE_DEFINE_PER_LCORE(pid_t, pid);
      | ^~~~~~~~~~~~~~~~~~~~
../drivers/crypto/ipsec_mb/pmd_aesni_mb.c:298: error: unterminated #if
  298 | #if IMB_VERSION(1, 5, 0) <= IMB_VERSION_NUM
[2694/3647] Linking target drivers/librte_crypto_ionic.so.27.0
[2695/3647] Compiling C object drivers/libtmp_rte_crypto_ipsec_mb.a.p/crypto_ipsec_mb_ipsec_mb_private.c.o
[2696/3647] Compiling C object drivers/libtmp_rte_crypto_nitrox.a.p/crypto_nitrox_nitrox_sym_capabilities.c.o
[2697/3647] Compiling C object drivers/libtmp_rte_crypto_ipsec_mb.a.p/crypto_ipsec_mb_pmd_aesni_gcm.c.o
[2698/3647] Compiling C object drivers/libtmp_rte_crypto_dpaa_sec.a.p/crypto_dpaa_sec_dpaa_sec.c.o
[2699/3647] Compiling C object drivers/libtmp_rte_crypto_dpaa2_sec.a.p/crypto_dpaa2_sec_dpaa2_sec_dpseci.c.o
[2700/3647] Compiling C object drivers/libtmp_rte_crypto_cnxk.a.p/crypto_cnxk_cn9k_cryptodev_ops.c.o
[2701/3647] Compiling C object drivers/libtmp_rte_crypto_cnxk.a.p/crypto_cnxk_cn20k_cryptodev_ops.c.o
[2702/3647] Compiling C object drivers/libtmp_rte_crypto_cnxk.a.p/crypto_cnxk_cn10k_cryptodev_ops.c.o
ninja: build stopped




*Build Failed #19:
OS: UB2404-64
Target: x86_64-native-linuxapp-gcc
FAILED: drivers/libtmp_rte_crypto_ipsec_mb.a.p/crypto_ipsec_mb_pmd_aesni_mb.c.o 
gcc -Idrivers/libtmp_rte_crypto_ipsec_mb.a.p -Idrivers -I../drivers -Idrivers/crypto/ipsec_mb -I../drivers/crypto/ipsec_mb -Ilib/cryptodev -I../lib/cryptodev -Ilib/eal/common -I../lib/eal/common -I. -I.. -Iconfig -I../config -Ilib/eal/include -I../lib/eal/include -Ilib/eal/linux/include -I../lib/eal/linux/include -Ilib/eal/x86/include -I../lib/eal/x86/include -I../kernel/linux -Ilib/eal -I../lib/eal -Ilib/kvargs -I../lib/kvargs -Ilib/log -I../lib/log -Ilib/metrics -I../lib/metrics -Ilib/telemetry -I../lib/telemetry -Ilib/argparse -I../lib/argparse -Ilib/mbuf -I../lib/mbuf -Ilib/mempool -I../lib/mempool -Ilib/ring -I../lib/ring -Ilib/rcu -I../lib/rcu -Idrivers/bus/vdev -I../drivers/bus/vdev -Ilib/net -I../lib/net -Ilib/security -I../lib/security -fdiagnostics-color=always -D_FILE_OFFSET_BITS=64 -Wall -Winvalid-pch -Wextra -Werror -std=c11 -O3 -include rte_config.h -Wvla -Wcast-qual -Wdeprecated -Wformat -Wformat-nonliteral -Wformat-security -Wmissing-declarations -Wmissing-prototypes -Wnested-externs -Wold-style-definition -Wpointer-arith -Wshadow -Wsign-compare -Wstrict-prototypes -Wundef -Wwrite-strings -Wno-packed-not-aligned -Wno-missing-field-initializers -D_GNU_SOURCE -fPIC -march=native -mrtm -DALLOW_EXPERIMENTAL_API -DALLOW_INTERNAL_API -Wno-format-truncation -Wno-address-of-packed-member -Wno-vla -DRTE_COMPONENT_CLASS=pmd_crypto -DRTE_COMPONENT_NAME=ipsec_mb -DRTE_LOG_DEFAULT_LOGTYPE=pmd.crypto.ipsec_mb -MD -MQ drivers/libtmp_rte_crypto_ipsec_mb.a.p/crypto_ipsec_mb_pmd_aesni_mb.c.o -MF drivers/libtmp_rte_crypto_ipsec_mb.a.p/crypto_ipsec_mb_pmd_aesni_mb.c.o.d -o drivers/libtmp_rte_crypto_ipsec_mb.a.p/crypto_ipsec_mb_pmd_aesni_mb.c.o -c ../drivers/crypto/ipsec_mb/pmd_aesni_mb.c
In file included from ../drivers/crypto/ipsec_mb/pmd_aesni_mb.c:7:
../drivers/crypto/ipsec_mb/pmd_aesni_mb_priv.h:1107:18: error: ‘IMB_AUTH_ZUC_EIA3’ undeclared here (not in a function)
 1107 |                 [IMB_AUTH_ZUC_EIA3]             = 16,
      |                  ^~~~~~~~~~~~~~~~~
../drivers/crypto/ipsec_mb/pmd_aesni_mb_priv.h:1107:18: error: array index in initializer not of integer type
../drivers/crypto/ipsec_mb/pmd_aesni_mb_priv.h:1107:18: note: (near initialization for ‘auth_blocksize’)
../drivers/crypto/ipsec_mb/pmd_aesni_mb_priv.h:1108:18: error: ‘IMB_AUTH_SNOW3G_UIA2’ undeclared here (not in a function); did you mean ‘IMB_AUTH_SNOW_V_AEAD’?
 1108 |                 [IMB_AUTH_SNOW3G_UIA2]  = 16,
      |                  ^~~~~~~~~~~~~~~~~~~~
      |                  IMB_AUTH_SNOW_V_AEAD
../drivers/crypto/ipsec_mb/pmd_aesni_mb_priv.h:1108:18: error: array index in initializer not of integer type
../drivers/crypto/ipsec_mb/pmd_aesni_mb_priv.h:1108:18: note: (near initialization for ‘auth_blocksize’)
../drivers/crypto/ipsec_mb/pmd_aesni_mb_priv.h:1153:18: error: array index in initializer not of integer type
 1153 |                 [IMB_AUTH_ZUC_EIA3]             = 4,
      |                  ^~~~~~~~~~~~~~~~~
../drivers/crypto/ipsec_mb/pmd_aesni_mb_priv.h:1153:18: note: (near initialization for ‘auth_truncated_digest_byte_lengths’)
../drivers/crypto/ipsec_mb/pmd_aesni_mb_priv.h:1154:18: error: array index in initializer not of integer type
 1154 |                 [IMB_AUTH_SNOW3G_UIA2]  = 4,
      |                  ^~~~~~~~~~~~~~~~~~~~
../drivers/crypto/ipsec_mb/pmd_aesni_mb_priv.h:1154:18: note: (near initialization for ‘auth_truncated_digest_byte_lengths’)
../drivers/crypto/ipsec_mb/pmd_aesni_mb_priv.h:5: error: unterminated #ifndef
    5 | #ifndef _PMD_AESNI_MB_PRIV_H_
      | 
../drivers/crypto/ipsec_mb/pmd_aesni_mb.c:298: error: unterminated #if
  298 | #if IMB_VERSION(1, 5, 0) <= IMB_VERSION_NUM
      | 
[2888/3888] Compiling C object drivers/libtmp_rte_crypto_ipsec_mb.a.p/crypto_ipsec_mb_ipsec_mb_private.c.o
[2889/3888] Compiling C object drivers/libtmp_rte_crypto_ipsec_mb.a.p/crypto_ipsec_mb_pmd_aesni_gcm.c.o
[2890/3888] Compiling C object drivers/libtmp_rte_crypto_mlx5.a.p/crypto_mlx5_mlx5_crypto_xts.c.o
[2891/3888] Compiling C object drivers/libtmp_rte_crypto_mlx5.a.p/crypto_mlx5_mlx5_crypto.c.o
[2892/3888] Compiling C object drivers/libtmp_rte_crypto_dpaa_sec.a.p/crypto_dpaa_sec_dpaa_sec.c.o
[2893/3888] Compiling C object drivers/libtmp_rte_crypto_dpaa2_sec.a.p/crypto_dpaa2_sec_dpaa2_sec_dpseci.c.o
[2894/3888] Compiling C object drivers/libtmp_rte_crypto_cnxk.a.p/crypto_cnxk_cn9k_cryptodev_ops.c.o
[2895/3888] Compiling C object drivers/libtmp_rte_crypto_cnxk.a.p/crypto_cnxk_cn20k_cryptodev_ops.c.o
[2896/3888] Compiling C object drivers/libtmp_rte_crypto_cnxk.a.p/crypto_cnxk_cn10k_cryptodev_ops.c.o
ninja: build stopped




*Build Failed #20:
OS: Fedora44-64
Target: x86_64-native-linuxapp-gcc
FAILED: drivers/libtmp_rte_crypto_ipsec_mb.a.p/crypto_ipsec_mb_pmd_aesni_mb.c.o 
gcc -Idrivers/libtmp_rte_crypto_ipsec_mb.a.p -Idrivers -I../drivers -Idrivers/crypto/ipsec_mb -I../drivers/crypto/ipsec_mb -Ilib/cryptodev -I../lib/cryptodev -Ilib/eal/common -I../lib/eal/common -I. -I.. -Iconfig -I../config -Ilib/eal/include -I../lib/eal/include -Ilib/eal/linux/include -I../lib/eal/linux/include -Ilib/eal/x86/include -I../lib/eal/x86/include -I../kernel/linux -Ilib/eal -I../lib/eal -Ilib/kvargs -I../lib/kvargs -Ilib/log -I../lib/log -Ilib/metrics -I../lib/metrics -Ilib/telemetry -I../lib/telemetry -Ilib/argparse -I../lib/argparse -Ilib/mbuf -I../lib/mbuf -Ilib/mempool -I../lib/mempool -Ilib/ring -I../lib/ring -Ilib/rcu -I../lib/rcu -Idrivers/bus/vdev -I../drivers/bus/vdev -Ilib/net -I../lib/net -Ilib/security -I../lib/security -fdiagnostics-color=always -D_FILE_OFFSET_BITS=64 -Wall -Winvalid-pch -Wextra -Werror -std=c11 -O3 -include rte_config.h -Wvla -Wcast-qual -Wdeprecated -Wformat -Wformat-nonliteral -Wformat-security -Wmissing-declarations -Wmissing-prototypes -Wnested-externs -Wold-style-definition -Wpointer-arith -Wshadow -Wsign-compare -Wstrict-prototypes -Wundef -Wwrite-strings -Wno-packed-not-aligned -Wno-missing-field-initializers -fzero-init-padding-bits=all -D_GNU_SOURCE -fPIC -march=native -mrtm -DALLOW_EXPERIMENTAL_API -DALLOW_INTERNAL_API -Wno-format-truncation -Wno-address-of-packed-member -Wno-vla -DRTE_COMPONENT_CLASS=pmd_crypto -DRTE_COMPONENT_NAME=ipsec_mb -DRTE_LOG_DEFAULT_LOGTYPE=pmd.crypto.ipsec_mb -MD -MQ drivers/libtmp_rte_crypto_ipsec_mb.a.p/crypto_ipsec_mb_pmd_aesni_mb.c.o -MF drivers/libtmp_rte_crypto_ipsec_mb.a.p/crypto_ipsec_mb_pmd_aesni_mb.c.o.d -o drivers/libtmp_rte_crypto_ipsec_mb.a.p/crypto_ipsec_mb_pmd_aesni_mb.c.o -c ../drivers/crypto/ipsec_mb/pmd_aesni_mb.c
In file included from ../drivers/crypto/ipsec_mb/pmd_aesni_mb.c:7:
../drivers/crypto/ipsec_mb/pmd_aesni_mb_priv.h:1107:18: error: ‘IMB_AUTH_ZUC_EIA3’ undeclared here (not in a function)
 1107 |                 [IMB_AUTH_ZUC_EIA3]             = 16,
      |                  ^~~~~~~~~~~~~~~~~
../drivers/crypto/ipsec_mb/pmd_aesni_mb_priv.h:1107:18: error: array index in initializer not of integer type
../drivers/crypto/ipsec_mb/pmd_aesni_mb_priv.h:1107:18: note: (near initialization for ‘auth_blocksize’)
../drivers/crypto/ipsec_mb/pmd_aesni_mb_priv.h:1108:18: error: ‘IMB_AUTH_SNOW3G_UIA2’ undeclared here (not in a function); did you mean ‘IMB_AUTH_SNOW_V_AEAD’?
 1108 |                 [IMB_AUTH_SNOW3G_UIA2]  = 16,
      |                  ^~~~~~~~~~~~~~~~~~~~
      |                  IMB_AUTH_SNOW_V_AEAD
../drivers/crypto/ipsec_mb/pmd_aesni_mb_priv.h:1108:18: error: array index in initializer not of integer type
../drivers/crypto/ipsec_mb/pmd_aesni_mb_priv.h:1108:18: note: (near initialization for ‘auth_blocksize’)
../drivers/crypto/ipsec_mb/pmd_aesni_mb_priv.h:1153:18: error: array index in initializer not of integer type
 1153 |                 [IMB_AUTH_ZUC_EIA3]             = 4,
      |                  ^~~~~~~~~~~~~~~~~
../drivers/crypto/ipsec_mb/pmd_aesni_mb_priv.h:1153:18: note: (near initialization for ‘auth_truncated_digest_byte_lengths’)
../drivers/crypto/ipsec_mb/pmd_aesni_mb_priv.h:1154:18: error: array index in initializer not of integer type
 1154 |                 [IMB_AUTH_SNOW3G_UIA2]  = 4,
      |                  ^~~~~~~~~~~~~~~~~~~~
../drivers/crypto/ipsec_mb/pmd_aesni_mb_priv.h:1154:18: note: (near initialization for ‘auth_truncated_digest_byte_lengths’)
../drivers/crypto/ipsec_mb/pmd_aesni_mb_priv.h:5: error: unterminated #ifndef
    5 | #ifndef _PMD_AESNI_MB_PRIV_H_
In file included from ../lib/eal/include/rte_lcore.h:17,
                 from ../lib/eal/include/generic/rte_spinlock.h:24,
                 from ../lib/eal/x86/include/rte_spinlock.h:8,
                 from ../lib/mempool/rte_mempool.h:44,
                 from ../lib/mbuf/rte_mbuf.h:39,
                 from ../lib/cryptodev/rte_crypto.h:15,
                 from ../lib/security/rte_security.h:19,
                 from ../drivers/crypto/ipsec_mb/pmd_aesni_mb_priv.h:8:
../lib/eal/include/rte_per_lcore.h:34:9: error: expected expression before ‘__thread’
   34 |         __thread type per_lcore_##name
      |         ^~~~~~~~
../drivers/crypto/ipsec_mb/pmd_aesni_mb.c:9:1: note: in expansion of macro ‘RTE_DEFINE_PER_LCORE’
    9 | RTE_DEFINE_PER_LCORE(pid_t, pid);
      | ^~~~~~~~~~~~~~~~~~~~
../drivers/crypto/ipsec_mb/pmd_aesni_mb.c:298: error: unterminated #if
  298 | #if IMB_VERSION(1, 5, 0) <= IMB_VERSION_NUM
[2694/3647] Compiling C object drivers/libtmp_rte_crypto_nitrox.a.p/crypto_nitrox_nitrox_sym_capabilities.c.o
[2695/3647] Compiling C object drivers/libtmp_rte_crypto_ipsec_mb.a.p/crypto_ipsec_mb_ipsec_mb_private.c.o
[2696/3647] Compiling C object drivers/libtmp_rte_crypto_nitrox.a.p/crypto_nitrox_nitrox_sym.c.o
[2697/3647] Compiling C object drivers/libtmp_rte_crypto_ipsec_mb.a.p/crypto_ipsec_mb_pmd_aesni_gcm.c.o
[2698/3647] Compiling C object drivers/libtmp_rte_crypto_dpaa_sec.a.p/crypto_dpaa_sec_dpaa_sec.c.o
[2699/3647] Compiling C object drivers/libtmp_rte_crypto_dpaa2_sec.a.p/crypto_dpaa2_sec_dpaa2_sec_dpseci.c.o
[2700/3647] Compiling C object drivers/libtmp_rte_crypto_cnxk.a.p/crypto_cnxk_cn9k_cryptodev_ops.c.o
[2701/3647] Compiling C object drivers/libtmp_rte_crypto_cnxk.a.p/crypto_cnxk_cn20k_cryptodev_ops.c.o
[2702/3647] Compiling C object drivers/libtmp_rte_crypto_cnxk.a.p/crypto_cnxk_cn10k_cryptodev_ops.c.o
ninja: build stopped




*Build Failed #21:
OS: Fedora44-64
Target: x86_64-native-linuxapp-clang
FAILED: drivers/libtmp_rte_crypto_ipsec_mb.a.p/crypto_ipsec_mb_pmd_aesni_mb.c.o 
clang -Idrivers/libtmp_rte_crypto_ipsec_mb.a.p -Idrivers -I../drivers -Idrivers/crypto/ipsec_mb -I../drivers/crypto/ipsec_mb -Ilib/cryptodev -I../lib/cryptodev -Ilib/eal/common -I../lib/eal/common -I. -I.. -Iconfig -I../config -Ilib/eal/include -I../lib/eal/include -Ilib/eal/linux/include -I../lib/eal/linux/include -Ilib/eal/x86/include -I../lib/eal/x86/include -I../kernel/linux -Ilib/eal -I../lib/eal -Ilib/kvargs -I../lib/kvargs -Ilib/log -I../lib/log -Ilib/metrics -I../lib/metrics -Ilib/telemetry -I../lib/telemetry -Ilib/argparse -I../lib/argparse -Ilib/mbuf -I../lib/mbuf -Ilib/mempool -I../lib/mempool -Ilib/ring -I../lib/ring -Ilib/rcu -I../lib/rcu -Idrivers/bus/vdev -I../drivers/bus/vdev -Ilib/net -I../lib/net -Ilib/security -I../lib/security -fdiagnostics-color=always -D_FILE_OFFSET_BITS=64 -Wall -Winvalid-pch -Wextra -Werror -std=c11 -O3 -include rte_config.h -Wvla -Wcast-qual -Wcomma -Wdeprecated -Wformat -Wformat-nonliteral -Wformat-security -Wmissing-declarations -Wmissing-prototypes -Wnested-externs -Wold-style-definition -Wpointer-arith -Wshadow -Wsign-compare -Wstrict-prototypes -Wundef -Wwrite-strings -Wno-missing-field-initializers -D_GNU_SOURCE -fPIC -march=native -mrtm -DALLOW_EXPERIMENTAL_API -DALLOW_INTERNAL_API -Wno-format-truncation -Wno-address-of-packed-member -Wno-vla -DRTE_COMPONENT_CLASS=pmd_crypto -DRTE_COMPONENT_NAME=ipsec_mb -DRTE_LOG_DEFAULT_LOGTYPE=pmd.crypto.ipsec_mb -DRTE_ANNOTATE_LOCKS -Wthread-safety -MD -MQ drivers/libtmp_rte_crypto_ipsec_mb.a.p/crypto_ipsec_mb_pmd_aesni_mb.c.o -MF drivers/libtmp_rte_crypto_ipsec_mb.a.p/crypto_ipsec_mb_pmd_aesni_mb.c.o.d -o drivers/libtmp_rte_crypto_ipsec_mb.a.p/crypto_ipsec_mb_pmd_aesni_mb.c.o -c ../drivers/crypto/ipsec_mb/pmd_aesni_mb.c
In file included from ../drivers/crypto/ipsec_mb/pmd_aesni_mb.c:7:
../drivers/crypto/ipsec_mb/pmd_aesni_mb_priv.h:1107:4: error: use of undeclared identifier 'IMB_AUTH_ZUC_EIA3'
 1107 |                 [IMB_AUTH_ZUC_EIA3]             = 16,
      |                  ^~~~~~~~~~~~~~~~~
../drivers/crypto/ipsec_mb/pmd_aesni_mb_priv.h:1153:4: error: use of undeclared identifier 'IMB_AUTH_ZUC_EIA3'
 1153 |                 [IMB_AUTH_ZUC_EIA3]             = 4,
      |                  ^~~~~~~~~~~~~~~~~
../drivers/crypto/ipsec_mb/pmd_aesni_mb_priv.h:5:2: error: unterminated conditional directive
    5 | #ifndef _PMD_AESNI_MB_PRIV_H_
      |  ^
../drivers/crypto/ipsec_mb/pmd_aesni_mb.c:9:1: error: expected expression
    9 | RTE_DEFINE_PER_LCORE(pid_t, pid);
      | ^
../lib/eal/include/rte_per_lcore.h:34:2: note: expanded from macro 'RTE_DEFINE_PER_LCORE'
   34 |         __thread type per_lcore_##name
      |         ^
../drivers/crypto/ipsec_mb/pmd_aesni_mb.c:298:2: error: unterminated conditional directive
  298 | #if IMB_VERSION(1, 5, 0) <= IMB_VERSION_NUM
      |  ^
../drivers/crypto/ipsec_mb/pmd_aesni_mb.c:2627:2: error: expected '}'
 2627 | }
      |  ^
../drivers/crypto/ipsec_mb/pmd_aesni_mb_priv.h:1183:56: note: to match this '{'
 1183 | static const unsigned int auth_digest_byte_lengths[] = {
      |                                                        ^
../drivers/crypto/ipsec_mb/pmd_aesni_mb.c:297:9: error: expected ';' after top level declarator
  297 |                 break;
      |                       ^
      |                       ;
7 errors generated.
[2696/3647] Generating drivers/rte_crypto_nitrox_map with a custom command
[2697/3647] Compiling C object drivers/libtmp_rte_crypto_ipsec_mb.a.p/crypto_ipsec_mb_pmd_aesni_gcm.c.o
[2698/3647] Compiling C object drivers/libtmp_rte_crypto_nitrox.a.p/crypto_nitrox_nitrox_sym.c.o
[2699/3647] Compiling C object drivers/libtmp_rte_crypto_nitrox.a.p/crypto_nitrox_nitrox_sym_reqmgr.c.o
[2700/3647] Compiling C object drivers/libtmp_rte_crypto_dpaa_sec.a.p/crypto_dpaa_sec_dpaa_sec.c.o
[2701/3647] Compiling C object drivers/libtmp_rte_crypto_cnxk.a.p/crypto_cnxk_cn9k_cryptodev_ops.c.o
[2702/3647] Compiling C object drivers/libtmp_rte_crypto_dpaa2_sec.a.p/crypto_dpaa2_sec_dpaa2_sec_dpseci.c.o
[2703/3647] Compiling C object drivers/libtmp_rte_crypto_cnxk.a.p/crypto_cnxk_cn20k_cryptodev_ops.c.o
[2704/3647] Compiling C object drivers/libtmp_rte_crypto_cnxk.a.p/crypto_cnxk_cn10k_cryptodev_ops.c.o
ninja: build stopped




*Build Failed #22:
OS: OpenEuler2404-64
Target: x86_64-native-linuxapp-gcc
FAILED: drivers/libtmp_rte_crypto_ipsec_mb.a.p/crypto_ipsec_mb_pmd_aesni_mb.c.o 
gcc -Idrivers/libtmp_rte_crypto_ipsec_mb.a.p -Idrivers -I../drivers -Idrivers/crypto/ipsec_mb -I../drivers/crypto/ipsec_mb -Ilib/cryptodev -I../lib/cryptodev -Ilib/eal/common -I../lib/eal/common -I. -I.. -Iconfig -I../config -Ilib/eal/include -I../lib/eal/include -Ilib/eal/linux/include -I../lib/eal/linux/include -Ilib/eal/x86/include -I../lib/eal/x86/include -I../kernel/linux -Ilib/eal -I../lib/eal -Ilib/kvargs -I../lib/kvargs -Ilib/log -I../lib/log -Ilib/metrics -I../lib/metrics -Ilib/telemetry -I../lib/telemetry -Ilib/argparse -I../lib/argparse -Ilib/mbuf -I../lib/mbuf -Ilib/mempool -I../lib/mempool -Ilib/ring -I../lib/ring -Ilib/rcu -I../lib/rcu -Idrivers/bus/vdev -I../drivers/bus/vdev -Ilib/net -I../lib/net -Ilib/security -I../lib/security -fdiagnostics-color=always -D_FILE_OFFSET_BITS=64 -Wall -Winvalid-pch -Wextra -Werror -std=c11 -O3 -include rte_config.h -Wvla -Wcast-qual -Wdeprecated -Wformat -Wformat-nonliteral -Wformat-security -Wmissing-declarations -Wmissing-prototypes -Wnested-externs -Wold-style-definition -Wpointer-arith -Wshadow -Wsign-compare -Wstrict-prototypes -Wundef -Wwrite-strings -Wno-packed-not-aligned -Wno-missing-field-initializers -D_GNU_SOURCE -fPIC -march=native -mrtm -DALLOW_EXPERIMENTAL_API -DALLOW_INTERNAL_API -Wno-format-truncation -Wno-address-of-packed-member -Wno-vla -DRTE_COMPONENT_CLASS=pmd_crypto -DRTE_COMPONENT_NAME=ipsec_mb -DRTE_LOG_DEFAULT_LOGTYPE=pmd.crypto.ipsec_mb -MD -MQ drivers/libtmp_rte_crypto_ipsec_mb.a.p/crypto_ipsec_mb_pmd_aesni_mb.c.o -MF drivers/libtmp_rte_crypto_ipsec_mb.a.p/crypto_ipsec_mb_pmd_aesni_mb.c.o.d -o drivers/libtmp_rte_crypto_ipsec_mb.a.p/crypto_ipsec_mb_pmd_aesni_mb.c.o -c ../drivers/crypto/ipsec_mb/pmd_aesni_mb.c
In file included from ../drivers/crypto/ipsec_mb/pmd_aesni_mb.c:7:
../drivers/crypto/ipsec_mb/pmd_aesni_mb_priv.h:1107:18: error: ‘IMB_AUTH_ZUC_EIA3’ undeclared here (not in a function)
 1107 |                 [IMB_AUTH_ZUC_EIA3]             = 16,
      |                  ^~~~~~~~~~~~~~~~~
../drivers/crypto/ipsec_mb/pmd_aesni_mb_priv.h:1107:18: error: array index in initializer not of integer type
../drivers/crypto/ipsec_mb/pmd_aesni_mb_priv.h:1107:18: note: (near initialization for ‘auth_blocksize’)
../drivers/crypto/ipsec_mb/pmd_aesni_mb_priv.h:1108:18: error: ‘IMB_AUTH_SNOW3G_UIA2’ undeclared here (not in a function); did you mean ‘IMB_AUTH_SNOW_V_AEAD’?
 1108 |                 [IMB_AUTH_SNOW3G_UIA2]  = 16,
      |                  ^~~~~~~~~~~~~~~~~~~~
      |                  IMB_AUTH_SNOW_V_AEAD
../drivers/crypto/ipsec_mb/pmd_aesni_mb_priv.h:1108:18: error: array index in initializer not of integer type
../drivers/crypto/ipsec_mb/pmd_aesni_mb_priv.h:1108:18: note: (near initialization for ‘auth_blocksize’)
../drivers/crypto/ipsec_mb/pmd_aesni_mb_priv.h:1153:18: error: array index in initializer not of integer type
 1153 |                 [IMB_AUTH_ZUC_EIA3]             = 4,
      |                  ^~~~~~~~~~~~~~~~~
../drivers/crypto/ipsec_mb/pmd_aesni_mb_priv.h:1153:18: note: (near initialization for ‘auth_truncated_digest_byte_lengths’)
../drivers/crypto/ipsec_mb/pmd_aesni_mb_priv.h:1154:18: error: array index in initializer not of integer type
 1154 |                 [IMB_AUTH_SNOW3G_UIA2]  = 4,
      |                  ^~~~~~~~~~~~~~~~~~~~
../drivers/crypto/ipsec_mb/pmd_aesni_mb_priv.h:1154:18: note: (near initialization for ‘auth_truncated_digest_byte_lengths’)
../drivers/crypto/ipsec_mb/pmd_aesni_mb_priv.h:5: error: unterminated #ifndef
    5 | #ifndef _PMD_AESNI_MB_PRIV_H_
      | 
In file included from ../lib/eal/include/rte_lcore.h:17,
                 from ../lib/eal/include/generic/rte_spinlock.h:24,
                 from ../lib/eal/x86/include/rte_spinlock.h:8,
                 from ../lib/mempool/rte_mempool.h:44,
                 from ../lib/mbuf/rte_mbuf.h:39,
                 from ../lib/cryptodev/rte_crypto.h:15,
                 from ../lib/security/rte_security.h:19,
                 from ../drivers/crypto/ipsec_mb/pmd_aesni_mb_priv.h:8:
../lib/eal/include/rte_per_lcore.h:34:9: error: expected expression before ‘__thread’
   34 |         __thread type per_lcore_##name
      |         ^~~~~~~~
../drivers/crypto/ipsec_mb/pmd_aesni_mb.c:9:1: note: in expansion of macro ‘RTE_DEFINE_PER_LCORE’
    9 | RTE_DEFINE_PER_LCORE(pid_t, pid);
      | ^~~~~~~~~~~~~~~~~~~~
../drivers/crypto/ipsec_mb/pmd_aesni_mb.c:298: error: unterminated #if
  298 | #if IMB_VERSION(1, 5, 0) <= IMB_VERSION_NUM
      | 
[2693/3647] Linking target drivers/librte_crypto_ionic.so.27.0
[2694/3647] Compiling C object drivers/libtmp_rte_crypto_ipsec_mb.a.p/crypto_ipsec_mb_ipsec_mb_private.c.o
[2695/3647] Compiling C object drivers/libtmp_rte_crypto_nitrox.a.p/crypto_nitrox_nitrox_sym_capabilities.c.o
[2696/3647] Compiling C object drivers/libtmp_rte_crypto_ipsec_mb.a.p/crypto_ipsec_mb_pmd_aesni_gcm.c.o
[2697/3647] Compiling C object drivers/libtmp_rte_crypto_dpaa_sec.a.p/crypto_dpaa_sec_dpaa_sec.c.o
[2698/3647] Compiling C object drivers/libtmp_rte_crypto_dpaa2_sec.a.p/crypto_dpaa2_sec_dpaa2_sec_dpseci.c.o
[2699/3647] Compiling C object drivers/libtmp_rte_crypto_cnxk.a.p/crypto_cnxk_cn9k_cryptodev_ops.c.o
[2700/3647] Compiling C object drivers/libtmp_rte_crypto_cnxk.a.p/crypto_cnxk_cn20k_cryptodev_ops.c.o
[2701/3647] Compiling C object drivers/libtmp_rte_crypto_cnxk.a.p/crypto_cnxk_cn10k_cryptodev_ops.c.o
ninja: build stopped


DPDK STV team


More information about the test-report mailing list