compilation|FAILURE| pw(170623) sid(39519) job(PER_PATCH_BUILD20468)net/bnxt: fix potential OOB string writes in debug helpers

sys_stv at intel.com sys_stv at intel.com
Wed Oct 7 17:54:55 CEST 2026


Test-Label: Intel-compilation
Test-Status: FAILURE
http://dpdk.org/patch/170623

_Compilation issues_

Submitter: Manish Kurup <manish.kurup at broadcom.com>
Date: 2026-10-05 23:50:53
Reply_mail: <20261005235053.27074-1-manish.kurup at broadcom.com>

DPDK git baseline: Repo:dpdk-next-net-brcm, CommitID: 17545b0ca61300042a59ab69ef3d2c392acee6be


Meson Build Summary: 23 Builds Done, 18 Successful, 5 Failures, 0 Blocked

+-------------------+------------+--------------+------------+------------+-----------+----------+------------+
| os                | gcc-static | clang-static | icc-static | gcc-shared | gcc-debug | document | gcc-16byte |
+-------------------+------------+--------------+------------+------------+-----------+----------+------------+
| OpenAnolis8.10-64 | pass       |              |            |            |           |          |            |
| FreeBSD15-64      | pass       | fail         |            | pass       | pass      |          |            |
| RHEL9.8-64        | pass       | fail         |            | pass       | pass      |          |            |
| SUSE16-64         | pass       | fail         |            |            |           |          |            |
| AzureLinux4.0-64  | pass       |              |            |            |           |          |            |
| UB2604-32         | pass       |              |            |            |           |          |            |
| RHEL10.2-64       | pass       |              |            |            |           |          |            |
| UB2604-64         | pass       | fail         |            |            |           | pass     | pass       |
| RHEL10.2-64RT     | pass       |              |            |            |           |          |            |
| UB2404-64         | pass       |              |            |            |           |          |            |
| Fedora44-64       | pass       | fail         |            |            |           |          |            |
| OpenEuler2404-64  | pass       |              |            |            |           |          |            |
+-------------------+------------+--------------+------------+------------+-----------+----------+------------+

Comments: 
Because of DPDK bug (https://bugs.dpdk.org/show_bug.cgi?id=928),
All the dpdk-next-* branch add `Ddisable_drivers=event/cnxk` option when build with ICC complier. 
 
Test environment and configuration as below:


OS: OpenAnolis8.10-64
	Kernel Version: 5.10.134-18.an8.x86_64
	GCC Version: gcc (GCC) 8.5.0 20210514 (Anolis 8.5.0-24.0.1)
	Clang Version: 18.1.8 (Red Hat 18.1.8-1.0.1.module+an8.9.0+11287+9d0292d3)
	x86_64-native-linuxapp-gcc

OS: FreeBSD15-64
	Kernel Version: 15.1-RELEASE-p3
	GCC Version: gcc (FreeBSD Ports Collection) 14.2.0
	Clang Version: 19.1.7 (https://github.com/llvm/llvm-project.git llvmorg-19.1.7-0-gcd708029e0b2)
	x86_64-native-bsdapp-gcc
	x86_64-native-bsdapp-clang
	x86_64-native-bsdapp-gcc+shared
	x86_64-native-bsdapp-gcc+debug

OS: RHEL9.8-64
	Kernel Version: 5.14.0-687.5.3.el9_8.x86_64
	GCC Version: gcc (GCC) 11.5.0 20240719 (Red Hat 11.5.0-14)
	Clang Version: 21.1.8 (Red Hat, Inc. 21.1.8-2.el9)
	x86_64-native-linuxapp-gcc
	x86_64-native-linuxapp-clang
	x86_64-native-linuxapp-gcc+shared
	x86_64-native-linuxapp-gcc+debug

OS: SUSE16-64
	Kernel Version: 6.12.0-160000.26-default
	GCC Version: gcc (SUSE Linux) 15.2.0
	Clang Version: 19.1.7
	x86_64-native-linuxapp-clang
	x86_64-native-linuxapp-gcc

OS: AzureLinux4.0-64
	Kernel Version: 6.18.31-1.3.azl4.x86_64
	GCC Version: gcc (GCC) 15.2.1 20260123 (Red Hat 15.2.1-7)
	Clang Version: 21.1.8 (Microsoft Corporation 21.1.8-8.azl4)
	x86_64-native-linuxapp-gcc

OS: UB2604-32
	Kernel Version: 7.0.0-31-generic
	GCC Version: gcc (Ubuntu 15.2.0-16ubuntu1) 15.2.0
	Clang Version: 21.1.8 (6ubuntu1)
	i686-native-linuxapp-gcc

OS: RHEL10.2-64
	Kernel Version: 6.12.0-211.7.3.el10_2.x86_64
	GCC Version: gcc (GCC) 14.3.1 20251022 (Red Hat 14.3.1-4)
	Clang Version: 21.1.8 (Red Hat, Inc. 21.1.8-1.el10)
	x86_64-native-linuxapp-gcc

OS: UB2604-64
	Kernel Version: 7.0.0-31-generic
	GCC Version: gcc (Ubuntu 15.2.0-16ubuntu1) 15.2.0
	Clang Version: 21.1.8 (6ubuntu1)
	x86_64-native-linuxapp-gcc+16byte
	x86_64-native-linuxapp-gcc
	x86_64-native-linuxapp-clang
	x86_64-native-linuxapp-doc

OS: RHEL10.2-64RT
	Kernel Version: 6.12.0-211.7.3.el10_2.x86_64+rt
	GCC Version: gcc (GCC) 14.3.1 20251022 (Red Hat 14.3.1-4)
	Clang Version: 21.1.8 (Red Hat, Inc. 21.1.8-1.el10)
	x86_64-native-linuxapp-gcc

OS: UB2404-64
	Kernel Version: 6.8.0-139-generic
	GCC Version: gcc (Ubuntu 13.3.0-6ubuntu2~24.04.1) 13.3.0
	Clang Version: 18.1.3 (1ubuntu1)
	x86_64-native-linuxapp-gcc

OS: Fedora44-64
	Kernel Version: 6.19.10-300.fc44.x86_64
	GCC Version: gcc (GCC) 16.0.1 20260321 (Red Hat 16.0.1-0)
	Clang Version: 22.1.8 (Fedora 22.1.8-4.fc44)
	x86_64-native-linuxapp-gcc
	x86_64-native-linuxapp-clang

OS: OpenEuler2404-64
	Kernel Version: 6.6.0-159.4.13.167.oe2403sp4.x86_64
	GCC Version: gcc (GCC) 12.3.1 (openEuler 12.3.1-110.oe2403sp4)
	Clang Version: 17.0.6 ( 17.0.6-67.oe2403sp4)
	x86_64-native-linuxapp-gcc



*Build Failed #1:
OS: FreeBSD15-64
Target: x86_64-native-bsdapp-clang
FAILED: [code=1] drivers/libtmp_rte_net_bnxt.a.p/net_bnxt_tf_core_v3_tfc_mpc_debug.c.o 
clang -Idrivers/libtmp_rte_net_bnxt.a.p -Idrivers -I../drivers -Idrivers/net/bnxt -I../drivers/net/bnxt -Idrivers/net/bnxt/tf_ulp -I../drivers/net/bnxt/tf_ulp -Idrivers/net/bnxt/tf_ulp/generic_templates -I../drivers/net/bnxt/tf_ulp/generic_templates -Idrivers/net/bnxt/tf_core -I../drivers/net/bnxt/tf_core -Idrivers/net/bnxt/tf_core/v3 -I../drivers/net/bnxt/tf_core/v3 -Idrivers/net/bnxt/hcapi/cfa -I../drivers/net/bnxt/hcapi/cfa -Idrivers/net/bnxt/hcapi/cfa_v3 -I../drivers/net/bnxt/hcapi/cfa_v3 -I../drivers/net/bnxt/hcapi/cfa_v3/include -I../drivers/net/bnxt/hcapi/cfa_v3/include/platform/dpdk -I../drivers/net/bnxt/hcapi/cfa_v3/bld/p70 -I../drivers/net/bnxt/hcapi/cfa_v3/bld/p70/host -I../drivers/net/bnxt/hcapi/cfa_v3/bld/include -I../drivers/net/bnxt/hcapi/cfa_v3/bld/include/host -I../drivers/net/bnxt/hcapi/cfa_v3/bld/include/p70 -I../drivers/net/bnxt/hcapi/cfa_v3/mm/include -I../drivers/net/bnxt/hcapi/cfa_v3/tim/include -I../drivers/net/bnxt/hcapi/cfa_v3/tpm/include -Ilib/ethdev -I../lib/ethdev -Ilib/eal/common -I../lib/eal/common -I. -I.. -Iconfig -I../config -Ilib/eal/include -I../lib/eal/include -Ilib/eal/freebsd/include -I../lib/eal/freebsd/include -Ilib/eal/x86/include -I../lib/eal/x86/include -Ilib/eal -I../lib/eal -Ilib/kvargs -I../lib/kvargs -Ilib/log -I../lib/log -Ilib/metrics -I../lib/metrics -Ilib/telemetry -I../lib/telemetry -Ilib/argparse -I../lib/argparse -Ilib/net -I../lib/net -Ilib/mbuf -I../lib/mbuf -Ilib/mempool -I../lib/mempool -Ilib/ring -I../lib/ring -Ilib/meter -I../lib/meter -Idrivers/bus/pci -I../drivers/bus/pci -I../drivers/bus/pci/bsd -Ilib/pci -I../lib/pci -Idrivers/bus/vdev -I../drivers/bus/vdev -Ilib/hash -I../lib/hash -Ilib/rcu -I../lib/rcu -fdiagnostics-color=always -D_FILE_OFFSET_BITS=64 -Wall -Winvalid-pch -Wextra -Werror -std=c11 -O3 -include rte_config.h -Wvla -Wcast-qual -Wcomma -Wdeprecated -Wformat -Wformat-nonliteral -Wformat-security -Wmissing-declarations -Wmissing-prototypes -Wnested-externs -Wold-style-definition -Wpointer-arith -Wshadow -Wsign-compare -Wstrict-prototypes -Wundef -Wwrite-strings -Wno-missing-field-initializers -D_GNU_SOURCE -D__BSD_VISIBLE -fPIC -march=native -mrtm -DALLOW_EXPERIMENTAL_API -DALLOW_INTERNAL_API -Wno-format-truncation -Wno-address-of-packed-member -Wno-vla -Wno-shadow -DBNXT_TF_APP_ID=0 -DSUPPORT_CFA_HW_P70=1 -DCFA_BLD_PRINT_OBJ=1 -DRTE_COMPONENT_CLASS=pmd_net -DRTE_COMPONENT_NAME=bnxt -DRTE_LOG_DEFAULT_LOGTYPE=pmd.net.bnxt -MD -MQ drivers/libtmp_rte_net_bnxt.a.p/net_bnxt_tf_core_v3_tfc_mpc_debug.c.o -MF drivers/libtmp_rte_net_bnxt.a.p/net_bnxt_tf_core_v3_tfc_mpc_debug.c.o.d -o drivers/libtmp_rte_net_bnxt.a.p/net_bnxt_tf_core_v3_tfc_mpc_debug.c.o -c ../drivers/net/bnxt/tf_core/v3/tfc_mpc_debug.c
../drivers/net/bnxt/tf_core/v3/tfc_mpc_debug.c:43:27: error: format string is not a string literal [-Werror,-Wformat-nonliteral]
   43 |         n = vsnprintf(buf, size, fmt, ap);
      |                                  ^~~
1 error generated.
[428/2267] Compiling C object drivers/libtmp_rte_net_bnxt.a.p/net_bnxt_tf_core_v3_tfc_tcam_debug.c.o
[429/2267] Compiling C object drivers/libtmp_rte_net_bnxt.a.p/net_bnxt_tf_core_v3_tfc_priv.c.o
[430/2267] Compiling C object drivers/libtmp_rte_net_bnxt.a.p/net_bnxt_tf_core_v3_tfc_resources.c.o
[431/2267] Compiling C object drivers/libtmp_rte_net_bnxt.a.p/net_bnxt_tf_core_v3_tfc_util.c.o
[432/2267] Compiling C object drivers/libtmp_rte_net_bnxt.a.p/net_bnxt_tf_core_v3_tfc_msg.c.o
[433/2267] Compiling C object drivers/libtmp_rte_net_bnxt.a.p/net_bnxt_tf_core_v3_tfc_session.c.o
[434/2267] Compiling C object drivers/libtmp_rte_net_bnxt.a.p/net_bnxt_tf_core_v3_tfc_tcam.c.o
[435/2267] Compiling C object drivers/libtmp_rte_net_bnxt.a.p/net_bnxt_tf_core_v3_tfc_tbl_scope.c.o
[436/2267] Compiling C object drivers/libtmp_rte_net_bnxt.a.p/net_bnxt_tf_core_v3_tfo.c.o
ninja: build stopped




*Build Failed #2:
OS: RHEL9.8-64
Target: x86_64-native-linuxapp-clang
FAILED: drivers/libtmp_rte_net_bnxt.a.p/net_bnxt_tf_core_v3_tfc_mpc_debug.c.o 
clang -Idrivers/libtmp_rte_net_bnxt.a.p -Idrivers -I../drivers -Idrivers/net/bnxt -I../drivers/net/bnxt -Idrivers/net/bnxt/tf_ulp -I../drivers/net/bnxt/tf_ulp -Idrivers/net/bnxt/tf_ulp/generic_templates -I../drivers/net/bnxt/tf_ulp/generic_templates -Idrivers/net/bnxt/tf_core -I../drivers/net/bnxt/tf_core -Idrivers/net/bnxt/tf_core/v3 -I../drivers/net/bnxt/tf_core/v3 -Idrivers/net/bnxt/hcapi/cfa -I../drivers/net/bnxt/hcapi/cfa -Idrivers/net/bnxt/hcapi/cfa_v3 -I../drivers/net/bnxt/hcapi/cfa_v3 -I../drivers/net/bnxt/hcapi/cfa_v3/include -I../drivers/net/bnxt/hcapi/cfa_v3/include/platform/dpdk -I../drivers/net/bnxt/hcapi/cfa_v3/bld/p70 -I../drivers/net/bnxt/hcapi/cfa_v3/bld/p70/host -I../drivers/net/bnxt/hcapi/cfa_v3/bld/include -I../drivers/net/bnxt/hcapi/cfa_v3/bld/include/host -I../drivers/net/bnxt/hcapi/cfa_v3/bld/include/p70 -I../drivers/net/bnxt/hcapi/cfa_v3/mm/include -I../drivers/net/bnxt/hcapi/cfa_v3/tim/include -I../drivers/net/bnxt/hcapi/cfa_v3/tpm/include -Ilib/ethdev -I../lib/ethdev -Ilib/eal/common -I../lib/eal/common -I. -I.. -Iconfig -I../config -Ilib/eal/include -I../lib/eal/include -Ilib/eal/linux/include -I../lib/eal/linux/include -Ilib/eal/x86/include -I../lib/eal/x86/include -I../kernel/linux -Ilib/eal -I../lib/eal -Ilib/kvargs -I../lib/kvargs -Ilib/log -I../lib/log -Ilib/metrics -I../lib/metrics -Ilib/telemetry -I../lib/telemetry -Ilib/argparse -I../lib/argparse -Ilib/net -I../lib/net -Ilib/mbuf -I../lib/mbuf -Ilib/mempool -I../lib/mempool -Ilib/ring -I../lib/ring -Ilib/meter -I../lib/meter -Idrivers/bus/pci -I../drivers/bus/pci -I../drivers/bus/pci/linux -Ilib/pci -I../lib/pci -Idrivers/bus/vdev -I../drivers/bus/vdev -Ilib/hash -I../lib/hash -Ilib/rcu -I../lib/rcu -fdiagnostics-color=always -D_FILE_OFFSET_BITS=64 -Wall -Winvalid-pch -Wextra -Werror -std=c11 -O3 -include rte_config.h -Wvla -Wcast-qual -Wcomma -Wdeprecated -Wformat -Wformat-nonliteral -Wformat-security -Wmissing-declarations -Wmissing-prototypes -Wnested-externs -Wold-style-definition -Wpointer-arith -Wshadow -Wsign-compare -Wstrict-prototypes -Wundef -Wwrite-strings -Wno-missing-field-initializers -D_GNU_SOURCE -fPIC -march=native -mrtm -DALLOW_EXPERIMENTAL_API -DALLOW_INTERNAL_API -Wno-format-truncation -Wno-address-of-packed-member -Wno-vla -Wno-shadow -DBNXT_TF_APP_ID=0 -DSUPPORT_CFA_HW_P70=1 -DCFA_BLD_PRINT_OBJ=1 -DRTE_COMPONENT_CLASS=pmd_net -DRTE_COMPONENT_NAME=bnxt -DRTE_LOG_DEFAULT_LOGTYPE=pmd.net.bnxt -MD -MQ drivers/libtmp_rte_net_bnxt.a.p/net_bnxt_tf_core_v3_tfc_mpc_debug.c.o -MF drivers/libtmp_rte_net_bnxt.a.p/net_bnxt_tf_core_v3_tfc_mpc_debug.c.o.d -o drivers/libtmp_rte_net_bnxt.a.p/net_bnxt_tf_core_v3_tfc_mpc_debug.c.o -c ../drivers/net/bnxt/tf_core/v3/tfc_mpc_debug.c
../drivers/net/bnxt/tf_core/v3/tfc_mpc_debug.c:43:27: error: format string is not a string literal [-Werror,-Wformat-nonliteral]
   43 |         n = vsnprintf(buf, size, fmt, ap);
      |                                  ^~~
1 error generated.
[1371/3647] Compiling C object drivers/libtmp_rte_net_bnxt.a.p/net_bnxt_hcapi_cfa_hcapi_cfa_p4.c.o
[1372/3647] Compiling C object drivers/libtmp_rte_net_bnxt.a.p/net_bnxt_tf_core_v3_tfc_tcam.c.o
[1373/3647] Compiling C object drivers/libtmp_rte_net_bnxt.a.p/net_bnxt_hcapi_cfa_hcapi_cfa_p58.c.o
[1374/3647] Compiling C object drivers/libtmp_rte_net_bnxt.a.p/net_bnxt_tf_core_v3_tfo.c.o
[1375/3647] Compiling C object drivers/libtmp_rte_net_bnxt.a.p/net_bnxt_tf_core_v3_tfc_resources.c.o
[1376/3647] Compiling C object drivers/libtmp_rte_net_bnxt.a.p/net_bnxt_tf_core_v3_tfc_util.c.o
[1377/3647] Compiling C object drivers/libtmp_rte_net_bnxt.a.p/net_bnxt_tf_core_v3_tfc_tbl_scope.c.o
[1378/3647] Compiling C object drivers/libtmp_rte_net_bnxt.a.p/net_bnxt_tf_core_v3_tfc_hot_upgrade.c.o
[1379/3647] Compiling C object drivers/libtmp_rte_net_bnxt.a.p/net_bnxt_tf_core_v3_tfc_vf2pf_msg.c.o
ninja: build stopped




*Build Failed #3:
OS: SUSE16-64
Target: x86_64-native-linuxapp-clang
FAILED: drivers/libtmp_rte_net_bnxt.a.p/net_bnxt_tf_core_v3_tfc_mpc_debug.c.o 
clang -Idrivers/libtmp_rte_net_bnxt.a.p -Idrivers -I../drivers -Idrivers/net/bnxt -I../drivers/net/bnxt -Idrivers/net/bnxt/tf_ulp -I../drivers/net/bnxt/tf_ulp -Idrivers/net/bnxt/tf_ulp/generic_templates -I../drivers/net/bnxt/tf_ulp/generic_templates -Idrivers/net/bnxt/tf_core -I../drivers/net/bnxt/tf_core -Idrivers/net/bnxt/tf_core/v3 -I../drivers/net/bnxt/tf_core/v3 -Idrivers/net/bnxt/hcapi/cfa -I../drivers/net/bnxt/hcapi/cfa -Idrivers/net/bnxt/hcapi/cfa_v3 -I../drivers/net/bnxt/hcapi/cfa_v3 -I../drivers/net/bnxt/hcapi/cfa_v3/include -I../drivers/net/bnxt/hcapi/cfa_v3/include/platform/dpdk -I../drivers/net/bnxt/hcapi/cfa_v3/bld/p70 -I../drivers/net/bnxt/hcapi/cfa_v3/bld/p70/host -I../drivers/net/bnxt/hcapi/cfa_v3/bld/include -I../drivers/net/bnxt/hcapi/cfa_v3/bld/include/host -I../drivers/net/bnxt/hcapi/cfa_v3/bld/include/p70 -I../drivers/net/bnxt/hcapi/cfa_v3/mm/include -I../drivers/net/bnxt/hcapi/cfa_v3/tim/include -I../drivers/net/bnxt/hcapi/cfa_v3/tpm/include -Ilib/ethdev -I../lib/ethdev -Ilib/eal/common -I../lib/eal/common -I. -I.. -Iconfig -I../config -Ilib/eal/include -I../lib/eal/include -Ilib/eal/linux/include -I../lib/eal/linux/include -Ilib/eal/x86/include -I../lib/eal/x86/include -I../kernel/linux -Ilib/eal -I../lib/eal -Ilib/kvargs -I../lib/kvargs -Ilib/log -I../lib/log -Ilib/metrics -I../lib/metrics -Ilib/telemetry -I../lib/telemetry -Ilib/argparse -I../lib/argparse -Ilib/net -I../lib/net -Ilib/mbuf -I../lib/mbuf -Ilib/mempool -I../lib/mempool -Ilib/ring -I../lib/ring -Ilib/meter -I../lib/meter -Idrivers/bus/pci -I../drivers/bus/pci -I../drivers/bus/pci/linux -Ilib/pci -I../lib/pci -Idrivers/bus/vdev -I../drivers/bus/vdev -Ilib/hash -I../lib/hash -Ilib/rcu -I../lib/rcu -fdiagnostics-color=always -D_FILE_OFFSET_BITS=64 -Wall -Winvalid-pch -Wextra -Werror -std=c11 -O3 -include rte_config.h -Wvla -Wcast-qual -Wcomma -Wdeprecated -Wformat -Wformat-nonliteral -Wformat-security -Wmissing-declarations -Wmissing-prototypes -Wnested-externs -Wold-style-definition -Wpointer-arith -Wshadow -Wsign-compare -Wstrict-prototypes -Wundef -Wwrite-strings -Wno-missing-field-initializers -D_GNU_SOURCE -fPIC -march=native -mrtm -DALLOW_EXPERIMENTAL_API -DALLOW_INTERNAL_API -Wno-format-truncation -Wno-address-of-packed-member -Wno-vla -Wno-shadow -DBNXT_TF_APP_ID=0 -DSUPPORT_CFA_HW_P70=1 -DCFA_BLD_PRINT_OBJ=1 -DRTE_COMPONENT_CLASS=pmd_net -DRTE_COMPONENT_NAME=bnxt -DRTE_LOG_DEFAULT_LOGTYPE=pmd.net.bnxt -MD -MQ drivers/libtmp_rte_net_bnxt.a.p/net_bnxt_tf_core_v3_tfc_mpc_debug.c.o -MF drivers/libtmp_rte_net_bnxt.a.p/net_bnxt_tf_core_v3_tfc_mpc_debug.c.o.d -o drivers/libtmp_rte_net_bnxt.a.p/net_bnxt_tf_core_v3_tfc_mpc_debug.c.o -c ../drivers/net/bnxt/tf_core/v3/tfc_mpc_debug.c
../drivers/net/bnxt/tf_core/v3/tfc_mpc_debug.c:43:27: error: format string is not a string literal [-Werror,-Wformat-nonliteral]
   43 |         n = vsnprintf(buf, size, fmt, ap);
      |                                  ^~~
1 error generated.
[1368/3629] Compiling C object drivers/libtmp_rte_net_bnxt.a.p/net_bnxt_tf_core_v3_tfc_priv.c.o
[1369/3629] Compiling C object drivers/libtmp_rte_net_bnxt.a.p/net_bnxt_tf_core_v3_tfo.c.o
[1370/3629] Compiling C object drivers/libtmp_rte_net_bnxt.a.p/net_bnxt_tf_core_v3_tfc_resources.c.o
[1371/3629] Compiling C object drivers/libtmp_rte_net_bnxt.a.p/net_bnxt_tf_core_v3_tfc_session.c.o
[1372/3629] Compiling C object drivers/libtmp_rte_net_bnxt.a.p/net_bnxt_tf_core_v3_tfc_util.c.o
[1373/3629] Compiling C object drivers/libtmp_rte_net_bnxt.a.p/net_bnxt_tf_core_v3_tfc_tcam_debug.c.o
[1374/3629] Compiling C object drivers/libtmp_rte_net_bnxt.a.p/net_bnxt_tf_core_v3_tfc_tcam.c.o
[1375/3629] Compiling C object drivers/libtmp_rte_net_bnxt.a.p/net_bnxt_tf_core_v3_tfc_tbl_scope.c.o
[1376/3629] Compiling C object drivers/libtmp_rte_net_bnxt.a.p/net_bnxt_tf_core_v3_tfc_vf2pf_msg.c.o
ninja: build stopped




*Build Failed #4:
OS: UB2604-64
Target: x86_64-native-linuxapp-clang
FAILED: drivers/libtmp_rte_net_bnxt.a.p/net_bnxt_tf_core_v3_tfc_mpc_debug.c.o 
clang -Idrivers/libtmp_rte_net_bnxt.a.p -Idrivers -I../drivers -Idrivers/net/bnxt -I../drivers/net/bnxt -Idrivers/net/bnxt/tf_ulp -I../drivers/net/bnxt/tf_ulp -Idrivers/net/bnxt/tf_ulp/generic_templates -I../drivers/net/bnxt/tf_ulp/generic_templates -Idrivers/net/bnxt/tf_core -I../drivers/net/bnxt/tf_core -Idrivers/net/bnxt/tf_core/v3 -I../drivers/net/bnxt/tf_core/v3 -Idrivers/net/bnxt/hcapi/cfa -I../drivers/net/bnxt/hcapi/cfa -Idrivers/net/bnxt/hcapi/cfa_v3 -I../drivers/net/bnxt/hcapi/cfa_v3 -I../drivers/net/bnxt/hcapi/cfa_v3/include -I../drivers/net/bnxt/hcapi/cfa_v3/include/platform/dpdk -I../drivers/net/bnxt/hcapi/cfa_v3/bld/p70 -I../drivers/net/bnxt/hcapi/cfa_v3/bld/p70/host -I../drivers/net/bnxt/hcapi/cfa_v3/bld/include -I../drivers/net/bnxt/hcapi/cfa_v3/bld/include/host -I../drivers/net/bnxt/hcapi/cfa_v3/bld/include/p70 -I../drivers/net/bnxt/hcapi/cfa_v3/mm/include -I../drivers/net/bnxt/hcapi/cfa_v3/tim/include -I../drivers/net/bnxt/hcapi/cfa_v3/tpm/include -Ilib/ethdev -I../lib/ethdev -Ilib/eal/common -I../lib/eal/common -I. -I.. -Iconfig -I../config -Ilib/eal/include -I../lib/eal/include -Ilib/eal/linux/include -I../lib/eal/linux/include -Ilib/eal/x86/include -I../lib/eal/x86/include -I../kernel/linux -Ilib/eal -I../lib/eal -Ilib/kvargs -I../lib/kvargs -Ilib/log -I../lib/log -Ilib/metrics -I../lib/metrics -Ilib/telemetry -I../lib/telemetry -Ilib/argparse -I../lib/argparse -Ilib/net -I../lib/net -Ilib/mbuf -I../lib/mbuf -Ilib/mempool -I../lib/mempool -Ilib/ring -I../lib/ring -Ilib/meter -I../lib/meter -Idrivers/bus/pci -I../drivers/bus/pci -I../drivers/bus/pci/linux -Ilib/pci -I../lib/pci -Idrivers/bus/vdev -I../drivers/bus/vdev -Ilib/hash -I../lib/hash -Ilib/rcu -I../lib/rcu -fdiagnostics-color=always -D_FILE_OFFSET_BITS=64 -Wall -Winvalid-pch -Wextra -Werror -std=c11 -O3 -include rte_config.h -Wvla -Wcast-qual -Wcomma -Wdeprecated -Wformat -Wformat-nonliteral -Wformat-security -Wmissing-declarations -Wmissing-prototypes -Wnested-externs -Wold-style-definition -Wpointer-arith -Wshadow -Wsign-compare -Wstrict-prototypes -Wundef -Wwrite-strings -Wno-missing-field-initializers -D_GNU_SOURCE -fPIC -march=native -mrtm -DALLOW_EXPERIMENTAL_API -DALLOW_INTERNAL_API -Wno-format-truncation -Wno-address-of-packed-member -Wno-vla -Wno-shadow -DBNXT_TF_APP_ID=0 -DSUPPORT_CFA_HW_P70=1 -DCFA_BLD_PRINT_OBJ=1 -DRTE_COMPONENT_CLASS=pmd_net -DRTE_COMPONENT_NAME=bnxt -DRTE_LOG_DEFAULT_LOGTYPE=pmd.net.bnxt -MD -MQ drivers/libtmp_rte_net_bnxt.a.p/net_bnxt_tf_core_v3_tfc_mpc_debug.c.o -MF drivers/libtmp_rte_net_bnxt.a.p/net_bnxt_tf_core_v3_tfc_mpc_debug.c.o.d -o drivers/libtmp_rte_net_bnxt.a.p/net_bnxt_tf_core_v3_tfc_mpc_debug.c.o -c ../drivers/net/bnxt/tf_core/v3/tfc_mpc_debug.c
../drivers/net/bnxt/tf_core/v3/tfc_mpc_debug.c:43:27: error: format string is not a string literal [-Werror,-Wformat-nonliteral]
   43 |         n = vsnprintf(buf, size, fmt, ap);
      |                                  ^~~
1 error generated.
[1400/3889] Compiling C object drivers/libtmp_rte_net_bnxt.a.p/net_bnxt_hcapi_cfa_v3_mm_cfa_mm.c.o
[1401/3889] Compiling C object drivers/libtmp_rte_net_bnxt.a.p/net_bnxt_hcapi_cfa_v3_tim_cfa_tim.c.o
[1402/3889] Compiling C object drivers/libtmp_rte_net_bnxt.a.p/net_bnxt_hcapi_cfa_v3_tpm_cfa_tpm.c.o
[1403/3889] Compiling C object drivers/libtmp_rte_net_bnxt.a.p/net_bnxt_hcapi_cfa_v3_bld_p70_host_cfa_bld_p70_host_mpc_wrapper.c.o
[1404/3889] Compiling C object drivers/libtmp_rte_net_bnxt.a.p/net_bnxt_tf_core_v3_tfc_tbl_scope.c.o
[1405/3889] Compiling C object drivers/libtmp_rte_net_bnxt.a.p/net_bnxt_tf_core_v3_tfc_vf2pf_msg.c.o
[1406/3889] Compiling C object drivers/libtmp_rte_net_bnxt.a.p/net_bnxt_tf_core_v3_tfc_hot_upgrade.c.o
[1407/3889] Generating drivers/rte_net_bnxt_map with a custom command
[1408/3889] Compiling C object drivers/libtmp_rte_net_bnxt.a.p/net_bnxt_bnxt_rxtx_vec_sse.c.o
ninja: build stopped




*Build Failed #5:
OS: Fedora44-64
Target: x86_64-native-linuxapp-clang
FAILED: drivers/libtmp_rte_net_bnxt.a.p/net_bnxt_tf_core_v3_tfc_mpc_debug.c.o 
clang -Idrivers/libtmp_rte_net_bnxt.a.p -Idrivers -I../drivers -Idrivers/net/bnxt -I../drivers/net/bnxt -Idrivers/net/bnxt/tf_ulp -I../drivers/net/bnxt/tf_ulp -Idrivers/net/bnxt/tf_ulp/generic_templates -I../drivers/net/bnxt/tf_ulp/generic_templates -Idrivers/net/bnxt/tf_core -I../drivers/net/bnxt/tf_core -Idrivers/net/bnxt/tf_core/v3 -I../drivers/net/bnxt/tf_core/v3 -Idrivers/net/bnxt/hcapi/cfa -I../drivers/net/bnxt/hcapi/cfa -Idrivers/net/bnxt/hcapi/cfa_v3 -I../drivers/net/bnxt/hcapi/cfa_v3 -I../drivers/net/bnxt/hcapi/cfa_v3/include -I../drivers/net/bnxt/hcapi/cfa_v3/include/platform/dpdk -I../drivers/net/bnxt/hcapi/cfa_v3/bld/p70 -I../drivers/net/bnxt/hcapi/cfa_v3/bld/p70/host -I../drivers/net/bnxt/hcapi/cfa_v3/bld/include -I../drivers/net/bnxt/hcapi/cfa_v3/bld/include/host -I../drivers/net/bnxt/hcapi/cfa_v3/bld/include/p70 -I../drivers/net/bnxt/hcapi/cfa_v3/mm/include -I../drivers/net/bnxt/hcapi/cfa_v3/tim/include -I../drivers/net/bnxt/hcapi/cfa_v3/tpm/include -Ilib/ethdev -I../lib/ethdev -Ilib/eal/common -I../lib/eal/common -I. -I.. -Iconfig -I../config -Ilib/eal/include -I../lib/eal/include -Ilib/eal/linux/include -I../lib/eal/linux/include -Ilib/eal/x86/include -I../lib/eal/x86/include -I../kernel/linux -Ilib/eal -I../lib/eal -Ilib/kvargs -I../lib/kvargs -Ilib/log -I../lib/log -Ilib/metrics -I../lib/metrics -Ilib/telemetry -I../lib/telemetry -Ilib/argparse -I../lib/argparse -Ilib/net -I../lib/net -Ilib/mbuf -I../lib/mbuf -Ilib/mempool -I../lib/mempool -Ilib/ring -I../lib/ring -Ilib/meter -I../lib/meter -Idrivers/bus/pci -I../drivers/bus/pci -I../drivers/bus/pci/linux -Ilib/pci -I../lib/pci -Idrivers/bus/vdev -I../drivers/bus/vdev -Ilib/hash -I../lib/hash -Ilib/rcu -I../lib/rcu -fdiagnostics-color=always -D_FILE_OFFSET_BITS=64 -Wall -Winvalid-pch -Wextra -Werror -std=c11 -O3 -include rte_config.h -Wvla -Wcast-qual -Wcomma -Wdeprecated -Wformat -Wformat-nonliteral -Wformat-security -Wmissing-declarations -Wmissing-prototypes -Wnested-externs -Wold-style-definition -Wpointer-arith -Wshadow -Wsign-compare -Wstrict-prototypes -Wundef -Wwrite-strings -Wno-missing-field-initializers -D_GNU_SOURCE -fPIC -march=native -mrtm -DALLOW_EXPERIMENTAL_API -DALLOW_INTERNAL_API -Wno-format-truncation -Wno-address-of-packed-member -Wno-vla -Wno-shadow -DBNXT_TF_APP_ID=0 -DSUPPORT_CFA_HW_P70=1 -DCFA_BLD_PRINT_OBJ=1 -DRTE_COMPONENT_CLASS=pmd_net -DRTE_COMPONENT_NAME=bnxt -DRTE_LOG_DEFAULT_LOGTYPE=pmd.net.bnxt -MD -MQ drivers/libtmp_rte_net_bnxt.a.p/net_bnxt_tf_core_v3_tfc_mpc_debug.c.o -MF drivers/libtmp_rte_net_bnxt.a.p/net_bnxt_tf_core_v3_tfc_mpc_debug.c.o.d -o drivers/libtmp_rte_net_bnxt.a.p/net_bnxt_tf_core_v3_tfc_mpc_debug.c.o -c ../drivers/net/bnxt/tf_core/v3/tfc_mpc_debug.c
../drivers/net/bnxt/tf_core/v3/tfc_mpc_debug.c:43:34: error: diagnostic behavior may be improved by adding the 'format(printf, 3, 4)' attribute to the declaration of 'tfc_str_append' [-Werror,-Wmissing-format-attribute]
   43 |         n = vsnprintf(buf, size, fmt, ap);
      |                                         ^
../drivers/net/bnxt/tf_core/v3/tfc_debug.h:21:8: note: 'tfc_str_append' declared here
   21 | size_t tfc_str_append(char *buf, size_t size, const char *fmt, ...);
      |        ^
1 error generated.
[1370/3647] Compiling C object drivers/libtmp_rte_net_bnxt.a.p/net_bnxt_hcapi_cfa_hcapi_cfa_p4.c.o
[1371/3647] Compiling C object drivers/libtmp_rte_net_bnxt.a.p/net_bnxt_hcapi_cfa_hcapi_cfa_p58.c.o
[1372/3647] Compiling C object drivers/libtmp_rte_net_bnxt.a.p/net_bnxt_tf_core_v3_tfo.c.o
[1373/3647] Compiling C object drivers/libtmp_rte_net_bnxt.a.p/net_bnxt_tf_core_v3_tfc_resources.c.o
[1374/3647] Compiling C object drivers/libtmp_rte_net_bnxt.a.p/net_bnxt_tf_core_v3_tfc_util.c.o
[1375/3647] Compiling C object drivers/libtmp_rte_net_bnxt.a.p/net_bnxt_tf_core_v3_tfc_hot_upgrade.c.o
[1376/3647] Compiling C object drivers/libtmp_rte_net_bnxt.a.p/net_bnxt_tf_core_v3_tfc_vf2pf_msg.c.o
[1377/3647] Compiling C object drivers/libtmp_rte_net_bnxt.a.p/net_bnxt_tf_core_v3_tfc_tcam.c.o
[1378/3647] Compiling C object drivers/libtmp_rte_net_bnxt.a.p/net_bnxt_tf_core_v3_tfc_tbl_scope.c.o
ninja: build stopped


DPDK STV team


More information about the test-report mailing list