compilation|FAILURE| pw(170851) sid(39550) job(PER_PATCH_BUILD20489)app/testpmd: add command to decode module EEPROM
sys_stv at intel.com
sys_stv at intel.com
Thu Oct 8 10:19:59 CEST 2026
Test-Label: Intel-compilation
Test-Status: FAILURE
http://dpdk.org/patch/170851
_Compilation issues_
Submitter: Roman Khromenok <roma55592 at yandex.ru>
Date: 2026-10-08 08:02:03
Reply_mail: <20261008080203.144487-1-roma55592 at yandex.ru>
DPDK git baseline: Repo:dpdk-next-net, CommitID: 3c09706d51ad64d1011244991a86cc7982612159
Meson Build Summary: 23 Builds Done, 0 Successful, 23 Failures, 0 Blocked
+-------------------+------------+--------------+------------+------------+-----------+----------+------------+
| os | gcc-static | clang-static | icc-static | gcc-shared | gcc-debug | document | gcc-16byte |
+-------------------+------------+--------------+------------+------------+-----------+----------+------------+
| OpenAnolis8.10-64 | fail | | | | | | |
| FreeBSD15-64 | fail | fail | | fail | fail | | |
| RHEL9.8-64 | fail | fail | | fail | fail | | |
| SUSE16-64 | fail | fail | | | | | |
| AzureLinux4.0-64 | fail | | | | | | |
| UB2604-32 | fail | | | | | | |
| RHEL10.2-64 | fail | | | | | | |
| UB2604-64 | fail | fail | | | | fail | fail |
| RHEL10.2-64RT | fail | | | | | | |
| UB2404-64 | fail | | | | | | |
| Fedora44-64 | fail | fail | | | | | |
| OpenEuler2404-64 | fail | | | | | | |
+-------------------+------------+--------------+------------+------------+-----------+----------+------------+
Comments:
Because of DPDK bug (https://bugs.dpdk.org/show_bug.cgi?id=928),
All the dpdk-next-* branch add `Ddisable_drivers=event/cnxk` option when build with ICC complier.
Test environment and configuration as below:
OS: OpenAnolis8.10-64
Kernel Version: 5.10.134-18.an8.x86_64
GCC Version: gcc (GCC) 8.5.0 20210514 (Anolis 8.5.0-24.0.1)
Clang Version: 18.1.8 (Red Hat 18.1.8-1.0.1.module+an8.9.0+11287+9d0292d3)
x86_64-native-linuxapp-gcc
OS: FreeBSD15-64
Kernel Version: 15.1-RELEASE-p3
GCC Version: gcc (FreeBSD Ports Collection) 14.2.0
Clang Version: 19.1.7 (https://github.com/llvm/llvm-project.git llvmorg-19.1.7-0-gcd708029e0b2)
x86_64-native-bsdapp-gcc
x86_64-native-bsdapp-clang
x86_64-native-bsdapp-gcc+shared
x86_64-native-bsdapp-gcc+debug
OS: RHEL9.8-64
Kernel Version: 5.14.0-687.5.3.el9_8.x86_64
GCC Version: gcc (GCC) 11.5.0 20240719 (Red Hat 11.5.0-14)
Clang Version: 21.1.8 (Red Hat, Inc. 21.1.8-2.el9)
x86_64-native-linuxapp-gcc
x86_64-native-linuxapp-clang
x86_64-native-linuxapp-gcc+shared
x86_64-native-linuxapp-gcc+debug
OS: SUSE16-64
Kernel Version: 6.12.0-160000.26-default
GCC Version: gcc (SUSE Linux) 15.2.0
Clang Version: 19.1.7
x86_64-native-linuxapp-clang
x86_64-native-linuxapp-gcc
OS: AzureLinux4.0-64
Kernel Version: 6.18.31-1.3.azl4.x86_64
GCC Version: gcc (GCC) 15.2.1 20260123 (Red Hat 15.2.1-7)
Clang Version: 21.1.8 (Microsoft Corporation 21.1.8-8.azl4)
x86_64-native-linuxapp-gcc
OS: UB2604-32
Kernel Version: 7.0.0-31-generic
GCC Version: gcc (Ubuntu 15.2.0-16ubuntu1) 15.2.0
Clang Version: 21.1.8 (6ubuntu1)
i686-native-linuxapp-gcc
OS: RHEL10.2-64
Kernel Version: 6.12.0-211.7.3.el10_2.x86_64
GCC Version: gcc (GCC) 14.3.1 20251022 (Red Hat 14.3.1-4)
Clang Version: 21.1.8 (Red Hat, Inc. 21.1.8-1.el10)
x86_64-native-linuxapp-gcc
OS: UB2604-64
Kernel Version: 7.0.0-31-generic
GCC Version: gcc (Ubuntu 15.2.0-16ubuntu1) 15.2.0
Clang Version: 21.1.8 (6ubuntu1)
x86_64-native-linuxapp-gcc+16byte
x86_64-native-linuxapp-gcc
x86_64-native-linuxapp-clang
x86_64-native-linuxapp-doc
OS: RHEL10.2-64RT
Kernel Version: 6.12.0-211.7.3.el10_2.x86_64+rt
GCC Version: gcc (GCC) 14.3.1 20251022 (Red Hat 14.3.1-4)
Clang Version: 21.1.8 (Red Hat, Inc. 21.1.8-1.el10)
x86_64-native-linuxapp-gcc
OS: UB2404-64
Kernel Version: 6.8.0-139-generic
GCC Version: gcc (Ubuntu 13.3.0-6ubuntu2~24.04.1) 13.3.0
Clang Version: 18.1.3 (1ubuntu1)
x86_64-native-linuxapp-gcc
OS: Fedora44-64
Kernel Version: 6.19.10-300.fc44.x86_64
GCC Version: gcc (GCC) 16.0.1 20260321 (Red Hat 16.0.1-0)
Clang Version: 22.1.8 (Fedora 22.1.8-4.fc44)
x86_64-native-linuxapp-gcc
x86_64-native-linuxapp-clang
OS: OpenEuler2404-64
Kernel Version: 6.6.0-159.4.13.167.oe2403sp4.x86_64
GCC Version: gcc (GCC) 12.3.1 (openEuler 12.3.1-110.oe2403sp4)
Clang Version: 17.0.6 ( 17.0.6-67.oe2403sp4)
x86_64-native-linuxapp-gcc
*Build Failed #1:
OS: OpenAnolis8.10-64
Target: x86_64-native-linuxapp-gcc
FAILED: app/dpdk-testpmd.p/test-pmd_config.c.o
gcc -Iapp/dpdk-testpmd.p -Iapp -I../app -Iapp/test-pmd -I../app/test-pmd -Ilib/ethdev -I../lib/ethdev -Ilib/eal/common -I../lib/eal/common -I. -I.. -Iconfig -I../config -Ilib/eal/include -I../lib/eal/include -Ilib/eal/linux/include -I../lib/eal/linux/include -Ilib/eal/x86/include -I../lib/eal/x86/include -I../kernel/linux -Ilib/eal -I../lib/eal -Ilib/kvargs -I../lib/kvargs -Ilib/log -I../lib/log -Ilib/metrics -I../lib/metrics -Ilib/telemetry -I../lib/telemetry -Ilib/argparse -I../lib/argparse -Ilib/net -I../lib/net -Ilib/mbuf -I../lib/mbuf -Ilib/mempool -I../lib/mempool -Ilib/ring -I../lib/ring -Ilib/meter -I../lib/meter -Ilib/cmdline -I../lib/cmdline -Ilib/pci -I../lib/pci -Idrivers/crypto/scheduler -I../drivers/crypto/scheduler -Ilib/cryptodev -I../lib/cryptodev -Ilib/rcu -I../lib/rcu -Idrivers/bus/vdev -I../drivers/bus/vdev -Ilib/reorder -I../lib/reorder -Ilib/security -I../lib/security -Ilib/bitratestats -I../lib/bitratestats -Ilib/bpf -I../lib/bpf -Ilib/gro -I../lib/gro -Ilib/gso -I../lib/gso -Ilib/latencystats -I../lib/latencystats -Ilib/pdump -I../lib/pdump -Ilib/pcapng -I../lib/pcapng -Idrivers/net/bnxt -I../drivers/net/bnxt -Idrivers/net/bnxt/tf_ulp -I../drivers/net/bnxt/tf_ulp -Idrivers/net/bnxt/tf_ulp/generic_templates -I../drivers/net/bnxt/tf_ulp/generic_templates -Idrivers/net/bnxt/tf_core -I../drivers/net/bnxt/tf_core -Idrivers/net/bnxt/tf_core/v3 -I../drivers/net/bnxt/tf_core/v3 -Idrivers/net/bnxt/hcapi/cfa -I../drivers/net/bnxt/hcapi/cfa -Idrivers/net/bnxt/hcapi/cfa_v3 -I../drivers/net/bnxt/hcapi/cfa_v3 -I../drivers/net/bnxt/hcapi/cfa_v3/include -I../drivers/net/bnxt/hcapi/cfa_v3/include/platform/dpdk -I../drivers/net/bnxt/hcapi/cfa_v3/bld/p70 -I../drivers/net/bnxt/hcapi/cfa_v3/bld/p70/host -I../drivers/net/bnxt/hcapi/cfa_v3/bld/include -I../drivers/net/bnxt/hcapi/cfa_v3/bld/include/host -I../drivers/net/bnxt/hcapi/cfa_v3/bld/include/p70 -I../drivers/net/bnxt/hcapi/cfa_v3/mm/include -I../drivers/net/bnxt/hcapi/cfa_v3/tim/include -I../drivers/net/bnxt/hcapi/cfa_v3/tpm/include -Idrivers/bus/pci -I../drivers/bus/pci -I../drivers/bus/pci/linux -Ilib/hash -I../lib/hash -Idrivers/net/intel/i40e -I../drivers/net/intel/i40e -I../drivers/net/intel/i40e/base -Idrivers/net/intel/ixgbe -I../drivers/net/intel/ixgbe -I../drivers/net/intel/ixgbe/base -Idrivers/bus/dpaa -I../drivers/bus/dpaa -I../drivers/bus/dpaa/base -I../drivers/bus/dpaa/include -I../drivers/bus/dpaa/base/qbman -Idrivers/common/dpaax -I../drivers/common/dpaax -I../drivers/common/dpaax/caamflib -Ilib/eventdev -I../lib/eventdev -Ilib/timer -I../lib/timer -Ilib/dmadev -I../lib/dmadev -Idrivers/mempool/dpaa -I../drivers/mempool/dpaa -Idrivers/net/dpaa -I../drivers/net/dpaa -Idrivers/net/bonding -I../drivers/net/bonding -Ilib/sched -I../lib/sched -Ilib/ip_frag -I../lib/ip_frag -Idrivers/net/intel/iavf -I../drivers/net/intel/iavf -I../drivers/net/intel/iavf/base -Idrivers/net/intel/ice -I../drivers/net/intel/ice -I../drivers/net/intel/ice/base -fdiagnostics-color=always -D_FILE_OFFSET_BITS=64 -Wall -Winvalid-pch -Wextra -Werror -std=c11 -O3 -include rte_config.h -Wvla -Wcast-qual -Wdeprecated -Wformat -Wformat-nonliteral -Wformat-security -Wmissing-declarations -Wmissing-prototypes -Wnested-externs -Wold-style-definition -Wpointer-arith -Wshadow -Wsign-compare -Wstrict-prototypes -Wundef -Wwrite-strings -Wno-packed-not-aligned -Wno-missing-field-initializers -D_GNU_SOURCE -march=native -mrtm -DALLOW_EXPERIMENTAL_API -MD -MQ app/dpdk-testpmd.p/test-pmd_config.c.o -MF app/dpdk-testpmd.p/test-pmd_config.c.o.d -o app/dpdk-testpmd.p/test-pmd_config.c.o -c ../app/test-pmd/config.c
../app/test-pmd/config.c: In function ‘port_module_eeprom_decode_display’:
../app/test-pmd/config.c:1247:8: error: implicit declaration of function ‘rte_eth_module_eeprom_parse’; did you mean ‘port_module_eeprom_read’? [-Werror=implicit-function-declaration]
ret = rte_eth_module_eeprom_parse(minfo.type, einfo.data, einfo.length,
^~~~~~~~~~~~~~~~~~~~~~~~~~~
port_module_eeprom_read
../app/test-pmd/config.c:1247:8: error: nested extern declaration of ‘rte_eth_module_eeprom_parse’ [-Werror=nested-externs]
cc1: all warnings being treated as errors
[3327/3706] Compiling C object app/dpdk-testpmd.p/test-pmd_noisy_vnf.c.o
[3328/3706] Compiling C object app/dpdk-test-security-perf.p/test-security-perf_test_security_perf.c.o
[3329/3706] Compiling C object app/dpdk-testpmd.p/test-pmd_testpmd.c.o
[3330/3706] Compiling C object app/dpdk-test-sad.p/test-sad_main.c.o
[3331/3706] Compiling C object app/dpdk-test-security-perf.p/test_test_cryptodev_security_ipsec.c.o
[3332/3706] Generating app/test/test_cfgfiles/test_cfgfile with a custom command (wrapped by meson to capture output)
[3333/3706] Compiling C object examples/dpdk-ipsec-secgw.p/ipsec-secgw_flow.c.o
[3334/3706] Compiling C object examples/dpdk-ethtool.p/ethtool_ethtool-app_ethapp.c.o
[3335/3706] Compiling C object app/dpdk-test-regex.p/test-regex_main.c.o
ninja: build stopped
*Build Failed #2:
OS: FreeBSD15-64
Target: x86_64-native-bsdapp-gcc
FAILED: [code=1] app/dpdk-testpmd.p/test-pmd_config.c.o
gcc -Iapp/dpdk-testpmd.p -Iapp -I../app -Iapp/test-pmd -I../app/test-pmd -Ilib/ethdev -I../lib/ethdev -Ilib/eal/common -I../lib/eal/common -I. -I.. -Iconfig -I../config -Ilib/eal/include -I../lib/eal/include -Ilib/eal/freebsd/include -I../lib/eal/freebsd/include -Ilib/eal/x86/include -I../lib/eal/x86/include -Ilib/eal -I../lib/eal -Ilib/kvargs -I../lib/kvargs -Ilib/log -I../lib/log -Ilib/metrics -I../lib/metrics -Ilib/telemetry -I../lib/telemetry -Ilib/argparse -I../lib/argparse -Ilib/net -I../lib/net -Ilib/mbuf -I../lib/mbuf -Ilib/mempool -I../lib/mempool -Ilib/ring -I../lib/ring -Ilib/meter -I../lib/meter -Ilib/cmdline -I../lib/cmdline -Ilib/pci -I../lib/pci -Idrivers/crypto/scheduler -I../drivers/crypto/scheduler -Ilib/cryptodev -I../lib/cryptodev -Ilib/rcu -I../lib/rcu -Idrivers/bus/vdev -I../drivers/bus/vdev -Ilib/reorder -I../lib/reorder -Ilib/security -I../lib/security -Ilib/bitratestats -I../lib/bitratestats -Ilib/bpf -I../lib/bpf -Ilib/gro -I../lib/gro -Ilib/gso -I../lib/gso -Ilib/latencystats -I../lib/latencystats -Ilib/pdump -I../lib/pdump -Ilib/pcapng -I../lib/pcapng -Idrivers/net/bnxt -I../drivers/net/bnxt -Idrivers/net/bnxt/tf_ulp -I../drivers/net/bnxt/tf_ulp -Idrivers/net/bnxt/tf_ulp/generic_templates -I../drivers/net/bnxt/tf_ulp/generic_templates -Idrivers/net/bnxt/tf_core -I../drivers/net/bnxt/tf_core -Idrivers/net/bnxt/tf_core/v3 -I../drivers/net/bnxt/tf_core/v3 -Idrivers/net/bnxt/hcapi/cfa -I../drivers/net/bnxt/hcapi/cfa -Idrivers/net/bnxt/hcapi/cfa_v3 -I../drivers/net/bnxt/hcapi/cfa_v3 -I../drivers/net/bnxt/hcapi/cfa_v3/include -I../drivers/net/bnxt/hcapi/cfa_v3/include/platform/dpdk -I../drivers/net/bnxt/hcapi/cfa_v3/bld/p70 -I../drivers/net/bnxt/hcapi/cfa_v3/bld/p70/host -I../drivers/net/bnxt/hcapi/cfa_v3/bld/include -I../drivers/net/bnxt/hcapi/cfa_v3/bld/include/host -I../drivers/net/bnxt/hcapi/cfa_v3/bld/include/p70 -I../drivers/net/bnxt/hcapi/cfa_v3/mm/include -I../drivers/net/bnxt/hcapi/cfa_v3/tim/include -I../drivers/net/bnxt/hcapi/cfa_v3/tpm/include -Idrivers/bus/pci -I../drivers/bus/pci -I../drivers/bus/pci/bsd -Ilib/hash -I../lib/hash -Idrivers/net/intel/i40e -I../drivers/net/intel/i40e -I../drivers/net/intel/i40e/base -Idrivers/net/intel/ixgbe -I../drivers/net/intel/ixgbe -I../drivers/net/intel/ixgbe/base -Idrivers/net/bonding -I../drivers/net/bonding -Ilib/sched -I../lib/sched -Ilib/ip_frag -I../lib/ip_frag -Idrivers/net/intel/iavf -I../drivers/net/intel/iavf -I../drivers/net/intel/iavf/base -Idrivers/net/intel/ice -I../drivers/net/intel/ice -I../drivers/net/intel/ice/base -fdiagnostics-color=always -D_FILE_OFFSET_BITS=64 -Wall -Winvalid-pch -Wextra -Werror -std=c11 -O3 -include rte_config.h -Wvla -Wcast-qual -Wdeprecated -Wformat -Wformat-nonliteral -Wformat-security -Wmissing-declarations -Wmissing-prototypes -Wnested-externs -Wold-style-definition -Wpointer-arith -Wshadow -Wsign-compare -Wstrict-prototypes -Wundef -Wwrite-strings -Wno-packed-not-aligned -Wno-missing-field-initializers -D_GNU_SOURCE -D__BSD_VISIBLE -march=native -mno-avx512f -mrtm -DALLOW_EXPERIMENTAL_API -MD -MQ app/dpdk-testpmd.p/test-pmd_config.c.o -MF app/dpdk-testpmd.p/test-pmd_config.c.o.d -o app/dpdk-testpmd.p/test-pmd_config.c.o -c ../app/test-pmd/config.c
../app/test-pmd/config.c: In function 'port_module_eeprom_decode_display':
../app/test-pmd/config.c:1247:15: error: implicit declaration of function 'rte_eth_module_eeprom_parse' [-Wimplicit-function-declaration]
1247 | ret = rte_eth_module_eeprom_parse(minfo.type, einfo.data, einfo.length,
| ^~~~~~~~~~~~~~~~~~~~~~~~~~~
../app/test-pmd/config.c:1247:15: error: nested extern declaration of 'rte_eth_module_eeprom_parse' [-Werror=nested-externs]
cc1: all warnings being treated as errors
[1780/2246] Compiling C object app/dpdk-testpmd.p/test-pmd_flowgen.c.o
[1781/2246] Compiling C object app/dpdk-test-mldev.p/test-mldev_test_inference_common.c.o
[1782/2246] Compiling C object app/dpdk-testpmd.p/test-pmd_hairpin.c.o
[1783/2246] Compiling C object app/dpdk-testpmd.p/test-pmd_icmpecho.c.o
[1784/2246] Compiling C object app/dpdk-testpmd.p/test-pmd_iofwd.c.o
[1785/2246] Compiling C object app/dpdk-testpmd.p/test-pmd_ieee1588fwd.c.o
[1786/2246] Compiling C object app/dpdk-testpmd.p/test-pmd_csumonly.c.o
[1787/2246] Compiling C object app/dpdk-testpmd.p/test-pmd_cmdline.c.o
[1788/2246] Compiling C object app/dpdk-testpmd.p/test-pmd_cmdline_flow.c.o
ninja: build stopped
*Build Failed #3:
OS: FreeBSD15-64
Target: x86_64-native-bsdapp-clang
FAILED: [code=1] app/dpdk-testpmd.p/test-pmd_config.c.o
clang -Iapp/dpdk-testpmd.p -Iapp -I../app -Iapp/test-pmd -I../app/test-pmd -Ilib/ethdev -I../lib/ethdev -Ilib/eal/common -I../lib/eal/common -I. -I.. -Iconfig -I../config -Ilib/eal/include -I../lib/eal/include -Ilib/eal/freebsd/include -I../lib/eal/freebsd/include -Ilib/eal/x86/include -I../lib/eal/x86/include -Ilib/eal -I../lib/eal -Ilib/kvargs -I../lib/kvargs -Ilib/log -I../lib/log -Ilib/metrics -I../lib/metrics -Ilib/telemetry -I../lib/telemetry -Ilib/argparse -I../lib/argparse -Ilib/net -I../lib/net -Ilib/mbuf -I../lib/mbuf -Ilib/mempool -I../lib/mempool -Ilib/ring -I../lib/ring -Ilib/meter -I../lib/meter -Ilib/cmdline -I../lib/cmdline -Ilib/pci -I../lib/pci -Idrivers/crypto/scheduler -I../drivers/crypto/scheduler -Ilib/cryptodev -I../lib/cryptodev -Ilib/rcu -I../lib/rcu -Idrivers/bus/vdev -I../drivers/bus/vdev -Ilib/reorder -I../lib/reorder -Ilib/security -I../lib/security -Ilib/bitratestats -I../lib/bitratestats -Ilib/bpf -I../lib/bpf -Ilib/gro -I../lib/gro -Ilib/gso -I../lib/gso -Ilib/latencystats -I../lib/latencystats -Ilib/pdump -I../lib/pdump -Ilib/pcapng -I../lib/pcapng -Idrivers/net/bnxt -I../drivers/net/bnxt -Idrivers/net/bnxt/tf_ulp -I../drivers/net/bnxt/tf_ulp -Idrivers/net/bnxt/tf_ulp/generic_templates -I../drivers/net/bnxt/tf_ulp/generic_templates -Idrivers/net/bnxt/tf_core -I../drivers/net/bnxt/tf_core -Idrivers/net/bnxt/tf_core/v3 -I../drivers/net/bnxt/tf_core/v3 -Idrivers/net/bnxt/hcapi/cfa -I../drivers/net/bnxt/hcapi/cfa -Idrivers/net/bnxt/hcapi/cfa_v3 -I../drivers/net/bnxt/hcapi/cfa_v3 -I../drivers/net/bnxt/hcapi/cfa_v3/include -I../drivers/net/bnxt/hcapi/cfa_v3/include/platform/dpdk -I../drivers/net/bnxt/hcapi/cfa_v3/bld/p70 -I../drivers/net/bnxt/hcapi/cfa_v3/bld/p70/host -I../drivers/net/bnxt/hcapi/cfa_v3/bld/include -I../drivers/net/bnxt/hcapi/cfa_v3/bld/include/host -I../drivers/net/bnxt/hcapi/cfa_v3/bld/include/p70 -I../drivers/net/bnxt/hcapi/cfa_v3/mm/include -I../drivers/net/bnxt/hcapi/cfa_v3/tim/include -I../drivers/net/bnxt/hcapi/cfa_v3/tpm/include -Idrivers/bus/pci -I../drivers/bus/pci -I../drivers/bus/pci/bsd -Ilib/hash -I../lib/hash -Idrivers/net/intel/i40e -I../drivers/net/intel/i40e -I../drivers/net/intel/i40e/base -Idrivers/net/intel/ixgbe -I../drivers/net/intel/ixgbe -I../drivers/net/intel/ixgbe/base -Idrivers/net/bonding -I../drivers/net/bonding -Ilib/sched -I../lib/sched -Ilib/ip_frag -I../lib/ip_frag -Idrivers/net/intel/iavf -I../drivers/net/intel/iavf -I../drivers/net/intel/iavf/base -Idrivers/net/intel/ice -I../drivers/net/intel/ice -I../drivers/net/intel/ice/base -fdiagnostics-color=always -D_FILE_OFFSET_BITS=64 -Wall -Winvalid-pch -Wextra -Werror -std=c11 -O3 -include rte_config.h -Wvla -Wcast-qual -Wcomma -Wdeprecated -Wformat -Wformat-nonliteral -Wformat-security -Wmissing-declarations -Wmissing-prototypes -Wnested-externs -Wold-style-definition -Wpointer-arith -Wshadow -Wsign-compare -Wstrict-prototypes -Wundef -Wwrite-strings -Wno-missing-field-initializers -D_GNU_SOURCE -D__BSD_VISIBLE -march=native -mrtm -DALLOW_EXPERIMENTAL_API -MD -MQ app/dpdk-testpmd.p/test-pmd_config.c.o -MF app/dpdk-testpmd.p/test-pmd_config.c.o.d -o app/dpdk-testpmd.p/test-pmd_config.c.o -c ../app/test-pmd/config.c
../app/test-pmd/config.c:1247:8: error: call to undeclared function 'rte_eth_module_eeprom_parse'; ISO C99 and later do not support implicit function declarations [-Werror,-Wimplicit-function-declaration]
1247 | ret = rte_eth_module_eeprom_parse(minfo.type, einfo.data, einfo.length,
| ^
1 error generated.
[1792/2267] Compiling C object app/dpdk-testpmd.p/test-pmd_hairpin.c.o
[1793/2267] Compiling C object app/dpdk-testpmd.p/test-pmd_flowgen.c.o
[1794/2267] Compiling C object app/dpdk-testpmd.p/test-pmd_csumonly.c.o
[1795/2267] Compiling C object app/dpdk-testpmd.p/test-pmd_cmdline.c.o
[1796/2267] Compiling C object app/dpdk-testpmd.p/test-pmd_iofwd.c.o
[1797/2267] Compiling C object app/dpdk-testpmd.p/test-pmd_ieee1588fwd.c.o
[1798/2267] Compiling C object app/dpdk-testpmd.p/test-pmd_icmpecho.c.o
[1799/2267] Compiling C object app/dpdk-testpmd.p/test-pmd_macfwd.c.o
[1800/2267] Compiling C object app/dpdk-testpmd.p/test-pmd_cmdline_flow.c.o
ninja: build stopped
*Build Failed #4:
OS: FreeBSD15-64
Target: x86_64-native-bsdapp-gcc+shared
FAILED: [code=1] app/dpdk-testpmd.p/test-pmd_config.c.o
gcc -Iapp/dpdk-testpmd.p -Iapp -I../app -Iapp/test-pmd -I../app/test-pmd -Ilib/ethdev -I../lib/ethdev -Ilib/eal/common -I../lib/eal/common -I. -I.. -Iconfig -I../config -Ilib/eal/include -I../lib/eal/include -Ilib/eal/freebsd/include -I../lib/eal/freebsd/include -Ilib/eal/x86/include -I../lib/eal/x86/include -Ilib/eal -I../lib/eal -Ilib/kvargs -I../lib/kvargs -Ilib/log -I../lib/log -Ilib/metrics -I../lib/metrics -Ilib/telemetry -I../lib/telemetry -Ilib/argparse -I../lib/argparse -Ilib/net -I../lib/net -Ilib/mbuf -I../lib/mbuf -Ilib/mempool -I../lib/mempool -Ilib/ring -I../lib/ring -Ilib/meter -I../lib/meter -Ilib/cmdline -I../lib/cmdline -Ilib/pci -I../lib/pci -Idrivers/crypto/scheduler -I../drivers/crypto/scheduler -Ilib/cryptodev -I../lib/cryptodev -Ilib/rcu -I../lib/rcu -Idrivers/bus/vdev -I../drivers/bus/vdev -Ilib/reorder -I../lib/reorder -Ilib/security -I../lib/security -Ilib/bitratestats -I../lib/bitratestats -Ilib/bpf -I../lib/bpf -Ilib/gro -I../lib/gro -Ilib/gso -I../lib/gso -Ilib/latencystats -I../lib/latencystats -Ilib/pdump -I../lib/pdump -Ilib/pcapng -I../lib/pcapng -Idrivers/net/bnxt -I../drivers/net/bnxt -Idrivers/net/bnxt/tf_ulp -I../drivers/net/bnxt/tf_ulp -Idrivers/net/bnxt/tf_ulp/generic_templates -I../drivers/net/bnxt/tf_ulp/generic_templates -Idrivers/net/bnxt/tf_core -I../drivers/net/bnxt/tf_core -Idrivers/net/bnxt/tf_core/v3 -I../drivers/net/bnxt/tf_core/v3 -Idrivers/net/bnxt/hcapi/cfa -I../drivers/net/bnxt/hcapi/cfa -Idrivers/net/bnxt/hcapi/cfa_v3 -I../drivers/net/bnxt/hcapi/cfa_v3 -I../drivers/net/bnxt/hcapi/cfa_v3/include -I../drivers/net/bnxt/hcapi/cfa_v3/include/platform/dpdk -I../drivers/net/bnxt/hcapi/cfa_v3/bld/p70 -I../drivers/net/bnxt/hcapi/cfa_v3/bld/p70/host -I../drivers/net/bnxt/hcapi/cfa_v3/bld/include -I../drivers/net/bnxt/hcapi/cfa_v3/bld/include/host -I../drivers/net/bnxt/hcapi/cfa_v3/bld/include/p70 -I../drivers/net/bnxt/hcapi/cfa_v3/mm/include -I../drivers/net/bnxt/hcapi/cfa_v3/tim/include -I../drivers/net/bnxt/hcapi/cfa_v3/tpm/include -Idrivers/bus/pci -I../drivers/bus/pci -I../drivers/bus/pci/bsd -Ilib/hash -I../lib/hash -Idrivers/net/intel/i40e -I../drivers/net/intel/i40e -I../drivers/net/intel/i40e/base -Idrivers/net/intel/ixgbe -I../drivers/net/intel/ixgbe -I../drivers/net/intel/ixgbe/base -Idrivers/net/bonding -I../drivers/net/bonding -Ilib/sched -I../lib/sched -Ilib/ip_frag -I../lib/ip_frag -Idrivers/net/intel/iavf -I../drivers/net/intel/iavf -I../drivers/net/intel/iavf/base -Idrivers/net/intel/ice -I../drivers/net/intel/ice -I../drivers/net/intel/ice/base -fdiagnostics-color=always -D_FILE_OFFSET_BITS=64 -Wall -Winvalid-pch -Wextra -Werror -std=c11 -O3 -include rte_config.h -Wvla -Wcast-qual -Wdeprecated -Wformat -Wformat-nonliteral -Wformat-security -Wmissing-declarations -Wmissing-prototypes -Wnested-externs -Wold-style-definition -Wpointer-arith -Wshadow -Wsign-compare -Wstrict-prototypes -Wundef -Wwrite-strings -Wno-packed-not-aligned -Wno-missing-field-initializers -D_GNU_SOURCE -D__BSD_VISIBLE -march=native -mno-avx512f -mrtm -DALLOW_EXPERIMENTAL_API -MD -MQ app/dpdk-testpmd.p/test-pmd_config.c.o -MF app/dpdk-testpmd.p/test-pmd_config.c.o.d -o app/dpdk-testpmd.p/test-pmd_config.c.o -c ../app/test-pmd/config.c
../app/test-pmd/config.c: In function 'port_module_eeprom_decode_display':
../app/test-pmd/config.c:1247:15: error: implicit declaration of function 'rte_eth_module_eeprom_parse' [-Wimplicit-function-declaration]
1247 | ret = rte_eth_module_eeprom_parse(minfo.type, einfo.data, einfo.length,
| ^~~~~~~~~~~~~~~~~~~~~~~~~~~
../app/test-pmd/config.c:1247:15: error: nested extern declaration of 'rte_eth_module_eeprom_parse' [-Werror=nested-externs]
cc1: all warnings being treated as errors
[1836/2123] Compiling C object app/dpdk-testpmd.p/test-pmd_hairpin.c.o
[1837/2123] Compiling C object app/dpdk-testpmd.p/test-pmd_ieee1588fwd.c.o
[1838/2123] Compiling C object app/dpdk-testpmd.p/test-pmd_iofwd.c.o
[1839/2123] Compiling C object app/dpdk-testpmd.p/test-pmd_macfwd.c.o
[1840/2123] Compiling C object app/dpdk-testpmd.p/test-pmd_icmpecho.c.o
[1841/2123] Compiling C object app/dpdk-test-bbdev.p/test-bbdev_test_bbdev_perf.c.o
[1842/2123] Compiling C object app/dpdk-testpmd.p/test-pmd_cmdline.c.o
[1843/2123] Compiling C object app/dpdk-testpmd.p/test-pmd_csumonly.c.o
[1844/2123] Compiling C object app/dpdk-testpmd.p/test-pmd_cmdline_flow.c.o
ninja: build stopped
*Build Failed #5:
OS: FreeBSD15-64
Target: x86_64-native-bsdapp-gcc+debug
FAILED: [code=1] app/dpdk-testpmd.p/test-pmd_config.c.o
gcc -Iapp/dpdk-testpmd.p -Iapp -I../app -Iapp/test-pmd -I../app/test-pmd -Ilib/ethdev -I../lib/ethdev -Ilib/eal/common -I../lib/eal/common -I. -I.. -Iconfig -I../config -Ilib/eal/include -I../lib/eal/include -Ilib/eal/freebsd/include -I../lib/eal/freebsd/include -Ilib/eal/x86/include -I../lib/eal/x86/include -Ilib/eal -I../lib/eal -Ilib/kvargs -I../lib/kvargs -Ilib/log -I../lib/log -Ilib/metrics -I../lib/metrics -Ilib/telemetry -I../lib/telemetry -Ilib/argparse -I../lib/argparse -Ilib/net -I../lib/net -Ilib/mbuf -I../lib/mbuf -Ilib/mempool -I../lib/mempool -Ilib/ring -I../lib/ring -Ilib/meter -I../lib/meter -Ilib/cmdline -I../lib/cmdline -Ilib/pci -I../lib/pci -Idrivers/crypto/scheduler -I../drivers/crypto/scheduler -Ilib/cryptodev -I../lib/cryptodev -Ilib/rcu -I../lib/rcu -Idrivers/bus/vdev -I../drivers/bus/vdev -Ilib/reorder -I../lib/reorder -Ilib/security -I../lib/security -Ilib/bitratestats -I../lib/bitratestats -Ilib/bpf -I../lib/bpf -Ilib/gro -I../lib/gro -Ilib/gso -I../lib/gso -Ilib/latencystats -I../lib/latencystats -Ilib/pdump -I../lib/pdump -Ilib/pcapng -I../lib/pcapng -Idrivers/net/bnxt -I../drivers/net/bnxt -Idrivers/net/bnxt/tf_ulp -I../drivers/net/bnxt/tf_ulp -Idrivers/net/bnxt/tf_ulp/generic_templates -I../drivers/net/bnxt/tf_ulp/generic_templates -Idrivers/net/bnxt/tf_core -I../drivers/net/bnxt/tf_core -Idrivers/net/bnxt/tf_core/v3 -I../drivers/net/bnxt/tf_core/v3 -Idrivers/net/bnxt/hcapi/cfa -I../drivers/net/bnxt/hcapi/cfa -Idrivers/net/bnxt/hcapi/cfa_v3 -I../drivers/net/bnxt/hcapi/cfa_v3 -I../drivers/net/bnxt/hcapi/cfa_v3/include -I../drivers/net/bnxt/hcapi/cfa_v3/include/platform/dpdk -I../drivers/net/bnxt/hcapi/cfa_v3/bld/p70 -I../drivers/net/bnxt/hcapi/cfa_v3/bld/p70/host -I../drivers/net/bnxt/hcapi/cfa_v3/bld/include -I../drivers/net/bnxt/hcapi/cfa_v3/bld/include/host -I../drivers/net/bnxt/hcapi/cfa_v3/bld/include/p70 -I../drivers/net/bnxt/hcapi/cfa_v3/mm/include -I../drivers/net/bnxt/hcapi/cfa_v3/tim/include -I../drivers/net/bnxt/hcapi/cfa_v3/tpm/include -Idrivers/bus/pci -I../drivers/bus/pci -I../drivers/bus/pci/bsd -Ilib/hash -I../lib/hash -Idrivers/net/intel/i40e -I../drivers/net/intel/i40e -I../drivers/net/intel/i40e/base -Idrivers/net/intel/ixgbe -I../drivers/net/intel/ixgbe -I../drivers/net/intel/ixgbe/base -Idrivers/net/bonding -I../drivers/net/bonding -Ilib/sched -I../lib/sched -Ilib/ip_frag -I../lib/ip_frag -Idrivers/net/intel/iavf -I../drivers/net/intel/iavf -I../drivers/net/intel/iavf/base -Idrivers/net/intel/ice -I../drivers/net/intel/ice -I../drivers/net/intel/ice/base -fdiagnostics-color=always -D_FILE_OFFSET_BITS=64 -Wall -Winvalid-pch -Wextra -Werror -std=c11 -O2 -g -include rte_config.h -Wvla -Wcast-qual -Wdeprecated -Wformat -Wformat-nonliteral -Wformat-security -Wmissing-declarations -Wmissing-prototypes -Wnested-externs -Wold-style-definition -Wpointer-arith -Wshadow -Wsign-compare -Wstrict-prototypes -Wundef -Wwrite-strings -Wno-packed-not-aligned -Wno-missing-field-initializers -D_GNU_SOURCE -D__BSD_VISIBLE -march=native -mno-avx512f -mrtm -DALLOW_EXPERIMENTAL_API -MD -MQ app/dpdk-testpmd.p/test-pmd_config.c.o -MF app/dpdk-testpmd.p/test-pmd_config.c.o.d -o app/dpdk-testpmd.p/test-pmd_config.c.o -c ../app/test-pmd/config.c
../app/test-pmd/config.c: In function 'port_module_eeprom_decode_display':
../app/test-pmd/config.c:1247:15: error: implicit declaration of function 'rte_eth_module_eeprom_parse' [-Wimplicit-function-declaration]
1247 | ret = rte_eth_module_eeprom_parse(minfo.type, einfo.data, einfo.length,
| ^~~~~~~~~~~~~~~~~~~~~~~~~~~
../app/test-pmd/config.c:1247:15: error: nested extern declaration of 'rte_eth_module_eeprom_parse' [-Werror=nested-externs]
cc1: all warnings being treated as errors
[1780/2246] Compiling C object app/dpdk-testpmd.p/test-pmd_hairpin.c.o
[1781/2246] Compiling C object app/dpdk-testpmd.p/test-pmd_flowgen.c.o
[1782/2246] Compiling C object app/dpdk-test-mldev.p/test-mldev_test_inference_common.c.o
[1783/2246] Compiling C object app/dpdk-testpmd.p/test-pmd_iofwd.c.o
[1784/2246] Compiling C object app/dpdk-testpmd.p/test-pmd_csumonly.c.o
[1785/2246] Compiling C object app/dpdk-testpmd.p/test-pmd_icmpecho.c.o
[1786/2246] Compiling C object app/dpdk-testpmd.p/test-pmd_ieee1588fwd.c.o
[1787/2246] Compiling C object app/dpdk-testpmd.p/test-pmd_cmdline.c.o
[1788/2246] Compiling C object app/dpdk-testpmd.p/test-pmd_cmdline_flow.c.o
ninja: build stopped
*Build Failed #6:
OS: RHEL9.8-64
Target: x86_64-native-linuxapp-gcc
FAILED: app/dpdk-testpmd.p/test-pmd_config.c.o
gcc -Iapp/dpdk-testpmd.p -Iapp -I../app -Iapp/test-pmd -I../app/test-pmd -Ilib/ethdev -I../lib/ethdev -Ilib/eal/common -I../lib/eal/common -I. -I.. -Iconfig -I../config -Ilib/eal/include -I../lib/eal/include -Ilib/eal/linux/include -I../lib/eal/linux/include -Ilib/eal/x86/include -I../lib/eal/x86/include -I../kernel/linux -Ilib/eal -I../lib/eal -Ilib/kvargs -I../lib/kvargs -Ilib/log -I../lib/log -Ilib/metrics -I../lib/metrics -Ilib/telemetry -I../lib/telemetry -Ilib/argparse -I../lib/argparse -Ilib/net -I../lib/net -Ilib/mbuf -I../lib/mbuf -Ilib/mempool -I../lib/mempool -Ilib/ring -I../lib/ring -Ilib/meter -I../lib/meter -Ilib/cmdline -I../lib/cmdline -Ilib/pci -I../lib/pci -Idrivers/crypto/scheduler -I../drivers/crypto/scheduler -Ilib/cryptodev -I../lib/cryptodev -Ilib/rcu -I../lib/rcu -Idrivers/bus/vdev -I../drivers/bus/vdev -Ilib/reorder -I../lib/reorder -Ilib/security -I../lib/security -Ilib/bitratestats -I../lib/bitratestats -Ilib/bpf -I../lib/bpf -Ilib/gro -I../lib/gro -Ilib/gso -I../lib/gso -Ilib/latencystats -I../lib/latencystats -Ilib/pdump -I../lib/pdump -Ilib/pcapng -I../lib/pcapng -Idrivers/net/bnxt -I../drivers/net/bnxt -Idrivers/net/bnxt/tf_ulp -I../drivers/net/bnxt/tf_ulp -Idrivers/net/bnxt/tf_ulp/generic_templates -I../drivers/net/bnxt/tf_ulp/generic_templates -Idrivers/net/bnxt/tf_core -I../drivers/net/bnxt/tf_core -Idrivers/net/bnxt/tf_core/v3 -I../drivers/net/bnxt/tf_core/v3 -Idrivers/net/bnxt/hcapi/cfa -I../drivers/net/bnxt/hcapi/cfa -Idrivers/net/bnxt/hcapi/cfa_v3 -I../drivers/net/bnxt/hcapi/cfa_v3 -I../drivers/net/bnxt/hcapi/cfa_v3/include -I../drivers/net/bnxt/hcapi/cfa_v3/include/platform/dpdk -I../drivers/net/bnxt/hcapi/cfa_v3/bld/p70 -I../drivers/net/bnxt/hcapi/cfa_v3/bld/p70/host -I../drivers/net/bnxt/hcapi/cfa_v3/bld/include -I../drivers/net/bnxt/hcapi/cfa_v3/bld/include/host -I../drivers/net/bnxt/hcapi/cfa_v3/bld/include/p70 -I../drivers/net/bnxt/hcapi/cfa_v3/mm/include -I../drivers/net/bnxt/hcapi/cfa_v3/tim/include -I../drivers/net/bnxt/hcapi/cfa_v3/tpm/include -Idrivers/bus/pci -I../drivers/bus/pci -I../drivers/bus/pci/linux -Ilib/hash -I../lib/hash -Idrivers/net/intel/i40e -I../drivers/net/intel/i40e -I../drivers/net/intel/i40e/base -Idrivers/net/intel/ixgbe -I../drivers/net/intel/ixgbe -I../drivers/net/intel/ixgbe/base -Idrivers/bus/dpaa -I../drivers/bus/dpaa -I../drivers/bus/dpaa/base -I../drivers/bus/dpaa/include -I../drivers/bus/dpaa/base/qbman -Idrivers/common/dpaax -I../drivers/common/dpaax -I../drivers/common/dpaax/caamflib -Ilib/eventdev -I../lib/eventdev -Ilib/timer -I../lib/timer -Ilib/dmadev -I../lib/dmadev -Idrivers/mempool/dpaa -I../drivers/mempool/dpaa -Idrivers/net/dpaa -I../drivers/net/dpaa -Idrivers/net/bonding -I../drivers/net/bonding -Ilib/sched -I../lib/sched -Ilib/ip_frag -I../lib/ip_frag -Idrivers/net/intel/iavf -I../drivers/net/intel/iavf -I../drivers/net/intel/iavf/base -Idrivers/net/intel/ice -I../drivers/net/intel/ice -I../drivers/net/intel/ice/base -fdiagnostics-color=always -D_FILE_OFFSET_BITS=64 -Wall -Winvalid-pch -Wextra -Werror -std=c11 -O3 -include rte_config.h -Wvla -Wcast-qual -Wdeprecated -Wformat -Wformat-nonliteral -Wformat-security -Wmissing-declarations -Wmissing-prototypes -Wnested-externs -Wold-style-definition -Wpointer-arith -Wshadow -Wsign-compare -Wstrict-prototypes -Wundef -Wwrite-strings -Wno-packed-not-aligned -Wno-missing-field-initializers -D_GNU_SOURCE -march=native -mrtm -DALLOW_EXPERIMENTAL_API -MD -MQ app/dpdk-testpmd.p/test-pmd_config.c.o -MF app/dpdk-testpmd.p/test-pmd_config.c.o.d -o app/dpdk-testpmd.p/test-pmd_config.c.o -c ../app/test-pmd/config.c
../app/test-pmd/config.c: In function ‘port_module_eeprom_decode_display’:
../app/test-pmd/config.c:1247:15: error: implicit declaration of function ‘rte_eth_module_eeprom_parse’ [-Werror=implicit-function-declaration]
1247 | ret = rte_eth_module_eeprom_parse(minfo.type, einfo.data, einfo.length,
| ^~~~~~~~~~~~~~~~~~~~~~~~~~~
../app/test-pmd/config.c:1247:15: error: nested extern declaration of ‘rte_eth_module_eeprom_parse’ [-Werror=nested-externs]
cc1: all warnings being treated as errors
[3260/3647] Compiling C object app/dpdk-testpmd.p/.._drivers_net_bonding_bonding_testpmd.c.o
[3261/3647] Compiling C object app/dpdk-testpmd.p/.._drivers_net_intel_iavf_iavf_testpmd.c.o
[3262/3647] Compiling C object app/dpdk-testpmd.p/.._drivers_net_intel_i40e_i40e_testpmd.c.o
[3263/3647] Compiling C object app/dpdk-testpmd.p/test-pmd_noisy_vnf.c.o
[3264/3647] Compiling C object app/dpdk-testpmd.p/test-pmd_txonly.c.o
[3265/3647] Compiling C object app/dpdk-testpmd.p/test-pmd_cmdline_flow.c.o
[3266/3647] Compiling C object app/dpdk-testpmd.p/.._drivers_net_intel_ice_ice_testpmd.c.o
[3267/3647] Compiling C object app/dpdk-testpmd.p/.._drivers_net_intel_ixgbe_ixgbe_testpmd.c.o
[3268/3647] Compiling C object app/dpdk-testpmd.p/test-pmd_testpmd.c.o
ninja: build stopped
*Build Failed #7:
OS: RHEL9.8-64
Target: x86_64-native-linuxapp-clang
FAILED: app/dpdk-testpmd.p/test-pmd_config.c.o
clang -Iapp/dpdk-testpmd.p -Iapp -I../app -Iapp/test-pmd -I../app/test-pmd -Ilib/ethdev -I../lib/ethdev -Ilib/eal/common -I../lib/eal/common -I. -I.. -Iconfig -I../config -Ilib/eal/include -I../lib/eal/include -Ilib/eal/linux/include -I../lib/eal/linux/include -Ilib/eal/x86/include -I../lib/eal/x86/include -I../kernel/linux -Ilib/eal -I../lib/eal -Ilib/kvargs -I../lib/kvargs -Ilib/log -I../lib/log -Ilib/metrics -I../lib/metrics -Ilib/telemetry -I../lib/telemetry -Ilib/argparse -I../lib/argparse -Ilib/net -I../lib/net -Ilib/mbuf -I../lib/mbuf -Ilib/mempool -I../lib/mempool -Ilib/ring -I../lib/ring -Ilib/meter -I../lib/meter -Ilib/cmdline -I../lib/cmdline -Ilib/pci -I../lib/pci -Idrivers/crypto/scheduler -I../drivers/crypto/scheduler -Ilib/cryptodev -I../lib/cryptodev -Ilib/rcu -I../lib/rcu -Idrivers/bus/vdev -I../drivers/bus/vdev -Ilib/reorder -I../lib/reorder -Ilib/security -I../lib/security -Ilib/bitratestats -I../lib/bitratestats -Ilib/bpf -I../lib/bpf -Ilib/gro -I../lib/gro -Ilib/gso -I../lib/gso -Ilib/latencystats -I../lib/latencystats -Ilib/pdump -I../lib/pdump -Ilib/pcapng -I../lib/pcapng -Idrivers/net/bnxt -I../drivers/net/bnxt -Idrivers/net/bnxt/tf_ulp -I../drivers/net/bnxt/tf_ulp -Idrivers/net/bnxt/tf_ulp/generic_templates -I../drivers/net/bnxt/tf_ulp/generic_templates -Idrivers/net/bnxt/tf_core -I../drivers/net/bnxt/tf_core -Idrivers/net/bnxt/tf_core/v3 -I../drivers/net/bnxt/tf_core/v3 -Idrivers/net/bnxt/hcapi/cfa -I../drivers/net/bnxt/hcapi/cfa -Idrivers/net/bnxt/hcapi/cfa_v3 -I../drivers/net/bnxt/hcapi/cfa_v3 -I../drivers/net/bnxt/hcapi/cfa_v3/include -I../drivers/net/bnxt/hcapi/cfa_v3/include/platform/dpdk -I../drivers/net/bnxt/hcapi/cfa_v3/bld/p70 -I../drivers/net/bnxt/hcapi/cfa_v3/bld/p70/host -I../drivers/net/bnxt/hcapi/cfa_v3/bld/include -I../drivers/net/bnxt/hcapi/cfa_v3/bld/include/host -I../drivers/net/bnxt/hcapi/cfa_v3/bld/include/p70 -I../drivers/net/bnxt/hcapi/cfa_v3/mm/include -I../drivers/net/bnxt/hcapi/cfa_v3/tim/include -I../drivers/net/bnxt/hcapi/cfa_v3/tpm/include -Idrivers/bus/pci -I../drivers/bus/pci -I../drivers/bus/pci/linux -Ilib/hash -I../lib/hash -Idrivers/net/intel/i40e -I../drivers/net/intel/i40e -I../drivers/net/intel/i40e/base -Idrivers/net/intel/ixgbe -I../drivers/net/intel/ixgbe -I../drivers/net/intel/ixgbe/base -Idrivers/bus/dpaa -I../drivers/bus/dpaa -I../drivers/bus/dpaa/base -I../drivers/bus/dpaa/include -I../drivers/bus/dpaa/base/qbman -Idrivers/common/dpaax -I../drivers/common/dpaax -I../drivers/common/dpaax/caamflib -Ilib/eventdev -I../lib/eventdev -Ilib/timer -I../lib/timer -Ilib/dmadev -I../lib/dmadev -Idrivers/mempool/dpaa -I../drivers/mempool/dpaa -Idrivers/net/dpaa -I../drivers/net/dpaa -Idrivers/net/bonding -I../drivers/net/bonding -Ilib/sched -I../lib/sched -Ilib/ip_frag -I../lib/ip_frag -Idrivers/net/intel/iavf -I../drivers/net/intel/iavf -I../drivers/net/intel/iavf/base -Idrivers/net/intel/ice -I../drivers/net/intel/ice -I../drivers/net/intel/ice/base -fdiagnostics-color=always -D_FILE_OFFSET_BITS=64 -Wall -Winvalid-pch -Wextra -Werror -std=c11 -O3 -include rte_config.h -Wvla -Wcast-qual -Wcomma -Wdeprecated -Wformat -Wformat-nonliteral -Wformat-security -Wmissing-declarations -Wmissing-prototypes -Wnested-externs -Wold-style-definition -Wpointer-arith -Wshadow -Wsign-compare -Wstrict-prototypes -Wundef -Wwrite-strings -Wno-missing-field-initializers -D_GNU_SOURCE -march=native -mrtm -DALLOW_EXPERIMENTAL_API -MD -MQ app/dpdk-testpmd.p/test-pmd_config.c.o -MF app/dpdk-testpmd.p/test-pmd_config.c.o.d -o app/dpdk-testpmd.p/test-pmd_config.c.o -c ../app/test-pmd/config.c
../app/test-pmd/config.c:1247:8: error: call to undeclared function 'rte_eth_module_eeprom_parse'; ISO C99 and later do not support implicit function declarations [-Wimplicit-function-declaration]
1247 | ret = rte_eth_module_eeprom_parse(minfo.type, einfo.data, einfo.length,
| ^
1 error generated.
[3243/3647] Compiling C object app/dpdk-testpmd.p/test-pmd_csumonly.c.o
[3244/3647] Compiling C object app/dpdk-testpmd.p/test-pmd_cmdline_tm.c.o
[3245/3647] Linking target app/dpdk-test-mldev
[3246/3647] Compiling C object app/dpdk-testpmd.p/test-pmd_hairpin.c.o
[3247/3647] Compiling C object app/dpdk-testpmd.p/test-pmd_cmdline_mtr.c.o
[3248/3647] Compiling C object app/dpdk-testpmd.p/test-pmd_icmpecho.c.o
[3249/3647] Compiling C object app/dpdk-testpmd.p/test-pmd_iofwd.c.o
[3250/3647] Compiling C object app/dpdk-testpmd.p/test-pmd_ieee1588fwd.c.o
[3251/3647] Compiling C object app/dpdk-testpmd.p/test-pmd_cmdline_flow.c.o
ninja: build stopped
*Build Failed #8:
OS: RHEL9.8-64
Target: x86_64-native-linuxapp-gcc+shared
FAILED: app/dpdk-testpmd.p/test-pmd_config.c.o
gcc -Iapp/dpdk-testpmd.p -Iapp -I../app -Iapp/test-pmd -I../app/test-pmd -Ilib/ethdev -I../lib/ethdev -Ilib/eal/common -I../lib/eal/common -I. -I.. -Iconfig -I../config -Ilib/eal/include -I../lib/eal/include -Ilib/eal/linux/include -I../lib/eal/linux/include -Ilib/eal/x86/include -I../lib/eal/x86/include -I../kernel/linux -Ilib/eal -I../lib/eal -Ilib/kvargs -I../lib/kvargs -Ilib/log -I../lib/log -Ilib/metrics -I../lib/metrics -Ilib/telemetry -I../lib/telemetry -Ilib/argparse -I../lib/argparse -Ilib/net -I../lib/net -Ilib/mbuf -I../lib/mbuf -Ilib/mempool -I../lib/mempool -Ilib/ring -I../lib/ring -Ilib/meter -I../lib/meter -Ilib/cmdline -I../lib/cmdline -Ilib/pci -I../lib/pci -Idrivers/crypto/scheduler -I../drivers/crypto/scheduler -Ilib/cryptodev -I../lib/cryptodev -Ilib/rcu -I../lib/rcu -Idrivers/bus/vdev -I../drivers/bus/vdev -Ilib/reorder -I../lib/reorder -Ilib/security -I../lib/security -Ilib/bitratestats -I../lib/bitratestats -Ilib/bpf -I../lib/bpf -Ilib/gro -I../lib/gro -Ilib/gso -I../lib/gso -Ilib/latencystats -I../lib/latencystats -Ilib/pdump -I../lib/pdump -Ilib/pcapng -I../lib/pcapng -Idrivers/net/bnxt -I../drivers/net/bnxt -Idrivers/net/bnxt/tf_ulp -I../drivers/net/bnxt/tf_ulp -Idrivers/net/bnxt/tf_ulp/generic_templates -I../drivers/net/bnxt/tf_ulp/generic_templates -Idrivers/net/bnxt/tf_core -I../drivers/net/bnxt/tf_core -Idrivers/net/bnxt/tf_core/v3 -I../drivers/net/bnxt/tf_core/v3 -Idrivers/net/bnxt/hcapi/cfa -I../drivers/net/bnxt/hcapi/cfa -Idrivers/net/bnxt/hcapi/cfa_v3 -I../drivers/net/bnxt/hcapi/cfa_v3 -I../drivers/net/bnxt/hcapi/cfa_v3/include -I../drivers/net/bnxt/hcapi/cfa_v3/include/platform/dpdk -I../drivers/net/bnxt/hcapi/cfa_v3/bld/p70 -I../drivers/net/bnxt/hcapi/cfa_v3/bld/p70/host -I../drivers/net/bnxt/hcapi/cfa_v3/bld/include -I../drivers/net/bnxt/hcapi/cfa_v3/bld/include/host -I../drivers/net/bnxt/hcapi/cfa_v3/bld/include/p70 -I../drivers/net/bnxt/hcapi/cfa_v3/mm/include -I../drivers/net/bnxt/hcapi/cfa_v3/tim/include -I../drivers/net/bnxt/hcapi/cfa_v3/tpm/include -Idrivers/bus/pci -I../drivers/bus/pci -I../drivers/bus/pci/linux -Ilib/hash -I../lib/hash -Idrivers/net/intel/i40e -I../drivers/net/intel/i40e -I../drivers/net/intel/i40e/base -Idrivers/net/intel/ixgbe -I../drivers/net/intel/ixgbe -I../drivers/net/intel/ixgbe/base -Idrivers/bus/dpaa -I../drivers/bus/dpaa -I../drivers/bus/dpaa/base -I../drivers/bus/dpaa/include -I../drivers/bus/dpaa/base/qbman -Idrivers/common/dpaax -I../drivers/common/dpaax -I../drivers/common/dpaax/caamflib -Ilib/eventdev -I../lib/eventdev -Ilib/timer -I../lib/timer -Ilib/dmadev -I../lib/dmadev -Idrivers/mempool/dpaa -I../drivers/mempool/dpaa -Idrivers/net/dpaa -I../drivers/net/dpaa -Idrivers/net/bonding -I../drivers/net/bonding -Ilib/sched -I../lib/sched -Ilib/ip_frag -I../lib/ip_frag -Idrivers/net/intel/iavf -I../drivers/net/intel/iavf -I../drivers/net/intel/iavf/base -Idrivers/net/intel/ice -I../drivers/net/intel/ice -I../drivers/net/intel/ice/base -fdiagnostics-color=always -D_FILE_OFFSET_BITS=64 -Wall -Winvalid-pch -Wextra -Werror -std=c11 -O3 -include rte_config.h -Wvla -Wcast-qual -Wdeprecated -Wformat -Wformat-nonliteral -Wformat-security -Wmissing-declarations -Wmissing-prototypes -Wnested-externs -Wold-style-definition -Wpointer-arith -Wshadow -Wsign-compare -Wstrict-prototypes -Wundef -Wwrite-strings -Wno-packed-not-aligned -Wno-missing-field-initializers -D_GNU_SOURCE -march=native -mrtm -DALLOW_EXPERIMENTAL_API -MD -MQ app/dpdk-testpmd.p/test-pmd_config.c.o -MF app/dpdk-testpmd.p/test-pmd_config.c.o.d -o app/dpdk-testpmd.p/test-pmd_config.c.o -c ../app/test-pmd/config.c
../app/test-pmd/config.c: In function ‘port_module_eeprom_decode_display’:
../app/test-pmd/config.c:1247:15: error: implicit declaration of function ‘rte_eth_module_eeprom_parse’ [-Werror=implicit-function-declaration]
1247 | ret = rte_eth_module_eeprom_parse(minfo.type, einfo.data, einfo.length,
| ^~~~~~~~~~~~~~~~~~~~~~~~~~~
../app/test-pmd/config.c:1247:15: error: nested extern declaration of ‘rte_eth_module_eeprom_parse’ [-Werror=nested-externs]
cc1: all warnings being treated as errors
[3302/3500] Compiling C object app/dpdk-testpmd.p/.._drivers_net_intel_ice_ice_testpmd.c.o
[3303/3500] Compiling C object app/dpdk-test-security-perf.p/test-security-perf_test_security_perf.c.o
[3304/3500] Compiling C object app/dpdk-test-sad.p/test-sad_main.c.o
[3305/3500] Compiling C object app/dpdk-testpmd.p/test-pmd_testpmd.c.o
[3306/3500] Compiling C object app/dpdk-testpmd.p/.._drivers_net_intel_ixgbe_ixgbe_testpmd.c.o
[3307/3500] Compiling C object app/dpdk-test-security-perf.p/test_test_security_proto.c.o
[3308/3500] Compiling C object app/dpdk-test.p/test_test.c.o
[3309/3500] Compiling C object app/dpdk-test-regex.p/test-regex_main.c.o
[3310/3500] Compiling C object app/dpdk-test-security-perf.p/test_test_cryptodev_security_ipsec.c.o
ninja: build stopped
*Build Failed #9:
OS: RHEL9.8-64
Target: x86_64-native-linuxapp-gcc+debug
FAILED: app/dpdk-testpmd.p/test-pmd_config.c.o
gcc -Iapp/dpdk-testpmd.p -Iapp -I../app -Iapp/test-pmd -I../app/test-pmd -Ilib/ethdev -I../lib/ethdev -Ilib/eal/common -I../lib/eal/common -I. -I.. -Iconfig -I../config -Ilib/eal/include -I../lib/eal/include -Ilib/eal/linux/include -I../lib/eal/linux/include -Ilib/eal/x86/include -I../lib/eal/x86/include -I../kernel/linux -Ilib/eal -I../lib/eal -Ilib/kvargs -I../lib/kvargs -Ilib/log -I../lib/log -Ilib/metrics -I../lib/metrics -Ilib/telemetry -I../lib/telemetry -Ilib/argparse -I../lib/argparse -Ilib/net -I../lib/net -Ilib/mbuf -I../lib/mbuf -Ilib/mempool -I../lib/mempool -Ilib/ring -I../lib/ring -Ilib/meter -I../lib/meter -Ilib/cmdline -I../lib/cmdline -Ilib/pci -I../lib/pci -Idrivers/crypto/scheduler -I../drivers/crypto/scheduler -Ilib/cryptodev -I../lib/cryptodev -Ilib/rcu -I../lib/rcu -Idrivers/bus/vdev -I../drivers/bus/vdev -Ilib/reorder -I../lib/reorder -Ilib/security -I../lib/security -Ilib/bitratestats -I../lib/bitratestats -Ilib/bpf -I../lib/bpf -Ilib/gro -I../lib/gro -Ilib/gso -I../lib/gso -Ilib/latencystats -I../lib/latencystats -Ilib/pdump -I../lib/pdump -Ilib/pcapng -I../lib/pcapng -Idrivers/net/bnxt -I../drivers/net/bnxt -Idrivers/net/bnxt/tf_ulp -I../drivers/net/bnxt/tf_ulp -Idrivers/net/bnxt/tf_ulp/generic_templates -I../drivers/net/bnxt/tf_ulp/generic_templates -Idrivers/net/bnxt/tf_core -I../drivers/net/bnxt/tf_core -Idrivers/net/bnxt/tf_core/v3 -I../drivers/net/bnxt/tf_core/v3 -Idrivers/net/bnxt/hcapi/cfa -I../drivers/net/bnxt/hcapi/cfa -Idrivers/net/bnxt/hcapi/cfa_v3 -I../drivers/net/bnxt/hcapi/cfa_v3 -I../drivers/net/bnxt/hcapi/cfa_v3/include -I../drivers/net/bnxt/hcapi/cfa_v3/include/platform/dpdk -I../drivers/net/bnxt/hcapi/cfa_v3/bld/p70 -I../drivers/net/bnxt/hcapi/cfa_v3/bld/p70/host -I../drivers/net/bnxt/hcapi/cfa_v3/bld/include -I../drivers/net/bnxt/hcapi/cfa_v3/bld/include/host -I../drivers/net/bnxt/hcapi/cfa_v3/bld/include/p70 -I../drivers/net/bnxt/hcapi/cfa_v3/mm/include -I../drivers/net/bnxt/hcapi/cfa_v3/tim/include -I../drivers/net/bnxt/hcapi/cfa_v3/tpm/include -Idrivers/bus/pci -I../drivers/bus/pci -I../drivers/bus/pci/linux -Ilib/hash -I../lib/hash -Idrivers/net/intel/i40e -I../drivers/net/intel/i40e -I../drivers/net/intel/i40e/base -Idrivers/net/intel/ixgbe -I../drivers/net/intel/ixgbe -I../drivers/net/intel/ixgbe/base -Idrivers/bus/dpaa -I../drivers/bus/dpaa -I../drivers/bus/dpaa/base -I../drivers/bus/dpaa/include -I../drivers/bus/dpaa/base/qbman -Idrivers/common/dpaax -I../drivers/common/dpaax -I../drivers/common/dpaax/caamflib -Ilib/eventdev -I../lib/eventdev -Ilib/timer -I../lib/timer -Ilib/dmadev -I../lib/dmadev -Idrivers/mempool/dpaa -I../drivers/mempool/dpaa -Idrivers/net/dpaa -I../drivers/net/dpaa -Idrivers/net/bonding -I../drivers/net/bonding -Ilib/sched -I../lib/sched -Ilib/ip_frag -I../lib/ip_frag -Idrivers/net/intel/iavf -I../drivers/net/intel/iavf -I../drivers/net/intel/iavf/base -Idrivers/net/intel/ice -I../drivers/net/intel/ice -I../drivers/net/intel/ice/base -fdiagnostics-color=always -D_FILE_OFFSET_BITS=64 -Wall -Winvalid-pch -Wextra -Werror -std=c11 -O2 -g -include rte_config.h -Wvla -Wcast-qual -Wdeprecated -Wformat -Wformat-nonliteral -Wformat-security -Wmissing-declarations -Wmissing-prototypes -Wnested-externs -Wold-style-definition -Wpointer-arith -Wshadow -Wsign-compare -Wstrict-prototypes -Wundef -Wwrite-strings -Wno-packed-not-aligned -Wno-missing-field-initializers -D_GNU_SOURCE -march=native -mrtm -DALLOW_EXPERIMENTAL_API -MD -MQ app/dpdk-testpmd.p/test-pmd_config.c.o -MF app/dpdk-testpmd.p/test-pmd_config.c.o.d -o app/dpdk-testpmd.p/test-pmd_config.c.o -c ../app/test-pmd/config.c
../app/test-pmd/config.c: In function ‘port_module_eeprom_decode_display’:
../app/test-pmd/config.c:1247:15: error: implicit declaration of function ‘rte_eth_module_eeprom_parse’ [-Werror=implicit-function-declaration]
1247 | ret = rte_eth_module_eeprom_parse(minfo.type, einfo.data, einfo.length,
| ^~~~~~~~~~~~~~~~~~~~~~~~~~~
../app/test-pmd/config.c:1247:15: error: nested extern declaration of ‘rte_eth_module_eeprom_parse’ [-Werror=nested-externs]
cc1: all warnings being treated as errors
[3245/3647] Compiling C object app/dpdk-testpmd.p/test-pmd_hairpin.c.o
[3246/3647] Linking target app/dpdk-test-flow-perf
[3247/3647] Linking target app/dpdk-test-fib
[3248/3647] Linking target app/dpdk-test-gpudev
[3249/3647] Compiling C object app/dpdk-testpmd.p/test-pmd_iofwd.c.o
[3250/3647] Compiling C object app/dpdk-testpmd.p/test-pmd_icmpecho.c.o
[3251/3647] Compiling C object app/dpdk-testpmd.p/test-pmd_ieee1588fwd.c.o
[3252/3647] Linking target app/dpdk-test-eventdev
[3253/3647] Linking target app/dpdk-test-mldev
ninja: build stopped
*Build Failed #10:
OS: SUSE16-64
Target: x86_64-native-linuxapp-clang
FAILED: app/dpdk-testpmd.p/test-pmd_config.c.o
clang -Iapp/dpdk-testpmd.p -Iapp -I../app -Iapp/test-pmd -I../app/test-pmd -Ilib/ethdev -I../lib/ethdev -Ilib/eal/common -I../lib/eal/common -I. -I.. -Iconfig -I../config -Ilib/eal/include -I../lib/eal/include -Ilib/eal/linux/include -I../lib/eal/linux/include -Ilib/eal/x86/include -I../lib/eal/x86/include -I../kernel/linux -Ilib/eal -I../lib/eal -Ilib/kvargs -I../lib/kvargs -Ilib/log -I../lib/log -Ilib/metrics -I../lib/metrics -Ilib/telemetry -I../lib/telemetry -Ilib/argparse -I../lib/argparse -Ilib/net -I../lib/net -Ilib/mbuf -I../lib/mbuf -Ilib/mempool -I../lib/mempool -Ilib/ring -I../lib/ring -Ilib/meter -I../lib/meter -Ilib/cmdline -I../lib/cmdline -Ilib/pci -I../lib/pci -Idrivers/crypto/scheduler -I../drivers/crypto/scheduler -Ilib/cryptodev -I../lib/cryptodev -Ilib/rcu -I../lib/rcu -Idrivers/bus/vdev -I../drivers/bus/vdev -Ilib/reorder -I../lib/reorder -Ilib/security -I../lib/security -Ilib/bitratestats -I../lib/bitratestats -Ilib/bpf -I../lib/bpf -Ilib/gro -I../lib/gro -Ilib/gso -I../lib/gso -Ilib/latencystats -I../lib/latencystats -Ilib/pdump -I../lib/pdump -Ilib/pcapng -I../lib/pcapng -Idrivers/net/bnxt -I../drivers/net/bnxt -Idrivers/net/bnxt/tf_ulp -I../drivers/net/bnxt/tf_ulp -Idrivers/net/bnxt/tf_ulp/generic_templates -I../drivers/net/bnxt/tf_ulp/generic_templates -Idrivers/net/bnxt/tf_core -I../drivers/net/bnxt/tf_core -Idrivers/net/bnxt/tf_core/v3 -I../drivers/net/bnxt/tf_core/v3 -Idrivers/net/bnxt/hcapi/cfa -I../drivers/net/bnxt/hcapi/cfa -Idrivers/net/bnxt/hcapi/cfa_v3 -I../drivers/net/bnxt/hcapi/cfa_v3 -I../drivers/net/bnxt/hcapi/cfa_v3/include -I../drivers/net/bnxt/hcapi/cfa_v3/include/platform/dpdk -I../drivers/net/bnxt/hcapi/cfa_v3/bld/p70 -I../drivers/net/bnxt/hcapi/cfa_v3/bld/p70/host -I../drivers/net/bnxt/hcapi/cfa_v3/bld/include -I../drivers/net/bnxt/hcapi/cfa_v3/bld/include/host -I../drivers/net/bnxt/hcapi/cfa_v3/bld/include/p70 -I../drivers/net/bnxt/hcapi/cfa_v3/mm/include -I../drivers/net/bnxt/hcapi/cfa_v3/tim/include -I../drivers/net/bnxt/hcapi/cfa_v3/tpm/include -Idrivers/bus/pci -I../drivers/bus/pci -I../drivers/bus/pci/linux -Ilib/hash -I../lib/hash -Idrivers/net/intel/i40e -I../drivers/net/intel/i40e -I../drivers/net/intel/i40e/base -Idrivers/net/intel/ixgbe -I../drivers/net/intel/ixgbe -I../drivers/net/intel/ixgbe/base -Idrivers/bus/dpaa -I../drivers/bus/dpaa -I../drivers/bus/dpaa/base -I../drivers/bus/dpaa/include -I../drivers/bus/dpaa/base/qbman -Idrivers/common/dpaax -I../drivers/common/dpaax -I../drivers/common/dpaax/caamflib -Ilib/eventdev -I../lib/eventdev -Ilib/timer -I../lib/timer -Ilib/dmadev -I../lib/dmadev -Idrivers/mempool/dpaa -I../drivers/mempool/dpaa -Idrivers/net/dpaa -I../drivers/net/dpaa -Idrivers/net/bonding -I../drivers/net/bonding -Ilib/sched -I../lib/sched -Ilib/ip_frag -I../lib/ip_frag -Idrivers/net/intel/iavf -I../drivers/net/intel/iavf -I../drivers/net/intel/iavf/base -Idrivers/net/intel/ice -I../drivers/net/intel/ice -I../drivers/net/intel/ice/base -fdiagnostics-color=always -D_FILE_OFFSET_BITS=64 -Wall -Winvalid-pch -Wextra -Werror -std=c11 -O3 -include rte_config.h -Wvla -Wcast-qual -Wcomma -Wdeprecated -Wformat -Wformat-nonliteral -Wformat-security -Wmissing-declarations -Wmissing-prototypes -Wnested-externs -Wold-style-definition -Wpointer-arith -Wshadow -Wsign-compare -Wstrict-prototypes -Wundef -Wwrite-strings -Wno-missing-field-initializers -D_GNU_SOURCE -march=native -mrtm -DALLOW_EXPERIMENTAL_API -MD -MQ app/dpdk-testpmd.p/test-pmd_config.c.o -MF app/dpdk-testpmd.p/test-pmd_config.c.o.d -o app/dpdk-testpmd.p/test-pmd_config.c.o -c ../app/test-pmd/config.c
../app/test-pmd/config.c:1247:8: error: call to undeclared function 'rte_eth_module_eeprom_parse'; ISO C99 and later do not support implicit function declarations [-Wimplicit-function-declaration]
1247 | ret = rte_eth_module_eeprom_parse(minfo.type, einfo.data, einfo.length,
| ^
1 error generated.
[3219/3629] Linking target app/dpdk-test-flow-perf
[3220/3629] Compiling C object app/dpdk-testpmd.p/test-pmd_cmdline_mtr.c.o
[3221/3629] Compiling C object app/dpdk-testpmd.p/test-pmd_cmdline.c.o
[3222/3629] Linking target app/dpdk-test-mldev
[3223/3629] Compiling C object app/dpdk-testpmd.p/test-pmd_flowgen.c.o
[3224/3629] Compiling C object app/dpdk-testpmd.p/test-pmd_hairpin.c.o
[3225/3629] Compiling C object app/dpdk-testpmd.p/test-pmd_cmdline_tm.c.o
[3226/3629] Compiling C object app/dpdk-testpmd.p/test-pmd_cmdline_flow.c.o
[3227/3629] Compiling C object app/dpdk-testpmd.p/test-pmd_csumonly.c.o
ninja: build stopped
*Build Failed #11:
OS: SUSE16-64
Target: x86_64-native-linuxapp-gcc
FAILED: app/dpdk-testpmd.p/test-pmd_config.c.o
gcc -Iapp/dpdk-testpmd.p -Iapp -I../app -Iapp/test-pmd -I../app/test-pmd -Ilib/ethdev -I../lib/ethdev -Ilib/eal/common -I../lib/eal/common -I. -I.. -Iconfig -I../config -Ilib/eal/include -I../lib/eal/include -Ilib/eal/linux/include -I../lib/eal/linux/include -Ilib/eal/x86/include -I../lib/eal/x86/include -I../kernel/linux -Ilib/eal -I../lib/eal -Ilib/kvargs -I../lib/kvargs -Ilib/log -I../lib/log -Ilib/metrics -I../lib/metrics -Ilib/telemetry -I../lib/telemetry -Ilib/argparse -I../lib/argparse -Ilib/net -I../lib/net -Ilib/mbuf -I../lib/mbuf -Ilib/mempool -I../lib/mempool -Ilib/ring -I../lib/ring -Ilib/meter -I../lib/meter -Ilib/cmdline -I../lib/cmdline -Ilib/pci -I../lib/pci -Idrivers/crypto/scheduler -I../drivers/crypto/scheduler -Ilib/cryptodev -I../lib/cryptodev -Ilib/rcu -I../lib/rcu -Idrivers/bus/vdev -I../drivers/bus/vdev -Ilib/reorder -I../lib/reorder -Ilib/security -I../lib/security -Ilib/bitratestats -I../lib/bitratestats -Ilib/bpf -I../lib/bpf -Ilib/gro -I../lib/gro -Ilib/gso -I../lib/gso -Ilib/latencystats -I../lib/latencystats -Ilib/pdump -I../lib/pdump -Ilib/pcapng -I../lib/pcapng -Idrivers/net/bnxt -I../drivers/net/bnxt -Idrivers/net/bnxt/tf_ulp -I../drivers/net/bnxt/tf_ulp -Idrivers/net/bnxt/tf_ulp/generic_templates -I../drivers/net/bnxt/tf_ulp/generic_templates -Idrivers/net/bnxt/tf_core -I../drivers/net/bnxt/tf_core -Idrivers/net/bnxt/tf_core/v3 -I../drivers/net/bnxt/tf_core/v3 -Idrivers/net/bnxt/hcapi/cfa -I../drivers/net/bnxt/hcapi/cfa -Idrivers/net/bnxt/hcapi/cfa_v3 -I../drivers/net/bnxt/hcapi/cfa_v3 -I../drivers/net/bnxt/hcapi/cfa_v3/include -I../drivers/net/bnxt/hcapi/cfa_v3/include/platform/dpdk -I../drivers/net/bnxt/hcapi/cfa_v3/bld/p70 -I../drivers/net/bnxt/hcapi/cfa_v3/bld/p70/host -I../drivers/net/bnxt/hcapi/cfa_v3/bld/include -I../drivers/net/bnxt/hcapi/cfa_v3/bld/include/host -I../drivers/net/bnxt/hcapi/cfa_v3/bld/include/p70 -I../drivers/net/bnxt/hcapi/cfa_v3/mm/include -I../drivers/net/bnxt/hcapi/cfa_v3/tim/include -I../drivers/net/bnxt/hcapi/cfa_v3/tpm/include -Idrivers/bus/pci -I../drivers/bus/pci -I../drivers/bus/pci/linux -Ilib/hash -I../lib/hash -Idrivers/net/intel/i40e -I../drivers/net/intel/i40e -I../drivers/net/intel/i40e/base -Idrivers/net/intel/ixgbe -I../drivers/net/intel/ixgbe -I../drivers/net/intel/ixgbe/base -Idrivers/bus/dpaa -I../drivers/bus/dpaa -I../drivers/bus/dpaa/base -I../drivers/bus/dpaa/include -I../drivers/bus/dpaa/base/qbman -Idrivers/common/dpaax -I../drivers/common/dpaax -I../drivers/common/dpaax/caamflib -Ilib/eventdev -I../lib/eventdev -Ilib/timer -I../lib/timer -Ilib/dmadev -I../lib/dmadev -Idrivers/mempool/dpaa -I../drivers/mempool/dpaa -Idrivers/net/dpaa -I../drivers/net/dpaa -Idrivers/net/bonding -I../drivers/net/bonding -Ilib/sched -I../lib/sched -Ilib/ip_frag -I../lib/ip_frag -Idrivers/net/intel/iavf -I../drivers/net/intel/iavf -I../drivers/net/intel/iavf/base -Idrivers/net/intel/ice -I../drivers/net/intel/ice -I../drivers/net/intel/ice/base -fdiagnostics-color=always -D_FILE_OFFSET_BITS=64 -Wall -Winvalid-pch -Wextra -Werror -std=c11 -O3 -include rte_config.h -Wvla -Wcast-qual -Wdeprecated -Wformat -Wformat-nonliteral -Wformat-security -Wmissing-declarations -Wmissing-prototypes -Wnested-externs -Wold-style-definition -Wpointer-arith -Wshadow -Wsign-compare -Wstrict-prototypes -Wundef -Wwrite-strings -Wno-packed-not-aligned -Wno-missing-field-initializers -fzero-init-padding-bits=all -D_GNU_SOURCE -march=native -mrtm -DALLOW_EXPERIMENTAL_API -MD -MQ app/dpdk-testpmd.p/test-pmd_config.c.o -MF app/dpdk-testpmd.p/test-pmd_config.c.o.d -o app/dpdk-testpmd.p/test-pmd_config.c.o -c ../app/test-pmd/config.c
../app/test-pmd/config.c: In function ‘port_module_eeprom_decode_display’:
../app/test-pmd/config.c:1247:15: error: implicit declaration of function ‘rte_eth_module_eeprom_parse’ [-Wimplicit-function-declaration]
1247 | ret = rte_eth_module_eeprom_parse(minfo.type, einfo.data, einfo.length,
| ^~~~~~~~~~~~~~~~~~~~~~~~~~~
../app/test-pmd/config.c:1247:15: error: nested extern declaration of ‘rte_eth_module_eeprom_parse’ [-Werror=nested-externs]
cc1: all warnings being treated as errors
[3226/3629] Linking target app/dpdk-test-mldev
[3227/3629] Compiling C object app/dpdk-testpmd.p/test-pmd_iofwd.c.o
[3228/3629] Compiling C object app/dpdk-testpmd.p/test-pmd_macfwd.c.o
[3229/3629] Compiling C object app/dpdk-testpmd.p/test-pmd_ieee1588fwd.c.o
[3230/3629] Compiling C object app/dpdk-testpmd.p/test-pmd_icmpecho.c.o
[3231/3629] Compiling C object app/dpdk-testpmd.p/test-pmd_macswap.c.o
[3232/3629] Compiling C object app/dpdk-testpmd.p/test-pmd_csumonly.c.o
[3233/3629] Compiling C object app/dpdk-testpmd.p/test-pmd_cmdline.c.o
[3234/3629] Compiling C object app/dpdk-testpmd.p/test-pmd_cmdline_flow.c.o
ninja: build stopped
*Build Failed #12:
OS: AzureLinux4.0-64
Target: x86_64-native-linuxapp-gcc
FAILED: app/dpdk-testpmd.p/test-pmd_config.c.o
gcc -Iapp/dpdk-testpmd.p -Iapp -I../app -Iapp/test-pmd -I../app/test-pmd -Ilib/ethdev -I../lib/ethdev -Ilib/eal/common -I../lib/eal/common -I. -I.. -Iconfig -I../config -Ilib/eal/include -I../lib/eal/include -Ilib/eal/linux/include -I../lib/eal/linux/include -Ilib/eal/x86/include -I../lib/eal/x86/include -I../kernel/linux -Ilib/eal -I../lib/eal -Ilib/kvargs -I../lib/kvargs -Ilib/log -I../lib/log -Ilib/metrics -I../lib/metrics -Ilib/telemetry -I../lib/telemetry -Ilib/argparse -I../lib/argparse -Ilib/net -I../lib/net -Ilib/mbuf -I../lib/mbuf -Ilib/mempool -I../lib/mempool -Ilib/ring -I../lib/ring -Ilib/meter -I../lib/meter -Ilib/cmdline -I../lib/cmdline -Ilib/pci -I../lib/pci -Idrivers/crypto/scheduler -I../drivers/crypto/scheduler -Ilib/cryptodev -I../lib/cryptodev -Ilib/rcu -I../lib/rcu -Idrivers/bus/vdev -I../drivers/bus/vdev -Ilib/reorder -I../lib/reorder -Ilib/security -I../lib/security -Ilib/bitratestats -I../lib/bitratestats -Ilib/bpf -I../lib/bpf -Ilib/gro -I../lib/gro -Ilib/gso -I../lib/gso -Ilib/latencystats -I../lib/latencystats -Ilib/pdump -I../lib/pdump -Ilib/pcapng -I../lib/pcapng -Idrivers/net/bnxt -I../drivers/net/bnxt -Idrivers/net/bnxt/tf_ulp -I../drivers/net/bnxt/tf_ulp -Idrivers/net/bnxt/tf_ulp/generic_templates -I../drivers/net/bnxt/tf_ulp/generic_templates -Idrivers/net/bnxt/tf_core -I../drivers/net/bnxt/tf_core -Idrivers/net/bnxt/tf_core/v3 -I../drivers/net/bnxt/tf_core/v3 -Idrivers/net/bnxt/hcapi/cfa -I../drivers/net/bnxt/hcapi/cfa -Idrivers/net/bnxt/hcapi/cfa_v3 -I../drivers/net/bnxt/hcapi/cfa_v3 -I../drivers/net/bnxt/hcapi/cfa_v3/include -I../drivers/net/bnxt/hcapi/cfa_v3/include/platform/dpdk -I../drivers/net/bnxt/hcapi/cfa_v3/bld/p70 -I../drivers/net/bnxt/hcapi/cfa_v3/bld/p70/host -I../drivers/net/bnxt/hcapi/cfa_v3/bld/include -I../drivers/net/bnxt/hcapi/cfa_v3/bld/include/host -I../drivers/net/bnxt/hcapi/cfa_v3/bld/include/p70 -I../drivers/net/bnxt/hcapi/cfa_v3/mm/include -I../drivers/net/bnxt/hcapi/cfa_v3/tim/include -I../drivers/net/bnxt/hcapi/cfa_v3/tpm/include -Idrivers/bus/pci -I../drivers/bus/pci -I../drivers/bus/pci/linux -Ilib/hash -I../lib/hash -Idrivers/net/intel/i40e -I../drivers/net/intel/i40e -I../drivers/net/intel/i40e/base -Idrivers/net/intel/ixgbe -I../drivers/net/intel/ixgbe -I../drivers/net/intel/ixgbe/base -Idrivers/bus/dpaa -I../drivers/bus/dpaa -I../drivers/bus/dpaa/base -I../drivers/bus/dpaa/include -I../drivers/bus/dpaa/base/qbman -Idrivers/common/dpaax -I../drivers/common/dpaax -I../drivers/common/dpaax/caamflib -Ilib/eventdev -I../lib/eventdev -Ilib/timer -I../lib/timer -Ilib/dmadev -I../lib/dmadev -Idrivers/mempool/dpaa -I../drivers/mempool/dpaa -Idrivers/net/dpaa -I../drivers/net/dpaa -Idrivers/net/bonding -I../drivers/net/bonding -Ilib/sched -I../lib/sched -Ilib/ip_frag -I../lib/ip_frag -Idrivers/net/intel/iavf -I../drivers/net/intel/iavf -I../drivers/net/intel/iavf/base -Idrivers/net/intel/ice -I../drivers/net/intel/ice -I../drivers/net/intel/ice/base -fdiagnostics-color=always -D_FILE_OFFSET_BITS=64 -Wall -Winvalid-pch -Wextra -Werror -std=c11 -O3 -include rte_config.h -Wvla -Wcast-qual -Wdeprecated -Wformat -Wformat-nonliteral -Wformat-security -Wmissing-declarations -Wmissing-prototypes -Wnested-externs -Wold-style-definition -Wpointer-arith -Wshadow -Wsign-compare -Wstrict-prototypes -Wundef -Wwrite-strings -Wno-packed-not-aligned -Wno-missing-field-initializers -fzero-init-padding-bits=all -D_GNU_SOURCE -DWITH_GZFILEOP -march=native -mrtm -DALLOW_EXPERIMENTAL_API -MD -MQ app/dpdk-testpmd.p/test-pmd_config.c.o -MF app/dpdk-testpmd.p/test-pmd_config.c.o.d -o app/dpdk-testpmd.p/test-pmd_config.c.o -c ../app/test-pmd/config.c
../app/test-pmd/config.c: In function ‘port_module_eeprom_decode_display’:
../app/test-pmd/config.c:1247:15: error: implicit declaration of function ‘rte_eth_module_eeprom_parse’ [-Wimplicit-function-declaration]
1247 | ret = rte_eth_module_eeprom_parse(minfo.type, einfo.data, einfo.length,
| ^~~~~~~~~~~~~~~~~~~~~~~~~~~
../app/test-pmd/config.c:1247:15: error: nested extern declaration of ‘rte_eth_module_eeprom_parse’ [-Werror=nested-externs]
cc1: all warnings being treated as errors
[3243/3647] Compiling C object app/dpdk-testpmd.p/test-pmd_cmdline_mtr.c.o
[3244/3647] Linking target app/dpdk-test-mldev
[3245/3647] Linking target app/dpdk-test-eventdev
[3246/3647] Compiling C object app/dpdk-testpmd.p/test-pmd_hairpin.c.o
[3247/3647] Compiling C object app/dpdk-testpmd.p/test-pmd_cmdline_tm.c.o
[3248/3647] Compiling C object app/dpdk-testpmd.p/test-pmd_flowgen.c.o
[3249/3647] Compiling C object app/dpdk-testpmd.p/test-pmd_cmdline.c.o
[3250/3647] Compiling C object app/dpdk-testpmd.p/test-pmd_csumonly.c.o
[3251/3647] Compiling C object app/dpdk-testpmd.p/test-pmd_cmdline_flow.c.o
ninja: build stopped
*Build Failed #13:
OS: UB2604-32
Target: i686-native-linuxapp-gcc
FAILED: app/dpdk-testpmd.p/test-pmd_config.c.o
gcc -Iapp/dpdk-testpmd.p -Iapp -I../app -Iapp/test-pmd -I../app/test-pmd -Ilib/ethdev -I../lib/ethdev -Ilib/eal/common -I../lib/eal/common -I. -I.. -Iconfig -I../config -Ilib/eal/include -I../lib/eal/include -Ilib/eal/linux/include -I../lib/eal/linux/include -Ilib/eal/x86/include -I../lib/eal/x86/include -I../kernel/linux -Ilib/eal -I../lib/eal -Ilib/kvargs -I../lib/kvargs -Ilib/log -I../lib/log -Ilib/metrics -I../lib/metrics -Ilib/telemetry -I../lib/telemetry -Ilib/argparse -I../lib/argparse -Ilib/net -I../lib/net -Ilib/mbuf -I../lib/mbuf -Ilib/mempool -I../lib/mempool -Ilib/ring -I../lib/ring -Ilib/meter -I../lib/meter -Ilib/cmdline -I../lib/cmdline -Ilib/pci -I../lib/pci -Idrivers/crypto/scheduler -I../drivers/crypto/scheduler -Ilib/cryptodev -I../lib/cryptodev -Ilib/rcu -I../lib/rcu -Idrivers/bus/vdev -I../drivers/bus/vdev -Ilib/reorder -I../lib/reorder -Ilib/security -I../lib/security -Ilib/bitratestats -I../lib/bitratestats -Ilib/gro -I../lib/gro -Ilib/gso -I../lib/gso -Ilib/latencystats -I../lib/latencystats -Idrivers/net/bnxt -I../drivers/net/bnxt -Idrivers/net/bnxt/tf_ulp -I../drivers/net/bnxt/tf_ulp -Idrivers/net/bnxt/tf_ulp/generic_templates -I../drivers/net/bnxt/tf_ulp/generic_templates -Idrivers/net/bnxt/tf_core -I../drivers/net/bnxt/tf_core -Idrivers/net/bnxt/tf_core/v3 -I../drivers/net/bnxt/tf_core/v3 -Idrivers/net/bnxt/hcapi/cfa -I../drivers/net/bnxt/hcapi/cfa -Idrivers/net/bnxt/hcapi/cfa_v3 -I../drivers/net/bnxt/hcapi/cfa_v3 -I../drivers/net/bnxt/hcapi/cfa_v3/include -I../drivers/net/bnxt/hcapi/cfa_v3/include/platform/dpdk -I../drivers/net/bnxt/hcapi/cfa_v3/bld/p70 -I../drivers/net/bnxt/hcapi/cfa_v3/bld/p70/host -I../drivers/net/bnxt/hcapi/cfa_v3/bld/include -I../drivers/net/bnxt/hcapi/cfa_v3/bld/include/host -I../drivers/net/bnxt/hcapi/cfa_v3/bld/include/p70 -I../drivers/net/bnxt/hcapi/cfa_v3/mm/include -I../drivers/net/bnxt/hcapi/cfa_v3/tim/include -I../drivers/net/bnxt/hcapi/cfa_v3/tpm/include -Idrivers/bus/pci -I../drivers/bus/pci -I../drivers/bus/pci/linux -Ilib/hash -I../lib/hash -Idrivers/net/intel/i40e -I../drivers/net/intel/i40e -I../drivers/net/intel/i40e/base -Idrivers/net/intel/ixgbe -I../drivers/net/intel/ixgbe -I../drivers/net/intel/ixgbe/base -Idrivers/bus/dpaa -I../drivers/bus/dpaa -I../drivers/bus/dpaa/base -I../drivers/bus/dpaa/include -I../drivers/bus/dpaa/base/qbman -Idrivers/common/dpaax -I../drivers/common/dpaax -I../drivers/common/dpaax/caamflib -Ilib/eventdev -I../lib/eventdev -Ilib/timer -I../lib/timer -Ilib/dmadev -I../lib/dmadev -Idrivers/mempool/dpaa -I../drivers/mempool/dpaa -Idrivers/net/dpaa -I../drivers/net/dpaa -Idrivers/net/bonding -I../drivers/net/bonding -Ilib/sched -I../lib/sched -Ilib/ip_frag -I../lib/ip_frag -Idrivers/net/intel/iavf -I../drivers/net/intel/iavf -I../drivers/net/intel/iavf/base -Idrivers/net/intel/ice -I../drivers/net/intel/ice -I../drivers/net/intel/ice/base -fdiagnostics-color=always -D_FILE_OFFSET_BITS=64 -Wall -Winvalid-pch -Wextra -Werror -std=c11 -O3 -include rte_config.h -Wvla -Wcast-qual -Wdeprecated -Wformat -Wformat-nonliteral -Wformat-security -Wmissing-declarations -Wmissing-prototypes -Wnested-externs -Wold-style-definition -Wpointer-arith -Wshadow -Wsign-compare -Wstrict-prototypes -Wundef -Wwrite-strings -Wno-packed-not-aligned -Wno-missing-field-initializers -fzero-init-padding-bits=all -Wno-pointer-to-int-cast -D_GNU_SOURCE -m32 -march=native -mrtm -DALLOW_EXPERIMENTAL_API -MD -MQ app/dpdk-testpmd.p/test-pmd_config.c.o -MF app/dpdk-testpmd.p/test-pmd_config.c.o.d -o app/dpdk-testpmd.p/test-pmd_config.c.o -c ../app/test-pmd/config.c
../app/test-pmd/config.c: In function ‘port_module_eeprom_decode_display’:
../app/test-pmd/config.c:1247:15: error: implicit declaration of function ‘rte_eth_module_eeprom_parse’ [-Wimplicit-function-declaration]
1247 | ret = rte_eth_module_eeprom_parse(minfo.type, einfo.data, einfo.length,
| ^~~~~~~~~~~~~~~~~~~~~~~~~~~
../app/test-pmd/config.c:1247:15: error: nested extern declaration of ‘rte_eth_module_eeprom_parse’ [-Werror=nested-externs]
cc1: all warnings being treated as errors
[2337/2741] Compiling C object app/dpdk-testpmd.p/test-pmd_cmdline_mtr.c.o
[2338/2741] Compiling C object app/dpdk-testpmd.p/test-pmd_icmpecho.c.o
[2339/2741] Compiling C object app/dpdk-testpmd.p/test-pmd_ieee1588fwd.c.o
[2340/2741] Compiling C object app/dpdk-testpmd.p/test-pmd_flowgen.c.o
[2341/2741] Compiling C object app/dpdk-testpmd.p/test-pmd_cmdline_tm.c.o
[2342/2741] Linking target app/dpdk-test-eventdev
[2343/2741] Compiling C object app/dpdk-test-mldev.p/test-mldev_test_inference_common.c.o
[2344/2741] Compiling C object app/dpdk-testpmd.p/test-pmd_csumonly.c.o
[2345/2741] Compiling C object app/dpdk-testpmd.p/test-pmd_cmdline.c.o
ninja: build stopped
*Build Failed #14:
OS: RHEL10.2-64
Target: x86_64-native-linuxapp-gcc
FAILED: app/dpdk-testpmd.p/test-pmd_config.c.o
gcc -Iapp/dpdk-testpmd.p -Iapp -I../app -Iapp/test-pmd -I../app/test-pmd -Ilib/ethdev -I../lib/ethdev -Ilib/eal/common -I../lib/eal/common -I. -I.. -Iconfig -I../config -Ilib/eal/include -I../lib/eal/include -Ilib/eal/linux/include -I../lib/eal/linux/include -Ilib/eal/x86/include -I../lib/eal/x86/include -I../kernel/linux -Ilib/eal -I../lib/eal -Ilib/kvargs -I../lib/kvargs -Ilib/log -I../lib/log -Ilib/metrics -I../lib/metrics -Ilib/telemetry -I../lib/telemetry -Ilib/argparse -I../lib/argparse -Ilib/net -I../lib/net -Ilib/mbuf -I../lib/mbuf -Ilib/mempool -I../lib/mempool -Ilib/ring -I../lib/ring -Ilib/meter -I../lib/meter -Ilib/cmdline -I../lib/cmdline -Ilib/pci -I../lib/pci -Idrivers/crypto/scheduler -I../drivers/crypto/scheduler -Ilib/cryptodev -I../lib/cryptodev -Ilib/rcu -I../lib/rcu -Idrivers/bus/vdev -I../drivers/bus/vdev -Ilib/reorder -I../lib/reorder -Ilib/security -I../lib/security -Ilib/bitratestats -I../lib/bitratestats -Ilib/bpf -I../lib/bpf -Ilib/gro -I../lib/gro -Ilib/gso -I../lib/gso -Ilib/latencystats -I../lib/latencystats -Ilib/pdump -I../lib/pdump -Ilib/pcapng -I../lib/pcapng -Idrivers/net/bnxt -I../drivers/net/bnxt -Idrivers/net/bnxt/tf_ulp -I../drivers/net/bnxt/tf_ulp -Idrivers/net/bnxt/tf_ulp/generic_templates -I../drivers/net/bnxt/tf_ulp/generic_templates -Idrivers/net/bnxt/tf_core -I../drivers/net/bnxt/tf_core -Idrivers/net/bnxt/tf_core/v3 -I../drivers/net/bnxt/tf_core/v3 -Idrivers/net/bnxt/hcapi/cfa -I../drivers/net/bnxt/hcapi/cfa -Idrivers/net/bnxt/hcapi/cfa_v3 -I../drivers/net/bnxt/hcapi/cfa_v3 -I../drivers/net/bnxt/hcapi/cfa_v3/include -I../drivers/net/bnxt/hcapi/cfa_v3/include/platform/dpdk -I../drivers/net/bnxt/hcapi/cfa_v3/bld/p70 -I../drivers/net/bnxt/hcapi/cfa_v3/bld/p70/host -I../drivers/net/bnxt/hcapi/cfa_v3/bld/include -I../drivers/net/bnxt/hcapi/cfa_v3/bld/include/host -I../drivers/net/bnxt/hcapi/cfa_v3/bld/include/p70 -I../drivers/net/bnxt/hcapi/cfa_v3/mm/include -I../drivers/net/bnxt/hcapi/cfa_v3/tim/include -I../drivers/net/bnxt/hcapi/cfa_v3/tpm/include -Idrivers/bus/pci -I../drivers/bus/pci -I../drivers/bus/pci/linux -Ilib/hash -I../lib/hash -Idrivers/net/intel/i40e -I../drivers/net/intel/i40e -I../drivers/net/intel/i40e/base -Idrivers/net/intel/ixgbe -I../drivers/net/intel/ixgbe -I../drivers/net/intel/ixgbe/base -Idrivers/bus/dpaa -I../drivers/bus/dpaa -I../drivers/bus/dpaa/base -I../drivers/bus/dpaa/include -I../drivers/bus/dpaa/base/qbman -Idrivers/common/dpaax -I../drivers/common/dpaax -I../drivers/common/dpaax/caamflib -Ilib/eventdev -I../lib/eventdev -Ilib/timer -I../lib/timer -Ilib/dmadev -I../lib/dmadev -Idrivers/mempool/dpaa -I../drivers/mempool/dpaa -Idrivers/net/dpaa -I../drivers/net/dpaa -Idrivers/net/bonding -I../drivers/net/bonding -Ilib/sched -I../lib/sched -Ilib/ip_frag -I../lib/ip_frag -Idrivers/net/intel/iavf -I../drivers/net/intel/iavf -I../drivers/net/intel/iavf/base -Idrivers/net/intel/ice -I../drivers/net/intel/ice -I../drivers/net/intel/ice/base -fdiagnostics-color=always -D_FILE_OFFSET_BITS=64 -Wall -Winvalid-pch -Wextra -Werror -std=c11 -O3 -include rte_config.h -Wvla -Wcast-qual -Wdeprecated -Wformat -Wformat-nonliteral -Wformat-security -Wmissing-declarations -Wmissing-prototypes -Wnested-externs -Wold-style-definition -Wpointer-arith -Wshadow -Wsign-compare -Wstrict-prototypes -Wundef -Wwrite-strings -Wno-packed-not-aligned -Wno-missing-field-initializers -D_GNU_SOURCE -DWITH_GZFILEOP -march=native -mrtm -DALLOW_EXPERIMENTAL_API -MD -MQ app/dpdk-testpmd.p/test-pmd_config.c.o -MF app/dpdk-testpmd.p/test-pmd_config.c.o.d -o app/dpdk-testpmd.p/test-pmd_config.c.o -c ../app/test-pmd/config.c
../app/test-pmd/config.c: In function ‘port_module_eeprom_decode_display’:
../app/test-pmd/config.c:1247:15: error: implicit declaration of function ‘rte_eth_module_eeprom_parse’ [-Wimplicit-function-declaration]
1247 | ret = rte_eth_module_eeprom_parse(minfo.type, einfo.data, einfo.length,
| ^~~~~~~~~~~~~~~~~~~~~~~~~~~
../app/test-pmd/config.c:1247:15: error: nested extern declaration of ‘rte_eth_module_eeprom_parse’ [-Werror=nested-externs]
cc1: all warnings being treated as errors
[3243/3647] Compiling C object app/dpdk-test-mldev.p/test-mldev_test_inference_common.c.o
[3244/3647] Compiling C object app/dpdk-testpmd.p/test-pmd_hairpin.c.o
[3245/3647] Compiling C object app/dpdk-testpmd.p/test-pmd_flowgen.c.o
[3246/3647] Compiling C object app/dpdk-testpmd.p/test-pmd_iofwd.c.o
[3247/3647] Compiling C object app/dpdk-testpmd.p/test-pmd_icmpecho.c.o
[3248/3647] Compiling C object app/dpdk-testpmd.p/test-pmd_ieee1588fwd.c.o
[3249/3647] Compiling C object app/dpdk-testpmd.p/test-pmd_csumonly.c.o
[3250/3647] Compiling C object app/dpdk-testpmd.p/test-pmd_cmdline.c.o
[3251/3647] Compiling C object app/dpdk-testpmd.p/test-pmd_cmdline_flow.c.o
ninja: build stopped
*Build Failed #15:
OS: UB2604-64
Target: x86_64-native-linuxapp-gcc+16byte
FAILED: app/dpdk-testpmd.p/test-pmd_config.c.o
gcc -Iapp/dpdk-testpmd.p -Iapp -I../app -Iapp/test-pmd -I../app/test-pmd -Ilib/ethdev -I../lib/ethdev -Ilib/eal/common -I../lib/eal/common -I. -I.. -Iconfig -I../config -Ilib/eal/include -I../lib/eal/include -Ilib/eal/linux/include -I../lib/eal/linux/include -Ilib/eal/x86/include -I../lib/eal/x86/include -I../kernel/linux -Ilib/eal -I../lib/eal -Ilib/kvargs -I../lib/kvargs -Ilib/log -I../lib/log -Ilib/metrics -I../lib/metrics -Ilib/telemetry -I../lib/telemetry -Ilib/argparse -I../lib/argparse -Ilib/net -I../lib/net -Ilib/mbuf -I../lib/mbuf -Ilib/mempool -I../lib/mempool -Ilib/ring -I../lib/ring -Ilib/meter -I../lib/meter -Ilib/cmdline -I../lib/cmdline -Ilib/pci -I../lib/pci -Idrivers/crypto/scheduler -I../drivers/crypto/scheduler -Ilib/cryptodev -I../lib/cryptodev -Ilib/rcu -I../lib/rcu -Idrivers/bus/vdev -I../drivers/bus/vdev -Ilib/reorder -I../lib/reorder -Ilib/security -I../lib/security -Ilib/bitratestats -I../lib/bitratestats -Ilib/bpf -I../lib/bpf -Ilib/gro -I../lib/gro -Ilib/gso -I../lib/gso -Ilib/latencystats -I../lib/latencystats -Ilib/pdump -I../lib/pdump -Ilib/pcapng -I../lib/pcapng -Idrivers/net/bnxt -I../drivers/net/bnxt -Idrivers/net/bnxt/tf_ulp -I../drivers/net/bnxt/tf_ulp -Idrivers/net/bnxt/tf_ulp/generic_templates -I../drivers/net/bnxt/tf_ulp/generic_templates -Idrivers/net/bnxt/tf_core -I../drivers/net/bnxt/tf_core -Idrivers/net/bnxt/tf_core/v3 -I../drivers/net/bnxt/tf_core/v3 -Idrivers/net/bnxt/hcapi/cfa -I../drivers/net/bnxt/hcapi/cfa -Idrivers/net/bnxt/hcapi/cfa_v3 -I../drivers/net/bnxt/hcapi/cfa_v3 -I../drivers/net/bnxt/hcapi/cfa_v3/include -I../drivers/net/bnxt/hcapi/cfa_v3/include/platform/dpdk -I../drivers/net/bnxt/hcapi/cfa_v3/bld/p70 -I../drivers/net/bnxt/hcapi/cfa_v3/bld/p70/host -I../drivers/net/bnxt/hcapi/cfa_v3/bld/include -I../drivers/net/bnxt/hcapi/cfa_v3/bld/include/host -I../drivers/net/bnxt/hcapi/cfa_v3/bld/include/p70 -I../drivers/net/bnxt/hcapi/cfa_v3/mm/include -I../drivers/net/bnxt/hcapi/cfa_v3/tim/include -I../drivers/net/bnxt/hcapi/cfa_v3/tpm/include -Idrivers/bus/pci -I../drivers/bus/pci -I../drivers/bus/pci/linux -Ilib/hash -I../lib/hash -Idrivers/net/intel/i40e -I../drivers/net/intel/i40e -I../drivers/net/intel/i40e/base -Idrivers/net/intel/ixgbe -I../drivers/net/intel/ixgbe -I../drivers/net/intel/ixgbe/base -Idrivers/bus/dpaa -I../drivers/bus/dpaa -I../drivers/bus/dpaa/base -I../drivers/bus/dpaa/include -I../drivers/bus/dpaa/base/qbman -Idrivers/common/dpaax -I../drivers/common/dpaax -I../drivers/common/dpaax/caamflib -Ilib/eventdev -I../lib/eventdev -Ilib/timer -I../lib/timer -Ilib/dmadev -I../lib/dmadev -Idrivers/mempool/dpaa -I../drivers/mempool/dpaa -Idrivers/net/dpaa -I../drivers/net/dpaa -Idrivers/net/bonding -I../drivers/net/bonding -Ilib/sched -I../lib/sched -Ilib/ip_frag -I../lib/ip_frag -Idrivers/net/intel/iavf -I../drivers/net/intel/iavf -I../drivers/net/intel/iavf/base -Idrivers/net/intel/ice -I../drivers/net/intel/ice -I../drivers/net/intel/ice/base -Idrivers/net/mlx5 -I../drivers/net/mlx5 -Idrivers/net/mlx5/linux -I../drivers/net/mlx5/linux -Idrivers/net/mlx5/hws -I../drivers/net/mlx5/hws -Idrivers/common/mlx5 -I../drivers/common/mlx5 -Idrivers/common/mlx5/linux -I../drivers/common/mlx5/linux -Idrivers/bus/auxiliary -I../drivers/bus/auxiliary -I/usr/include/dbus-1.0 -I/usr/lib/x86_64-linux-gnu/dbus-1.0/include -I/usr/include/libnl3 -fdiagnostics-color=always -D_FILE_OFFSET_BITS=64 -Wall -Winvalid-pch -Wextra -Werror -std=c11 -O3 -include rte_config.h -Wvla -Wcast-qual -Wdeprecated -Wformat -Wformat-nonliteral -Wformat-security -Wmissing-declarations -Wmissing-prototypes -Wnested-externs -Wold-style-definition -Wpointer-arith -Wshadow -Wsign-compare -Wstrict-prototypes -Wundef -Wwrite-strings -Wno-packed-not-aligned -Wno-missing-field-initializers -fzero-init-padding-bits=all -D_GNU_SOURCE -DRTE_LIBRTE_I40E_16BYTE_RX_DESC -DRTE_LIBRTE_ICE_16BYTE_RX_DESC -march=native -mrtm -DALLOW_EXPERIMENTAL_API -MD -MQ app/dpdk-testpmd.p/test-pmd_config.c.o -MF app/dpdk-testpmd.p/test-pmd_config.c.o.d -o app/dpdk-testpmd.p/test-pmd_config.c.o -c ../app/test-pmd/config.c
../app/test-pmd/config.c: In function ‘port_module_eeprom_decode_display’:
../app/test-pmd/config.c:1247:15: error: implicit declaration of function ‘rte_eth_module_eeprom_parse’ [-Wimplicit-function-declaration]
1247 | ret = rte_eth_module_eeprom_parse(minfo.type, einfo.data, einfo.length,
| ^~~~~~~~~~~~~~~~~~~~~~~~~~~
../app/test-pmd/config.c:1247:15: error: nested extern declaration of ‘rte_eth_module_eeprom_parse’ [-Werror=nested-externs]
cc1: all warnings being treated as errors
[3491/3888] Compiling C object app/dpdk-testpmd.p/test-pmd_csumonly.c.o
[3492/3888] Compiling C object app/dpdk-testpmd.p/test-pmd_iofwd.c.o
[3493/3888] Compiling C object app/dpdk-testpmd.p/test-pmd_macfwd.c.o
[3494/3888] Compiling C object app/dpdk-testpmd.p/test-pmd_ieee1588fwd.c.o
[3495/3888] Compiling C object app/dpdk-testpmd.p/test-pmd_cmdline.c.o
[3496/3888] Compiling C object app/dpdk-testpmd.p/test-pmd_macswap.c.o
[3497/3888] Linking target app/dpdk-test-mldev
[3498/3888] Compiling C object app/dpdk-testpmd.p/test-pmd_cmdline_flow.c.o
[3499/3888] Compiling C object app/dpdk-testpmd.p/test-pmd_noisy_vnf.c.o
ninja: build stopped
*Build Failed #16:
OS: UB2604-64
Target: x86_64-native-linuxapp-gcc
FAILED: app/dpdk-testpmd.p/test-pmd_config.c.o
gcc -Iapp/dpdk-testpmd.p -Iapp -I../app -Iapp/test-pmd -I../app/test-pmd -Ilib/ethdev -I../lib/ethdev -Ilib/eal/common -I../lib/eal/common -I. -I.. -Iconfig -I../config -Ilib/eal/include -I../lib/eal/include -Ilib/eal/linux/include -I../lib/eal/linux/include -Ilib/eal/x86/include -I../lib/eal/x86/include -I../kernel/linux -Ilib/eal -I../lib/eal -Ilib/kvargs -I../lib/kvargs -Ilib/log -I../lib/log -Ilib/metrics -I../lib/metrics -Ilib/telemetry -I../lib/telemetry -Ilib/argparse -I../lib/argparse -Ilib/net -I../lib/net -Ilib/mbuf -I../lib/mbuf -Ilib/mempool -I../lib/mempool -Ilib/ring -I../lib/ring -Ilib/meter -I../lib/meter -Ilib/cmdline -I../lib/cmdline -Ilib/pci -I../lib/pci -Idrivers/crypto/scheduler -I../drivers/crypto/scheduler -Ilib/cryptodev -I../lib/cryptodev -Ilib/rcu -I../lib/rcu -Idrivers/bus/vdev -I../drivers/bus/vdev -Ilib/reorder -I../lib/reorder -Ilib/security -I../lib/security -Ilib/bitratestats -I../lib/bitratestats -Ilib/bpf -I../lib/bpf -Ilib/gro -I../lib/gro -Ilib/gso -I../lib/gso -Ilib/latencystats -I../lib/latencystats -Ilib/pdump -I../lib/pdump -Ilib/pcapng -I../lib/pcapng -Idrivers/net/bnxt -I../drivers/net/bnxt -Idrivers/net/bnxt/tf_ulp -I../drivers/net/bnxt/tf_ulp -Idrivers/net/bnxt/tf_ulp/generic_templates -I../drivers/net/bnxt/tf_ulp/generic_templates -Idrivers/net/bnxt/tf_core -I../drivers/net/bnxt/tf_core -Idrivers/net/bnxt/tf_core/v3 -I../drivers/net/bnxt/tf_core/v3 -Idrivers/net/bnxt/hcapi/cfa -I../drivers/net/bnxt/hcapi/cfa -Idrivers/net/bnxt/hcapi/cfa_v3 -I../drivers/net/bnxt/hcapi/cfa_v3 -I../drivers/net/bnxt/hcapi/cfa_v3/include -I../drivers/net/bnxt/hcapi/cfa_v3/include/platform/dpdk -I../drivers/net/bnxt/hcapi/cfa_v3/bld/p70 -I../drivers/net/bnxt/hcapi/cfa_v3/bld/p70/host -I../drivers/net/bnxt/hcapi/cfa_v3/bld/include -I../drivers/net/bnxt/hcapi/cfa_v3/bld/include/host -I../drivers/net/bnxt/hcapi/cfa_v3/bld/include/p70 -I../drivers/net/bnxt/hcapi/cfa_v3/mm/include -I../drivers/net/bnxt/hcapi/cfa_v3/tim/include -I../drivers/net/bnxt/hcapi/cfa_v3/tpm/include -Idrivers/bus/pci -I../drivers/bus/pci -I../drivers/bus/pci/linux -Ilib/hash -I../lib/hash -Idrivers/net/intel/i40e -I../drivers/net/intel/i40e -I../drivers/net/intel/i40e/base -Idrivers/net/intel/ixgbe -I../drivers/net/intel/ixgbe -I../drivers/net/intel/ixgbe/base -Idrivers/bus/dpaa -I../drivers/bus/dpaa -I../drivers/bus/dpaa/base -I../drivers/bus/dpaa/include -I../drivers/bus/dpaa/base/qbman -Idrivers/common/dpaax -I../drivers/common/dpaax -I../drivers/common/dpaax/caamflib -Ilib/eventdev -I../lib/eventdev -Ilib/timer -I../lib/timer -Ilib/dmadev -I../lib/dmadev -Idrivers/mempool/dpaa -I../drivers/mempool/dpaa -Idrivers/net/dpaa -I../drivers/net/dpaa -Idrivers/net/bonding -I../drivers/net/bonding -Ilib/sched -I../lib/sched -Ilib/ip_frag -I../lib/ip_frag -Idrivers/net/intel/iavf -I../drivers/net/intel/iavf -I../drivers/net/intel/iavf/base -Idrivers/net/intel/ice -I../drivers/net/intel/ice -I../drivers/net/intel/ice/base -Idrivers/net/mlx5 -I../drivers/net/mlx5 -Idrivers/net/mlx5/linux -I../drivers/net/mlx5/linux -Idrivers/net/mlx5/hws -I../drivers/net/mlx5/hws -Idrivers/common/mlx5 -I../drivers/common/mlx5 -Idrivers/common/mlx5/linux -I../drivers/common/mlx5/linux -Idrivers/bus/auxiliary -I../drivers/bus/auxiliary -I/usr/include/dbus-1.0 -I/usr/lib/x86_64-linux-gnu/dbus-1.0/include -I/usr/include/libnl3 -fdiagnostics-color=always -D_FILE_OFFSET_BITS=64 -Wall -Winvalid-pch -Wextra -Werror -std=c11 -O3 -include rte_config.h -Wvla -Wcast-qual -Wdeprecated -Wformat -Wformat-nonliteral -Wformat-security -Wmissing-declarations -Wmissing-prototypes -Wnested-externs -Wold-style-definition -Wpointer-arith -Wshadow -Wsign-compare -Wstrict-prototypes -Wundef -Wwrite-strings -Wno-packed-not-aligned -Wno-missing-field-initializers -fzero-init-padding-bits=all -D_GNU_SOURCE -march=native -mrtm -DALLOW_EXPERIMENTAL_API -MD -MQ app/dpdk-testpmd.p/test-pmd_config.c.o -MF app/dpdk-testpmd.p/test-pmd_config.c.o.d -o app/dpdk-testpmd.p/test-pmd_config.c.o -c ../app/test-pmd/config.c
../app/test-pmd/config.c: In function ‘port_module_eeprom_decode_display’:
../app/test-pmd/config.c:1247:15: error: implicit declaration of function ‘rte_eth_module_eeprom_parse’ [-Wimplicit-function-declaration]
1247 | ret = rte_eth_module_eeprom_parse(minfo.type, einfo.data, einfo.length,
| ^~~~~~~~~~~~~~~~~~~~~~~~~~~
../app/test-pmd/config.c:1247:15: error: nested extern declaration of ‘rte_eth_module_eeprom_parse’ [-Werror=nested-externs]
cc1: all warnings being treated as errors
[3492/3888] Compiling C object app/dpdk-testpmd.p/test-pmd_flowgen.c.o
[3493/3888] Compiling C object app/dpdk-testpmd.p/test-pmd_cmdline.c.o
[3494/3888] Compiling C object app/dpdk-testpmd.p/test-pmd_iofwd.c.o
[3495/3888] Compiling C object app/dpdk-testpmd.p/test-pmd_ieee1588fwd.c.o
[3496/3888] Compiling C object app/dpdk-testpmd.p/test-pmd_macfwd.c.o
[3497/3888] Linking target app/dpdk-test-mldev
[3498/3888] Compiling C object app/dpdk-testpmd.p/test-pmd_macswap.c.o
[3499/3888] Compiling C object app/dpdk-testpmd.p/test-pmd_csumonly.c.o
[3500/3888] Compiling C object app/dpdk-testpmd.p/test-pmd_cmdline_flow.c.o
ninja: build stopped
*Build Failed #17:
OS: UB2604-64
Target: x86_64-native-linuxapp-clang
FAILED: app/dpdk-testpmd.p/test-pmd_config.c.o
clang -Iapp/dpdk-testpmd.p -Iapp -I../app -Iapp/test-pmd -I../app/test-pmd -Ilib/ethdev -I../lib/ethdev -Ilib/eal/common -I../lib/eal/common -I. -I.. -Iconfig -I../config -Ilib/eal/include -I../lib/eal/include -Ilib/eal/linux/include -I../lib/eal/linux/include -Ilib/eal/x86/include -I../lib/eal/x86/include -I../kernel/linux -Ilib/eal -I../lib/eal -Ilib/kvargs -I../lib/kvargs -Ilib/log -I../lib/log -Ilib/metrics -I../lib/metrics -Ilib/telemetry -I../lib/telemetry -Ilib/argparse -I../lib/argparse -Ilib/net -I../lib/net -Ilib/mbuf -I../lib/mbuf -Ilib/mempool -I../lib/mempool -Ilib/ring -I../lib/ring -Ilib/meter -I../lib/meter -Ilib/cmdline -I../lib/cmdline -Ilib/pci -I../lib/pci -Idrivers/crypto/scheduler -I../drivers/crypto/scheduler -Ilib/cryptodev -I../lib/cryptodev -Ilib/rcu -I../lib/rcu -Idrivers/bus/vdev -I../drivers/bus/vdev -Ilib/reorder -I../lib/reorder -Ilib/security -I../lib/security -Ilib/bitratestats -I../lib/bitratestats -Ilib/bpf -I../lib/bpf -Ilib/gro -I../lib/gro -Ilib/gso -I../lib/gso -Ilib/latencystats -I../lib/latencystats -Ilib/pdump -I../lib/pdump -Ilib/pcapng -I../lib/pcapng -Idrivers/net/bnxt -I../drivers/net/bnxt -Idrivers/net/bnxt/tf_ulp -I../drivers/net/bnxt/tf_ulp -Idrivers/net/bnxt/tf_ulp/generic_templates -I../drivers/net/bnxt/tf_ulp/generic_templates -Idrivers/net/bnxt/tf_core -I../drivers/net/bnxt/tf_core -Idrivers/net/bnxt/tf_core/v3 -I../drivers/net/bnxt/tf_core/v3 -Idrivers/net/bnxt/hcapi/cfa -I../drivers/net/bnxt/hcapi/cfa -Idrivers/net/bnxt/hcapi/cfa_v3 -I../drivers/net/bnxt/hcapi/cfa_v3 -I../drivers/net/bnxt/hcapi/cfa_v3/include -I../drivers/net/bnxt/hcapi/cfa_v3/include/platform/dpdk -I../drivers/net/bnxt/hcapi/cfa_v3/bld/p70 -I../drivers/net/bnxt/hcapi/cfa_v3/bld/p70/host -I../drivers/net/bnxt/hcapi/cfa_v3/bld/include -I../drivers/net/bnxt/hcapi/cfa_v3/bld/include/host -I../drivers/net/bnxt/hcapi/cfa_v3/bld/include/p70 -I../drivers/net/bnxt/hcapi/cfa_v3/mm/include -I../drivers/net/bnxt/hcapi/cfa_v3/tim/include -I../drivers/net/bnxt/hcapi/cfa_v3/tpm/include -Idrivers/bus/pci -I../drivers/bus/pci -I../drivers/bus/pci/linux -Ilib/hash -I../lib/hash -Idrivers/net/intel/i40e -I../drivers/net/intel/i40e -I../drivers/net/intel/i40e/base -Idrivers/net/intel/ixgbe -I../drivers/net/intel/ixgbe -I../drivers/net/intel/ixgbe/base -Idrivers/bus/dpaa -I../drivers/bus/dpaa -I../drivers/bus/dpaa/base -I../drivers/bus/dpaa/include -I../drivers/bus/dpaa/base/qbman -Idrivers/common/dpaax -I../drivers/common/dpaax -I../drivers/common/dpaax/caamflib -Ilib/eventdev -I../lib/eventdev -Ilib/timer -I../lib/timer -Ilib/dmadev -I../lib/dmadev -Idrivers/mempool/dpaa -I../drivers/mempool/dpaa -Idrivers/net/dpaa -I../drivers/net/dpaa -Idrivers/net/bonding -I../drivers/net/bonding -Ilib/sched -I../lib/sched -Ilib/ip_frag -I../lib/ip_frag -Idrivers/net/intel/iavf -I../drivers/net/intel/iavf -I../drivers/net/intel/iavf/base -Idrivers/net/intel/ice -I../drivers/net/intel/ice -I../drivers/net/intel/ice/base -Idrivers/net/mlx5 -I../drivers/net/mlx5 -Idrivers/net/mlx5/linux -I../drivers/net/mlx5/linux -Idrivers/net/mlx5/hws -I../drivers/net/mlx5/hws -Idrivers/common/mlx5 -I../drivers/common/mlx5 -Idrivers/common/mlx5/linux -I../drivers/common/mlx5/linux -Idrivers/bus/auxiliary -I../drivers/bus/auxiliary -I/usr/include/dbus-1.0 -I/usr/lib/x86_64-linux-gnu/dbus-1.0/include -I/usr/include/libnl3 -fdiagnostics-color=always -D_FILE_OFFSET_BITS=64 -Wall -Winvalid-pch -Wextra -Werror -std=c11 -O3 -include rte_config.h -Wvla -Wcast-qual -Wcomma -Wdeprecated -Wformat -Wformat-nonliteral -Wformat-security -Wmissing-declarations -Wmissing-prototypes -Wnested-externs -Wold-style-definition -Wpointer-arith -Wshadow -Wsign-compare -Wstrict-prototypes -Wundef -Wwrite-strings -Wno-missing-field-initializers -D_GNU_SOURCE -march=native -mrtm -DALLOW_EXPERIMENTAL_API -MD -MQ app/dpdk-testpmd.p/test-pmd_config.c.o -MF app/dpdk-testpmd.p/test-pmd_config.c.o.d -o app/dpdk-testpmd.p/test-pmd_config.c.o -c ../app/test-pmd/config.c
../app/test-pmd/config.c:1247:8: error: call to undeclared function 'rte_eth_module_eeprom_parse'; ISO C99 and later do not support implicit function declarations [-Wimplicit-function-declaration]
1247 | ret = rte_eth_module_eeprom_parse(minfo.type, einfo.data, einfo.length,
| ^
1 error generated.
[3491/3889] Compiling C object app/dpdk-testpmd.p/test-pmd_cmdline_mtr.c.o
[3492/3889] Compiling C object app/dpdk-testpmd.p/test-pmd_cmdline.c.o
[3493/3889] Compiling C object app/dpdk-testpmd.p/test-pmd_csumonly.c.o
[3494/3889] Compiling C object app/dpdk-testpmd.p/test-pmd_cmdline_tm.c.o
[3495/3889] Compiling C object app/dpdk-testpmd.p/test-pmd_flowgen.c.o
[3496/3889] Compiling C object app/dpdk-testpmd.p/test-pmd_hairpin.c.o
[3497/3889] Compiling C object app/dpdk-testpmd.p/test-pmd_cmdline_flow.c.o
[3498/3889] Compiling C object app/dpdk-testpmd.p/test-pmd_icmpecho.c.o
[3499/3889] Linking target app/dpdk-test-mldev
ninja: build stopped
*Build Failed #18:
OS: UB2604-64
Target: x86_64-native-linuxapp-doc
FAILED: app/dpdk-testpmd.p/test-pmd_config.c.o
gcc -Iapp/dpdk-testpmd.p -Iapp -I../app -Iapp/test-pmd -I../app/test-pmd -Ilib/ethdev -I../lib/ethdev -Ilib/eal/common -I../lib/eal/common -I. -I.. -Iconfig -I../config -Ilib/eal/include -I../lib/eal/include -Ilib/eal/linux/include -I../lib/eal/linux/include -Ilib/eal/x86/include -I../lib/eal/x86/include -I../kernel/linux -Ilib/eal -I../lib/eal -Ilib/kvargs -I../lib/kvargs -Ilib/log -I../lib/log -Ilib/metrics -I../lib/metrics -Ilib/telemetry -I../lib/telemetry -Ilib/argparse -I../lib/argparse -Ilib/net -I../lib/net -Ilib/mbuf -I../lib/mbuf -Ilib/mempool -I../lib/mempool -Ilib/ring -I../lib/ring -Ilib/meter -I../lib/meter -Ilib/cmdline -I../lib/cmdline -Ilib/pci -I../lib/pci -Idrivers/crypto/scheduler -I../drivers/crypto/scheduler -Ilib/cryptodev -I../lib/cryptodev -Ilib/rcu -I../lib/rcu -Idrivers/bus/vdev -I../drivers/bus/vdev -Ilib/reorder -I../lib/reorder -Ilib/security -I../lib/security -Ilib/bitratestats -I../lib/bitratestats -Ilib/bpf -I../lib/bpf -Ilib/gro -I../lib/gro -Ilib/gso -I../lib/gso -Ilib/latencystats -I../lib/latencystats -Ilib/pdump -I../lib/pdump -Ilib/pcapng -I../lib/pcapng -Idrivers/net/bnxt -I../drivers/net/bnxt -Idrivers/net/bnxt/tf_ulp -I../drivers/net/bnxt/tf_ulp -Idrivers/net/bnxt/tf_ulp/generic_templates -I../drivers/net/bnxt/tf_ulp/generic_templates -Idrivers/net/bnxt/tf_core -I../drivers/net/bnxt/tf_core -Idrivers/net/bnxt/tf_core/v3 -I../drivers/net/bnxt/tf_core/v3 -Idrivers/net/bnxt/hcapi/cfa -I../drivers/net/bnxt/hcapi/cfa -Idrivers/net/bnxt/hcapi/cfa_v3 -I../drivers/net/bnxt/hcapi/cfa_v3 -I../drivers/net/bnxt/hcapi/cfa_v3/include -I../drivers/net/bnxt/hcapi/cfa_v3/include/platform/dpdk -I../drivers/net/bnxt/hcapi/cfa_v3/bld/p70 -I../drivers/net/bnxt/hcapi/cfa_v3/bld/p70/host -I../drivers/net/bnxt/hcapi/cfa_v3/bld/include -I../drivers/net/bnxt/hcapi/cfa_v3/bld/include/host -I../drivers/net/bnxt/hcapi/cfa_v3/bld/include/p70 -I../drivers/net/bnxt/hcapi/cfa_v3/mm/include -I../drivers/net/bnxt/hcapi/cfa_v3/tim/include -I../drivers/net/bnxt/hcapi/cfa_v3/tpm/include -Idrivers/bus/pci -I../drivers/bus/pci -I../drivers/bus/pci/linux -Ilib/hash -I../lib/hash -Idrivers/net/intel/i40e -I../drivers/net/intel/i40e -I../drivers/net/intel/i40e/base -Idrivers/net/intel/ixgbe -I../drivers/net/intel/ixgbe -I../drivers/net/intel/ixgbe/base -Idrivers/bus/dpaa -I../drivers/bus/dpaa -I../drivers/bus/dpaa/base -I../drivers/bus/dpaa/include -I../drivers/bus/dpaa/base/qbman -Idrivers/common/dpaax -I../drivers/common/dpaax -I../drivers/common/dpaax/caamflib -Ilib/eventdev -I../lib/eventdev -Ilib/timer -I../lib/timer -Ilib/dmadev -I../lib/dmadev -Idrivers/mempool/dpaa -I../drivers/mempool/dpaa -Idrivers/net/dpaa -I../drivers/net/dpaa -Idrivers/net/bonding -I../drivers/net/bonding -Ilib/sched -I../lib/sched -Ilib/ip_frag -I../lib/ip_frag -Idrivers/net/intel/iavf -I../drivers/net/intel/iavf -I../drivers/net/intel/iavf/base -Idrivers/net/intel/ice -I../drivers/net/intel/ice -I../drivers/net/intel/ice/base -Idrivers/net/mlx5 -I../drivers/net/mlx5 -Idrivers/net/mlx5/linux -I../drivers/net/mlx5/linux -Idrivers/net/mlx5/hws -I../drivers/net/mlx5/hws -Idrivers/common/mlx5 -I../drivers/common/mlx5 -Idrivers/common/mlx5/linux -I../drivers/common/mlx5/linux -Idrivers/bus/auxiliary -I../drivers/bus/auxiliary -I/usr/include/dbus-1.0 -I/usr/lib/x86_64-linux-gnu/dbus-1.0/include -I/usr/include/libnl3 -fdiagnostics-color=always -D_FILE_OFFSET_BITS=64 -Wall -Winvalid-pch -Wextra -Werror -std=c11 -O3 -include rte_config.h -Wvla -Wcast-qual -Wdeprecated -Wformat -Wformat-nonliteral -Wformat-security -Wmissing-declarations -Wmissing-prototypes -Wnested-externs -Wold-style-definition -Wpointer-arith -Wshadow -Wsign-compare -Wstrict-prototypes -Wundef -Wwrite-strings -Wno-packed-not-aligned -Wno-missing-field-initializers -fzero-init-padding-bits=all -D_GNU_SOURCE -march=native -mrtm -DALLOW_EXPERIMENTAL_API -MD -MQ app/dpdk-testpmd.p/test-pmd_config.c.o -MF app/dpdk-testpmd.p/test-pmd_config.c.o.d -o app/dpdk-testpmd.p/test-pmd_config.c.o -c ../app/test-pmd/config.c
../app/test-pmd/config.c: In function ‘port_module_eeprom_decode_display’:
../app/test-pmd/config.c:1247:15: error: implicit declaration of function ‘rte_eth_module_eeprom_parse’ [-Wimplicit-function-declaration]
1247 | ret = rte_eth_module_eeprom_parse(minfo.type, einfo.data, einfo.length,
| ^~~~~~~~~~~~~~~~~~~~~~~~~~~
../app/test-pmd/config.c:1247:15: error: nested extern declaration of ‘rte_eth_module_eeprom_parse’ [-Werror=nested-externs]
cc1: all warnings being treated as errors
[3482/3711] Compiling C object app/dpdk-testpmd.p/test-pmd_icmpecho.c.o
[3483/3711] Compiling C object app/dpdk-testpmd.p/test-pmd_flowgen.c.o
[3484/3711] Compiling C object app/dpdk-testpmd.p/test-pmd_iofwd.c.o
[3485/3711] Compiling C object app/dpdk-testpmd.p/test-pmd_ieee1588fwd.c.o
[3486/3711] Compiling C object app/dpdk-testpmd.p/test-pmd_macfwd.c.o
[3487/3711] Linking target app/dpdk-test-mldev
[3488/3711] Compiling C object app/dpdk-testpmd.p/test-pmd_cmdline.c.o
[3489/3711] Compiling C object app/dpdk-testpmd.p/test-pmd_csumonly.c.o
[3490/3711] Compiling C object app/dpdk-testpmd.p/test-pmd_cmdline_flow.c.o
ninja: build stopped
*Build Failed #19:
OS: RHEL10.2-64RT
Target: x86_64-native-linuxapp-gcc
FAILED: app/dpdk-testpmd.p/test-pmd_config.c.o
gcc -Iapp/dpdk-testpmd.p -Iapp -I../app -Iapp/test-pmd -I../app/test-pmd -Ilib/ethdev -I../lib/ethdev -Ilib/eal/common -I../lib/eal/common -I. -I.. -Iconfig -I../config -Ilib/eal/include -I../lib/eal/include -Ilib/eal/linux/include -I../lib/eal/linux/include -Ilib/eal/x86/include -I../lib/eal/x86/include -I../kernel/linux -Ilib/eal -I../lib/eal -Ilib/kvargs -I../lib/kvargs -Ilib/log -I../lib/log -Ilib/metrics -I../lib/metrics -Ilib/telemetry -I../lib/telemetry -Ilib/argparse -I../lib/argparse -Ilib/net -I../lib/net -Ilib/mbuf -I../lib/mbuf -Ilib/mempool -I../lib/mempool -Ilib/ring -I../lib/ring -Ilib/meter -I../lib/meter -Ilib/cmdline -I../lib/cmdline -Ilib/pci -I../lib/pci -Idrivers/crypto/scheduler -I../drivers/crypto/scheduler -Ilib/cryptodev -I../lib/cryptodev -Ilib/rcu -I../lib/rcu -Idrivers/bus/vdev -I../drivers/bus/vdev -Ilib/reorder -I../lib/reorder -Ilib/security -I../lib/security -Ilib/bitratestats -I../lib/bitratestats -Ilib/bpf -I../lib/bpf -Ilib/gro -I../lib/gro -Ilib/gso -I../lib/gso -Ilib/latencystats -I../lib/latencystats -Ilib/pdump -I../lib/pdump -Ilib/pcapng -I../lib/pcapng -Idrivers/net/bnxt -I../drivers/net/bnxt -Idrivers/net/bnxt/tf_ulp -I../drivers/net/bnxt/tf_ulp -Idrivers/net/bnxt/tf_ulp/generic_templates -I../drivers/net/bnxt/tf_ulp/generic_templates -Idrivers/net/bnxt/tf_core -I../drivers/net/bnxt/tf_core -Idrivers/net/bnxt/tf_core/v3 -I../drivers/net/bnxt/tf_core/v3 -Idrivers/net/bnxt/hcapi/cfa -I../drivers/net/bnxt/hcapi/cfa -Idrivers/net/bnxt/hcapi/cfa_v3 -I../drivers/net/bnxt/hcapi/cfa_v3 -I../drivers/net/bnxt/hcapi/cfa_v3/include -I../drivers/net/bnxt/hcapi/cfa_v3/include/platform/dpdk -I../drivers/net/bnxt/hcapi/cfa_v3/bld/p70 -I../drivers/net/bnxt/hcapi/cfa_v3/bld/p70/host -I../drivers/net/bnxt/hcapi/cfa_v3/bld/include -I../drivers/net/bnxt/hcapi/cfa_v3/bld/include/host -I../drivers/net/bnxt/hcapi/cfa_v3/bld/include/p70 -I../drivers/net/bnxt/hcapi/cfa_v3/mm/include -I../drivers/net/bnxt/hcapi/cfa_v3/tim/include -I../drivers/net/bnxt/hcapi/cfa_v3/tpm/include -Idrivers/bus/pci -I../drivers/bus/pci -I../drivers/bus/pci/linux -Ilib/hash -I../lib/hash -Idrivers/net/intel/i40e -I../drivers/net/intel/i40e -I../drivers/net/intel/i40e/base -Idrivers/net/intel/ixgbe -I../drivers/net/intel/ixgbe -I../drivers/net/intel/ixgbe/base -Idrivers/bus/dpaa -I../drivers/bus/dpaa -I../drivers/bus/dpaa/base -I../drivers/bus/dpaa/include -I../drivers/bus/dpaa/base/qbman -Idrivers/common/dpaax -I../drivers/common/dpaax -I../drivers/common/dpaax/caamflib -Ilib/eventdev -I../lib/eventdev -Ilib/timer -I../lib/timer -Ilib/dmadev -I../lib/dmadev -Idrivers/mempool/dpaa -I../drivers/mempool/dpaa -Idrivers/net/dpaa -I../drivers/net/dpaa -Idrivers/net/bonding -I../drivers/net/bonding -Ilib/sched -I../lib/sched -Ilib/ip_frag -I../lib/ip_frag -Idrivers/net/intel/iavf -I../drivers/net/intel/iavf -I../drivers/net/intel/iavf/base -Idrivers/net/intel/ice -I../drivers/net/intel/ice -I../drivers/net/intel/ice/base -fdiagnostics-color=always -D_FILE_OFFSET_BITS=64 -Wall -Winvalid-pch -Wextra -Werror -std=c11 -O3 -include rte_config.h -Wvla -Wcast-qual -Wdeprecated -Wformat -Wformat-nonliteral -Wformat-security -Wmissing-declarations -Wmissing-prototypes -Wnested-externs -Wold-style-definition -Wpointer-arith -Wshadow -Wsign-compare -Wstrict-prototypes -Wundef -Wwrite-strings -Wno-packed-not-aligned -Wno-missing-field-initializers -D_GNU_SOURCE -DWITH_GZFILEOP -march=native -mrtm -DALLOW_EXPERIMENTAL_API -MD -MQ app/dpdk-testpmd.p/test-pmd_config.c.o -MF app/dpdk-testpmd.p/test-pmd_config.c.o.d -o app/dpdk-testpmd.p/test-pmd_config.c.o -c ../app/test-pmd/config.c
../app/test-pmd/config.c: In function ‘port_module_eeprom_decode_display’:
../app/test-pmd/config.c:1247:15: error: implicit declaration of function ‘rte_eth_module_eeprom_parse’ [-Wimplicit-function-declaration]
1247 | ret = rte_eth_module_eeprom_parse(minfo.type, einfo.data, einfo.length,
| ^~~~~~~~~~~~~~~~~~~~~~~~~~~
../app/test-pmd/config.c:1247:15: error: nested extern declaration of ‘rte_eth_module_eeprom_parse’ [-Werror=nested-externs]
cc1: all warnings being treated as errors
[3246/3647] Compiling C object app/dpdk-testpmd.p/test-pmd_flowgen.c.o
[3247/3647] Compiling C object app/dpdk-testpmd.p/test-pmd_hairpin.c.o
[3248/3647] Compiling C object app/dpdk-testpmd.p/test-pmd_iofwd.c.o
[3249/3647] Compiling C object app/dpdk-testpmd.p/test-pmd_ieee1588fwd.c.o
[3250/3647] Compiling C object app/dpdk-testpmd.p/test-pmd_icmpecho.c.o
[3251/3647] Compiling C object app/dpdk-testpmd.p/test-pmd_cmdline.c.o
[3252/3647] Compiling C object app/dpdk-testpmd.p/test-pmd_csumonly.c.o
[3253/3647] Linking target app/dpdk-test-mldev
[3254/3647] Compiling C object app/dpdk-testpmd.p/test-pmd_cmdline_flow.c.o
ninja: build stopped
*Build Failed #20:
OS: UB2404-64
Target: x86_64-native-linuxapp-gcc
FAILED: app/dpdk-testpmd.p/test-pmd_config.c.o
gcc -Iapp/dpdk-testpmd.p -Iapp -I../app -Iapp/test-pmd -I../app/test-pmd -Ilib/ethdev -I../lib/ethdev -Ilib/eal/common -I../lib/eal/common -I. -I.. -Iconfig -I../config -Ilib/eal/include -I../lib/eal/include -Ilib/eal/linux/include -I../lib/eal/linux/include -Ilib/eal/x86/include -I../lib/eal/x86/include -I../kernel/linux -Ilib/eal -I../lib/eal -Ilib/kvargs -I../lib/kvargs -Ilib/log -I../lib/log -Ilib/metrics -I../lib/metrics -Ilib/telemetry -I../lib/telemetry -Ilib/argparse -I../lib/argparse -Ilib/net -I../lib/net -Ilib/mbuf -I../lib/mbuf -Ilib/mempool -I../lib/mempool -Ilib/ring -I../lib/ring -Ilib/meter -I../lib/meter -Ilib/cmdline -I../lib/cmdline -Ilib/pci -I../lib/pci -Idrivers/crypto/scheduler -I../drivers/crypto/scheduler -Ilib/cryptodev -I../lib/cryptodev -Ilib/rcu -I../lib/rcu -Idrivers/bus/vdev -I../drivers/bus/vdev -Ilib/reorder -I../lib/reorder -Ilib/security -I../lib/security -Ilib/bitratestats -I../lib/bitratestats -Ilib/bpf -I../lib/bpf -Ilib/gro -I../lib/gro -Ilib/gso -I../lib/gso -Ilib/latencystats -I../lib/latencystats -Ilib/pdump -I../lib/pdump -Ilib/pcapng -I../lib/pcapng -Idrivers/net/bnxt -I../drivers/net/bnxt -Idrivers/net/bnxt/tf_ulp -I../drivers/net/bnxt/tf_ulp -Idrivers/net/bnxt/tf_ulp/generic_templates -I../drivers/net/bnxt/tf_ulp/generic_templates -Idrivers/net/bnxt/tf_core -I../drivers/net/bnxt/tf_core -Idrivers/net/bnxt/tf_core/v3 -I../drivers/net/bnxt/tf_core/v3 -Idrivers/net/bnxt/hcapi/cfa -I../drivers/net/bnxt/hcapi/cfa -Idrivers/net/bnxt/hcapi/cfa_v3 -I../drivers/net/bnxt/hcapi/cfa_v3 -I../drivers/net/bnxt/hcapi/cfa_v3/include -I../drivers/net/bnxt/hcapi/cfa_v3/include/platform/dpdk -I../drivers/net/bnxt/hcapi/cfa_v3/bld/p70 -I../drivers/net/bnxt/hcapi/cfa_v3/bld/p70/host -I../drivers/net/bnxt/hcapi/cfa_v3/bld/include -I../drivers/net/bnxt/hcapi/cfa_v3/bld/include/host -I../drivers/net/bnxt/hcapi/cfa_v3/bld/include/p70 -I../drivers/net/bnxt/hcapi/cfa_v3/mm/include -I../drivers/net/bnxt/hcapi/cfa_v3/tim/include -I../drivers/net/bnxt/hcapi/cfa_v3/tpm/include -Idrivers/bus/pci -I../drivers/bus/pci -I../drivers/bus/pci/linux -Ilib/hash -I../lib/hash -Idrivers/net/intel/i40e -I../drivers/net/intel/i40e -I../drivers/net/intel/i40e/base -Idrivers/net/intel/ixgbe -I../drivers/net/intel/ixgbe -I../drivers/net/intel/ixgbe/base -Idrivers/bus/dpaa -I../drivers/bus/dpaa -I../drivers/bus/dpaa/base -I../drivers/bus/dpaa/include -I../drivers/bus/dpaa/base/qbman -Idrivers/common/dpaax -I../drivers/common/dpaax -I../drivers/common/dpaax/caamflib -Ilib/eventdev -I../lib/eventdev -Ilib/timer -I../lib/timer -Ilib/dmadev -I../lib/dmadev -Idrivers/mempool/dpaa -I../drivers/mempool/dpaa -Idrivers/net/dpaa -I../drivers/net/dpaa -Idrivers/net/bonding -I../drivers/net/bonding -Ilib/sched -I../lib/sched -Ilib/ip_frag -I../lib/ip_frag -Idrivers/net/intel/iavf -I../drivers/net/intel/iavf -I../drivers/net/intel/iavf/base -Idrivers/net/intel/ice -I../drivers/net/intel/ice -I../drivers/net/intel/ice/base -Idrivers/net/mlx5 -I../drivers/net/mlx5 -Idrivers/net/mlx5/linux -I../drivers/net/mlx5/linux -Idrivers/net/mlx5/hws -I../drivers/net/mlx5/hws -Idrivers/common/mlx5 -I../drivers/common/mlx5 -Idrivers/common/mlx5/linux -I../drivers/common/mlx5/linux -Idrivers/bus/auxiliary -I../drivers/bus/auxiliary -I/usr/include/dbus-1.0 -I/usr/lib/x86_64-linux-gnu/dbus-1.0/include -I/usr/include/libnl3 -fdiagnostics-color=always -D_FILE_OFFSET_BITS=64 -Wall -Winvalid-pch -Wextra -Werror -std=c11 -O3 -include rte_config.h -Wvla -Wcast-qual -Wdeprecated -Wformat -Wformat-nonliteral -Wformat-security -Wmissing-declarations -Wmissing-prototypes -Wnested-externs -Wold-style-definition -Wpointer-arith -Wshadow -Wsign-compare -Wstrict-prototypes -Wundef -Wwrite-strings -Wno-packed-not-aligned -Wno-missing-field-initializers -D_GNU_SOURCE -march=native -mrtm -DALLOW_EXPERIMENTAL_API -MD -MQ app/dpdk-testpmd.p/test-pmd_config.c.o -MF app/dpdk-testpmd.p/test-pmd_config.c.o.d -o app/dpdk-testpmd.p/test-pmd_config.c.o -c ../app/test-pmd/config.c
../app/test-pmd/config.c: In function ‘port_module_eeprom_decode_display’:
../app/test-pmd/config.c:1247:15: error: implicit declaration of function ‘rte_eth_module_eeprom_parse’ [-Werror=implicit-function-declaration]
1247 | ret = rte_eth_module_eeprom_parse(minfo.type, einfo.data, einfo.length,
| ^~~~~~~~~~~~~~~~~~~~~~~~~~~
../app/test-pmd/config.c:1247:15: error: nested extern declaration of ‘rte_eth_module_eeprom_parse’ [-Werror=nested-externs]
cc1: all warnings being treated as errors
[3521/3888] Compiling C object app/dpdk-test-security-perf.p/test-security-perf_test_security_perf.c.o
[3522/3888] Compiling C object examples/dpdk-vhost_crypto.p/vhost_crypto_main.c.o
[3523/3888] Compiling C object app/dpdk-testpmd.p/test-pmd_cmdline_flow.c.o
[3524/3888] Compiling C object app/dpdk-test-security-perf.p/test_test_security_proto.c.o
[3525/3888] Linking target app/dpdk-test-regex
[3526/3888] Compiling C object app/dpdk-test-security-perf.p/test_test_cryptodev_security_ipsec.c.o
[3527/3888] Compiling C object app/dpdk-test.p/test_sample_packet_forward.c.o
[3528/3888] Linking target app/dpdk-test-sad
[3529/3888] Compiling C object examples/dpdk-bbdev_app.p/bbdev_app_main.c.o
ninja: build stopped
*Build Failed #21:
OS: Fedora44-64
Target: x86_64-native-linuxapp-gcc
FAILED: app/dpdk-testpmd.p/test-pmd_config.c.o
gcc -Iapp/dpdk-testpmd.p -Iapp -I../app -Iapp/test-pmd -I../app/test-pmd -Ilib/ethdev -I../lib/ethdev -Ilib/eal/common -I../lib/eal/common -I. -I.. -Iconfig -I../config -Ilib/eal/include -I../lib/eal/include -Ilib/eal/linux/include -I../lib/eal/linux/include -Ilib/eal/x86/include -I../lib/eal/x86/include -I../kernel/linux -Ilib/eal -I../lib/eal -Ilib/kvargs -I../lib/kvargs -Ilib/log -I../lib/log -Ilib/metrics -I../lib/metrics -Ilib/telemetry -I../lib/telemetry -Ilib/argparse -I../lib/argparse -Ilib/net -I../lib/net -Ilib/mbuf -I../lib/mbuf -Ilib/mempool -I../lib/mempool -Ilib/ring -I../lib/ring -Ilib/meter -I../lib/meter -Ilib/cmdline -I../lib/cmdline -Ilib/pci -I../lib/pci -Idrivers/crypto/scheduler -I../drivers/crypto/scheduler -Ilib/cryptodev -I../lib/cryptodev -Ilib/rcu -I../lib/rcu -Idrivers/bus/vdev -I../drivers/bus/vdev -Ilib/reorder -I../lib/reorder -Ilib/security -I../lib/security -Ilib/bitratestats -I../lib/bitratestats -Ilib/bpf -I../lib/bpf -Ilib/gro -I../lib/gro -Ilib/gso -I../lib/gso -Ilib/latencystats -I../lib/latencystats -Ilib/pdump -I../lib/pdump -Ilib/pcapng -I../lib/pcapng -Idrivers/net/bnxt -I../drivers/net/bnxt -Idrivers/net/bnxt/tf_ulp -I../drivers/net/bnxt/tf_ulp -Idrivers/net/bnxt/tf_ulp/generic_templates -I../drivers/net/bnxt/tf_ulp/generic_templates -Idrivers/net/bnxt/tf_core -I../drivers/net/bnxt/tf_core -Idrivers/net/bnxt/tf_core/v3 -I../drivers/net/bnxt/tf_core/v3 -Idrivers/net/bnxt/hcapi/cfa -I../drivers/net/bnxt/hcapi/cfa -Idrivers/net/bnxt/hcapi/cfa_v3 -I../drivers/net/bnxt/hcapi/cfa_v3 -I../drivers/net/bnxt/hcapi/cfa_v3/include -I../drivers/net/bnxt/hcapi/cfa_v3/include/platform/dpdk -I../drivers/net/bnxt/hcapi/cfa_v3/bld/p70 -I../drivers/net/bnxt/hcapi/cfa_v3/bld/p70/host -I../drivers/net/bnxt/hcapi/cfa_v3/bld/include -I../drivers/net/bnxt/hcapi/cfa_v3/bld/include/host -I../drivers/net/bnxt/hcapi/cfa_v3/bld/include/p70 -I../drivers/net/bnxt/hcapi/cfa_v3/mm/include -I../drivers/net/bnxt/hcapi/cfa_v3/tim/include -I../drivers/net/bnxt/hcapi/cfa_v3/tpm/include -Idrivers/bus/pci -I../drivers/bus/pci -I../drivers/bus/pci/linux -Ilib/hash -I../lib/hash -Idrivers/net/intel/i40e -I../drivers/net/intel/i40e -I../drivers/net/intel/i40e/base -Idrivers/net/intel/ixgbe -I../drivers/net/intel/ixgbe -I../drivers/net/intel/ixgbe/base -Idrivers/bus/dpaa -I../drivers/bus/dpaa -I../drivers/bus/dpaa/base -I../drivers/bus/dpaa/include -I../drivers/bus/dpaa/base/qbman -Idrivers/common/dpaax -I../drivers/common/dpaax -I../drivers/common/dpaax/caamflib -Ilib/eventdev -I../lib/eventdev -Ilib/timer -I../lib/timer -Ilib/dmadev -I../lib/dmadev -Idrivers/mempool/dpaa -I../drivers/mempool/dpaa -Idrivers/net/dpaa -I../drivers/net/dpaa -Idrivers/net/bonding -I../drivers/net/bonding -Ilib/sched -I../lib/sched -Ilib/ip_frag -I../lib/ip_frag -Idrivers/net/intel/iavf -I../drivers/net/intel/iavf -I../drivers/net/intel/iavf/base -Idrivers/net/intel/ice -I../drivers/net/intel/ice -I../drivers/net/intel/ice/base -fdiagnostics-color=always -D_FILE_OFFSET_BITS=64 -Wall -Winvalid-pch -Wextra -Werror -std=c11 -O3 -include rte_config.h -Wvla -Wcast-qual -Wdeprecated -Wformat -Wformat-nonliteral -Wformat-security -Wmissing-declarations -Wmissing-prototypes -Wnested-externs -Wold-style-definition -Wpointer-arith -Wshadow -Wsign-compare -Wstrict-prototypes -Wundef -Wwrite-strings -Wno-packed-not-aligned -Wno-missing-field-initializers -fzero-init-padding-bits=all -D_GNU_SOURCE -DWITH_GZFILEOP -march=native -mrtm -DALLOW_EXPERIMENTAL_API -MD -MQ app/dpdk-testpmd.p/test-pmd_config.c.o -MF app/dpdk-testpmd.p/test-pmd_config.c.o.d -o app/dpdk-testpmd.p/test-pmd_config.c.o -c ../app/test-pmd/config.c
../app/test-pmd/config.c: In function ‘port_module_eeprom_decode_display’:
../app/test-pmd/config.c:1247:15: error: implicit declaration of function ‘rte_eth_module_eeprom_parse’ [-Wimplicit-function-declaration]
1247 | ret = rte_eth_module_eeprom_parse(minfo.type, einfo.data, einfo.length,
| ^~~~~~~~~~~~~~~~~~~~~~~~~~~
../app/test-pmd/config.c:1247:15: error: nested extern declaration of ‘rte_eth_module_eeprom_parse’ [-Werror=nested-externs]
cc1: all warnings being treated as errors
[3252/3647] Compiling C object app/dpdk-testpmd.p/test-pmd_flowgen.c.o
[3253/3647] Compiling C object app/dpdk-testpmd.p/test-pmd_hairpin.c.o
[3254/3647] Linking target app/dpdk-test-mldev
[3255/3647] Compiling C object app/dpdk-testpmd.p/test-pmd_iofwd.c.o
[3256/3647] Linking target app/dpdk-test-eventdev
[3257/3647] Compiling C object app/dpdk-testpmd.p/test-pmd_macfwd.c.o
[3258/3647] Compiling C object app/dpdk-testpmd.p/test-pmd_csumonly.c.o
[3259/3647] Compiling C object app/dpdk-testpmd.p/test-pmd_cmdline.c.o
[3260/3647] Compiling C object app/dpdk-testpmd.p/test-pmd_cmdline_flow.c.o
ninja: build stopped
*Build Failed #22:
OS: Fedora44-64
Target: x86_64-native-linuxapp-clang
FAILED: app/dpdk-testpmd.p/test-pmd_config.c.o
clang -Iapp/dpdk-testpmd.p -Iapp -I../app -Iapp/test-pmd -I../app/test-pmd -Ilib/ethdev -I../lib/ethdev -Ilib/eal/common -I../lib/eal/common -I. -I.. -Iconfig -I../config -Ilib/eal/include -I../lib/eal/include -Ilib/eal/linux/include -I../lib/eal/linux/include -Ilib/eal/x86/include -I../lib/eal/x86/include -I../kernel/linux -Ilib/eal -I../lib/eal -Ilib/kvargs -I../lib/kvargs -Ilib/log -I../lib/log -Ilib/metrics -I../lib/metrics -Ilib/telemetry -I../lib/telemetry -Ilib/argparse -I../lib/argparse -Ilib/net -I../lib/net -Ilib/mbuf -I../lib/mbuf -Ilib/mempool -I../lib/mempool -Ilib/ring -I../lib/ring -Ilib/meter -I../lib/meter -Ilib/cmdline -I../lib/cmdline -Ilib/pci -I../lib/pci -Idrivers/crypto/scheduler -I../drivers/crypto/scheduler -Ilib/cryptodev -I../lib/cryptodev -Ilib/rcu -I../lib/rcu -Idrivers/bus/vdev -I../drivers/bus/vdev -Ilib/reorder -I../lib/reorder -Ilib/security -I../lib/security -Ilib/bitratestats -I../lib/bitratestats -Ilib/bpf -I../lib/bpf -Ilib/gro -I../lib/gro -Ilib/gso -I../lib/gso -Ilib/latencystats -I../lib/latencystats -Ilib/pdump -I../lib/pdump -Ilib/pcapng -I../lib/pcapng -Idrivers/net/bnxt -I../drivers/net/bnxt -Idrivers/net/bnxt/tf_ulp -I../drivers/net/bnxt/tf_ulp -Idrivers/net/bnxt/tf_ulp/generic_templates -I../drivers/net/bnxt/tf_ulp/generic_templates -Idrivers/net/bnxt/tf_core -I../drivers/net/bnxt/tf_core -Idrivers/net/bnxt/tf_core/v3 -I../drivers/net/bnxt/tf_core/v3 -Idrivers/net/bnxt/hcapi/cfa -I../drivers/net/bnxt/hcapi/cfa -Idrivers/net/bnxt/hcapi/cfa_v3 -I../drivers/net/bnxt/hcapi/cfa_v3 -I../drivers/net/bnxt/hcapi/cfa_v3/include -I../drivers/net/bnxt/hcapi/cfa_v3/include/platform/dpdk -I../drivers/net/bnxt/hcapi/cfa_v3/bld/p70 -I../drivers/net/bnxt/hcapi/cfa_v3/bld/p70/host -I../drivers/net/bnxt/hcapi/cfa_v3/bld/include -I../drivers/net/bnxt/hcapi/cfa_v3/bld/include/host -I../drivers/net/bnxt/hcapi/cfa_v3/bld/include/p70 -I../drivers/net/bnxt/hcapi/cfa_v3/mm/include -I../drivers/net/bnxt/hcapi/cfa_v3/tim/include -I../drivers/net/bnxt/hcapi/cfa_v3/tpm/include -Idrivers/bus/pci -I../drivers/bus/pci -I../drivers/bus/pci/linux -Ilib/hash -I../lib/hash -Idrivers/net/intel/i40e -I../drivers/net/intel/i40e -I../drivers/net/intel/i40e/base -Idrivers/net/intel/ixgbe -I../drivers/net/intel/ixgbe -I../drivers/net/intel/ixgbe/base -Idrivers/bus/dpaa -I../drivers/bus/dpaa -I../drivers/bus/dpaa/base -I../drivers/bus/dpaa/include -I../drivers/bus/dpaa/base/qbman -Idrivers/common/dpaax -I../drivers/common/dpaax -I../drivers/common/dpaax/caamflib -Ilib/eventdev -I../lib/eventdev -Ilib/timer -I../lib/timer -Ilib/dmadev -I../lib/dmadev -Idrivers/mempool/dpaa -I../drivers/mempool/dpaa -Idrivers/net/dpaa -I../drivers/net/dpaa -Idrivers/net/bonding -I../drivers/net/bonding -Ilib/sched -I../lib/sched -Ilib/ip_frag -I../lib/ip_frag -Idrivers/net/intel/iavf -I../drivers/net/intel/iavf -I../drivers/net/intel/iavf/base -Idrivers/net/intel/ice -I../drivers/net/intel/ice -I../drivers/net/intel/ice/base -fdiagnostics-color=always -D_FILE_OFFSET_BITS=64 -Wall -Winvalid-pch -Wextra -Werror -std=c11 -O3 -include rte_config.h -Wvla -Wcast-qual -Wcomma -Wdeprecated -Wformat -Wformat-nonliteral -Wformat-security -Wmissing-declarations -Wmissing-prototypes -Wnested-externs -Wold-style-definition -Wpointer-arith -Wshadow -Wsign-compare -Wstrict-prototypes -Wundef -Wwrite-strings -Wno-missing-field-initializers -D_GNU_SOURCE -DWITH_GZFILEOP -march=native -mrtm -DALLOW_EXPERIMENTAL_API -MD -MQ app/dpdk-testpmd.p/test-pmd_config.c.o -MF app/dpdk-testpmd.p/test-pmd_config.c.o.d -o app/dpdk-testpmd.p/test-pmd_config.c.o -c ../app/test-pmd/config.c
../app/test-pmd/config.c:1247:8: error: call to undeclared function 'rte_eth_module_eeprom_parse'; ISO C99 and later do not support implicit function declarations [-Wimplicit-function-declaration]
1247 | ret = rte_eth_module_eeprom_parse(minfo.type, einfo.data, einfo.length,
| ^
1 error generated.
[3259/3647] Compiling C object app/dpdk-testpmd.p/test-pmd_parameters.c.o
[3260/3647] Compiling C object app/dpdk-testpmd.p/test-pmd_recycle_mbufs.c.o
[3261/3647] Compiling C object app/dpdk-testpmd.p/test-pmd_cmdline.c.o
[3262/3647] Compiling C object app/dpdk-testpmd.p/test-pmd_rxonly.c.o
[3263/3647] Compiling C object app/dpdk-testpmd.p/test-pmd_shared_rxq_fwd.c.o
[3264/3647] Compiling C object app/dpdk-testpmd.p/test-pmd_cmdline_flow.c.o
[3265/3647] Compiling C object app/dpdk-testpmd.p/test-pmd_txonly.c.o
[3266/3647] Compiling C object app/dpdk-testpmd.p/test-pmd_testpmd.c.o
[3267/3647] Compiling C object app/dpdk-testpmd.p/test-pmd_noisy_vnf.c.o
ninja: build stopped
*Build Failed #23:
OS: OpenEuler2404-64
Target: x86_64-native-linuxapp-gcc
FAILED: app/dpdk-testpmd.p/test-pmd_config.c.o
gcc -Iapp/dpdk-testpmd.p -Iapp -I../app -Iapp/test-pmd -I../app/test-pmd -Ilib/ethdev -I../lib/ethdev -Ilib/eal/common -I../lib/eal/common -I. -I.. -Iconfig -I../config -Ilib/eal/include -I../lib/eal/include -Ilib/eal/linux/include -I../lib/eal/linux/include -Ilib/eal/x86/include -I../lib/eal/x86/include -I../kernel/linux -Ilib/eal -I../lib/eal -Ilib/kvargs -I../lib/kvargs -Ilib/log -I../lib/log -Ilib/metrics -I../lib/metrics -Ilib/telemetry -I../lib/telemetry -Ilib/argparse -I../lib/argparse -Ilib/net -I../lib/net -Ilib/mbuf -I../lib/mbuf -Ilib/mempool -I../lib/mempool -Ilib/ring -I../lib/ring -Ilib/meter -I../lib/meter -Ilib/cmdline -I../lib/cmdline -Ilib/pci -I../lib/pci -Idrivers/crypto/scheduler -I../drivers/crypto/scheduler -Ilib/cryptodev -I../lib/cryptodev -Ilib/rcu -I../lib/rcu -Idrivers/bus/vdev -I../drivers/bus/vdev -Ilib/reorder -I../lib/reorder -Ilib/security -I../lib/security -Ilib/bitratestats -I../lib/bitratestats -Ilib/bpf -I../lib/bpf -Ilib/gro -I../lib/gro -Ilib/gso -I../lib/gso -Ilib/latencystats -I../lib/latencystats -Ilib/pdump -I../lib/pdump -Ilib/pcapng -I../lib/pcapng -Idrivers/net/bnxt -I../drivers/net/bnxt -Idrivers/net/bnxt/tf_ulp -I../drivers/net/bnxt/tf_ulp -Idrivers/net/bnxt/tf_ulp/generic_templates -I../drivers/net/bnxt/tf_ulp/generic_templates -Idrivers/net/bnxt/tf_core -I../drivers/net/bnxt/tf_core -Idrivers/net/bnxt/tf_core/v3 -I../drivers/net/bnxt/tf_core/v3 -Idrivers/net/bnxt/hcapi/cfa -I../drivers/net/bnxt/hcapi/cfa -Idrivers/net/bnxt/hcapi/cfa_v3 -I../drivers/net/bnxt/hcapi/cfa_v3 -I../drivers/net/bnxt/hcapi/cfa_v3/include -I../drivers/net/bnxt/hcapi/cfa_v3/include/platform/dpdk -I../drivers/net/bnxt/hcapi/cfa_v3/bld/p70 -I../drivers/net/bnxt/hcapi/cfa_v3/bld/p70/host -I../drivers/net/bnxt/hcapi/cfa_v3/bld/include -I../drivers/net/bnxt/hcapi/cfa_v3/bld/include/host -I../drivers/net/bnxt/hcapi/cfa_v3/bld/include/p70 -I../drivers/net/bnxt/hcapi/cfa_v3/mm/include -I../drivers/net/bnxt/hcapi/cfa_v3/tim/include -I../drivers/net/bnxt/hcapi/cfa_v3/tpm/include -Idrivers/bus/pci -I../drivers/bus/pci -I../drivers/bus/pci/linux -Ilib/hash -I../lib/hash -Idrivers/net/intel/i40e -I../drivers/net/intel/i40e -I../drivers/net/intel/i40e/base -Idrivers/net/intel/ixgbe -I../drivers/net/intel/ixgbe -I../drivers/net/intel/ixgbe/base -Idrivers/bus/dpaa -I../drivers/bus/dpaa -I../drivers/bus/dpaa/base -I../drivers/bus/dpaa/include -I../drivers/bus/dpaa/base/qbman -Idrivers/common/dpaax -I../drivers/common/dpaax -I../drivers/common/dpaax/caamflib -Ilib/eventdev -I../lib/eventdev -Ilib/timer -I../lib/timer -Ilib/dmadev -I../lib/dmadev -Idrivers/mempool/dpaa -I../drivers/mempool/dpaa -Idrivers/net/dpaa -I../drivers/net/dpaa -Idrivers/net/bonding -I../drivers/net/bonding -Ilib/sched -I../lib/sched -Ilib/ip_frag -I../lib/ip_frag -Idrivers/net/intel/iavf -I../drivers/net/intel/iavf -I../drivers/net/intel/iavf/base -Idrivers/net/intel/ice -I../drivers/net/intel/ice -I../drivers/net/intel/ice/base -fdiagnostics-color=always -D_FILE_OFFSET_BITS=64 -Wall -Winvalid-pch -Wextra -Werror -std=c11 -O3 -include rte_config.h -Wvla -Wcast-qual -Wdeprecated -Wformat -Wformat-nonliteral -Wformat-security -Wmissing-declarations -Wmissing-prototypes -Wnested-externs -Wold-style-definition -Wpointer-arith -Wshadow -Wsign-compare -Wstrict-prototypes -Wundef -Wwrite-strings -Wno-packed-not-aligned -Wno-missing-field-initializers -D_GNU_SOURCE -march=native -mrtm -DALLOW_EXPERIMENTAL_API -MD -MQ app/dpdk-testpmd.p/test-pmd_config.c.o -MF app/dpdk-testpmd.p/test-pmd_config.c.o.d -o app/dpdk-testpmd.p/test-pmd_config.c.o -c ../app/test-pmd/config.c
../app/test-pmd/config.c: In function ‘port_module_eeprom_decode_display’:
../app/test-pmd/config.c:1247:15: error: implicit declaration of function ‘rte_eth_module_eeprom_parse’ [-Werror=implicit-function-declaration]
1247 | ret = rte_eth_module_eeprom_parse(minfo.type, einfo.data, einfo.length,
| ^~~~~~~~~~~~~~~~~~~~~~~~~~~
../app/test-pmd/config.c:1247:15: error: nested extern declaration of ‘rte_eth_module_eeprom_parse’ [-Werror=nested-externs]
cc1: all warnings being treated as errors
[3264/3647] Compiling C object app/dpdk-testpmd.p/test-pmd_txonly.c.o
[3265/3647] Compiling C object app/dpdk-testpmd.p/.._drivers_net_intel_i40e_i40e_testpmd.c.o
[3266/3647] Compiling C object app/dpdk-testpmd.p/.._drivers_net_intel_ice_ice_testpmd.c.o
[3267/3647] Compiling C object app/dpdk-testpmd.p/test-pmd_cmdline_flow.c.o
[3268/3647] Compiling C object app/dpdk-testpmd.p/.._drivers_net_intel_ixgbe_ixgbe_testpmd.c.o
[3269/3647] Compiling C object app/dpdk-testpmd.p/test-pmd_noisy_vnf.c.o
[3270/3647] Compiling C object app/dpdk-testpmd.p/test-pmd_testpmd.c.o
[3271/3647] Compiling C object app/dpdk-test-regex.p/test-regex_main.c.o
[3272/3647] Linking target app/dpdk-test-sad
ninja: build stopped
DPDK STV team
More information about the test-report
mailing list