compilation|FAILURE| pw(170995) sid(39575) job(PER_PATCH_BUILD20520)[2/2] app/procinfo: add option to decode module EEPROM
sys_stv at intel.com
sys_stv at intel.com
Sat Oct 10 09:44:46 CEST 2026
Test-Label: Intel-compilation
Test-Status: FAILURE
http://dpdk.org/patch/170995
_Compilation issues_
Submitter: Roman Khromenok <roma55592 at yandex.ru>
Date: 2026-10-10 06:55:42
Reply_mail: <b9c96ea7c4ba61d6d295a5c344c0c802fa29d313.1791609796.git.roma55592 at yandex.ru>
DPDK git baseline: Repo:dpdk, CommitID: 41b96f497daee9497cc0e6f33624b6f002c7c7e5
Meson Build Summary: 23 Builds Done, 0 Successful, 23 Failures, 0 Blocked
+-------------------+------------+--------------+------------+------------+-----------+----------+------------+
| os | gcc-static | clang-static | icc-static | gcc-shared | gcc-debug | document | gcc-16byte |
+-------------------+------------+--------------+------------+------------+-----------+----------+------------+
| OpenAnolis8.10-64 | fail | | | | | | |
| FreeBSD15-64 | fail | fail | | fail | fail | | |
| RHEL9.8-64 | fail | fail | | fail | fail | | |
| SUSE16-64 | fail | fail | | | | | |
| AzureLinux4.0-64 | fail | | | | | | |
| UB2604-32 | fail | | | | | | |
| RHEL10.2-64 | fail | | | | | | |
| UB2604-64 | fail | fail | | | | fail | fail |
| RHEL10.2-64RT | fail | | | | | | |
| UB2404-64 | fail | | | | | | |
| Fedora44-64 | fail | fail | | | | | |
| OpenEuler2404-64 | fail | | | | | | |
+-------------------+------------+--------------+------------+------------+-----------+----------+------------+
Comments:
Because of DPDK bug (https://bugs.dpdk.org/show_bug.cgi?id=928),
All the dpdk-next-* branch add `Ddisable_drivers=event/cnxk` option when build with ICC complier.
Test environment and configuration as below:
OS: OpenAnolis8.10-64
Kernel Version: 5.10.134-18.an8.x86_64
GCC Version: gcc (GCC) 8.5.0 20210514 (Anolis 8.5.0-24.0.1)
Clang Version: 18.1.8 (Red Hat 18.1.8-1.0.1.module+an8.9.0+11287+9d0292d3)
x86_64-native-linuxapp-gcc
OS: FreeBSD15-64
Kernel Version: 15.1-RELEASE-p3
GCC Version: gcc (FreeBSD Ports Collection) 14.2.0
Clang Version: 19.1.7 (https://github.com/llvm/llvm-project.git llvmorg-19.1.7-0-gcd708029e0b2)
x86_64-native-bsdapp-gcc
x86_64-native-bsdapp-clang
x86_64-native-bsdapp-gcc+shared
x86_64-native-bsdapp-gcc+debug
OS: RHEL9.8-64
Kernel Version: 5.14.0-687.5.3.el9_8.x86_64
GCC Version: gcc (GCC) 11.5.0 20240719 (Red Hat 11.5.0-14)
Clang Version: 21.1.8 (Red Hat, Inc. 21.1.8-2.el9)
x86_64-native-linuxapp-gcc
x86_64-native-linuxapp-clang
x86_64-native-linuxapp-gcc+shared
x86_64-native-linuxapp-gcc+debug
OS: SUSE16-64
Kernel Version: 6.12.0-160000.26-default
GCC Version: gcc (SUSE Linux) 15.2.0
Clang Version: 19.1.7
x86_64-native-linuxapp-clang
x86_64-native-linuxapp-gcc
OS: AzureLinux4.0-64
Kernel Version: 6.18.31-1.3.azl4.x86_64
GCC Version: gcc (GCC) 15.2.1 20260123 (Red Hat 15.2.1-7)
Clang Version: 21.1.8 (Microsoft Corporation 21.1.8-8.azl4)
x86_64-native-linuxapp-gcc
OS: UB2604-32
Kernel Version: 7.0.0-31-generic
GCC Version: gcc (Ubuntu 15.2.0-16ubuntu1) 15.2.0
Clang Version: 21.1.8 (6ubuntu1)
i686-native-linuxapp-gcc
OS: RHEL10.2-64
Kernel Version: 6.12.0-211.7.3.el10_2.x86_64
GCC Version: gcc (GCC) 14.3.1 20251022 (Red Hat 14.3.1-4)
Clang Version: 21.1.8 (Red Hat, Inc. 21.1.8-1.el10)
x86_64-native-linuxapp-gcc
OS: UB2604-64
Kernel Version: 7.0.0-31-generic
GCC Version: gcc (Ubuntu 15.2.0-16ubuntu1) 15.2.0
Clang Version: 21.1.8 (6ubuntu1)
x86_64-native-linuxapp-gcc+16byte
x86_64-native-linuxapp-gcc
x86_64-native-linuxapp-clang
x86_64-native-linuxapp-doc
OS: RHEL10.2-64RT
Kernel Version: 6.12.0-211.7.3.el10_2.x86_64+rt
GCC Version: gcc (GCC) 14.3.1 20251022 (Red Hat 14.3.1-4)
Clang Version: 21.1.8 (Red Hat, Inc. 21.1.8-1.el10)
x86_64-native-linuxapp-gcc
OS: UB2404-64
Kernel Version: 6.8.0-139-generic
GCC Version: gcc (Ubuntu 13.3.0-6ubuntu2~24.04.1) 13.3.0
Clang Version: 18.1.3 (1ubuntu1)
x86_64-native-linuxapp-gcc
OS: Fedora44-64
Kernel Version: 6.19.10-300.fc44.x86_64
GCC Version: gcc (GCC) 16.0.1 20260321 (Red Hat 16.0.1-0)
Clang Version: 22.1.8 (Fedora 22.1.8-4.fc44)
x86_64-native-linuxapp-gcc
x86_64-native-linuxapp-clang
OS: OpenEuler2404-64
Kernel Version: 6.6.0-159.4.13.167.oe2403sp4.x86_64
GCC Version: gcc (GCC) 12.3.1 (openEuler 12.3.1-110.oe2403sp4)
Clang Version: 17.0.6 ( 17.0.6-67.oe2403sp4)
x86_64-native-linuxapp-gcc
*Build Failed #1:
OS: OpenAnolis8.10-64
Target: x86_64-native-linuxapp-gcc
FAILED: app/dpdk-proc-info.p/proc-info_main.c.o
gcc -Iapp/dpdk-proc-info.p -Iapp -I../app -Ilib/ethdev -I../lib/ethdev -Ilib/eal/common -I../lib/eal/common -I. -I.. -Iconfig -I../config -Ilib/eal/include -I../lib/eal/include -Ilib/eal/linux/include -I../lib/eal/linux/include -Ilib/eal/x86/include -I../lib/eal/x86/include -I../kernel/linux -Ilib/eal -I../lib/eal -Ilib/kvargs -I../lib/kvargs -Ilib/log -I../lib/log -Ilib/metrics -I../lib/metrics -Ilib/telemetry -I../lib/telemetry -Ilib/argparse -I../lib/argparse -Ilib/net -I../lib/net -Ilib/mbuf -I../lib/mbuf -Ilib/mempool -I../lib/mempool -Ilib/ring -I../lib/ring -Ilib/meter -I../lib/meter -Ilib/security -I../lib/security -Ilib/cryptodev -I../lib/cryptodev -Ilib/rcu -I../lib/rcu -Ilib/eventdev -I../lib/eventdev -Ilib/hash -I../lib/hash -Ilib/timer -I../lib/timer -Ilib/dmadev -I../lib/dmadev -fdiagnostics-color=always -D_FILE_OFFSET_BITS=64 -Wall -Winvalid-pch -Wextra -Werror -std=c11 -O3 -include rte_config.h -Wvla -Wcast-qual -Wdeprecated -Wformat -Wformat-nonliteral -Wformat-security -Wmissing-declarations -Wmissing-prototypes -Wnested-externs -Wold-style-definition -Wpointer-arith -Wshadow -Wsign-compare -Wstrict-prototypes -Wundef -Wwrite-strings -Wno-packed-not-aligned -Wno-missing-field-initializers -D_GNU_SOURCE -march=native -mrtm -DALLOW_EXPERIMENTAL_API -Wno-vla -MD -MQ app/dpdk-proc-info.p/proc-info_main.c.o -MF app/dpdk-proc-info.p/proc-info_main.c.o.d -o app/dpdk-proc-info.p/proc-info_main.c.o -c ../app/proc-info/main.c
../app/proc-info/main.c: In function ‘show_module_eeprom_info’:
../app/proc-info/main.c:1914:10: error: implicit declaration of function ‘rte_eth_module_eeprom_parse’; did you mean ‘show_module_eeprom_info’? [-Werror=implicit-function-declaration]
ret = rte_eth_module_eeprom_parse(module_info.type,
^~~~~~~~~~~~~~~~~~~~~~~~~~~
show_module_eeprom_info
../app/proc-info/main.c:1914:10: error: nested extern declaration of ‘rte_eth_module_eeprom_parse’ [-Werror=nested-externs]
cc1: all warnings being treated as errors
[3199/3714] Generating drivers/rte_baseband_acc.sym_chk with a custom command (wrapped by meson to capture output)
[3200/3714] Compiling C object app/dpdk-graph.p/graph_conn.c.o
[3201/3714] Compiling C object app/dpdk-graph.p/graph_ethdev_rx.c.o
[3202/3714] Compiling C object app/dpdk-graph.p/graph_feature.c.o
[3203/3714] Compiling C object app/dpdk-test-bbdev.p/test-bbdev_test_bbdev_vector.c.o
[3204/3714] Compiling C object app/dpdk-graph.p/graph_graph.c.o
[3205/3714] Compiling C object app/dpdk-test-bbdev.p/test-bbdev_test_bbdev.c.o
[3206/3714] Compiling C object app/dpdk-graph.p/graph_cli.c.o
[3207/3714] Compiling C object drivers/libtmp_rte_crypto_cnxk.a.p/crypto_cnxk_cn10k_cryptodev_ops.c.o
ninja: build stopped
*Build Failed #2:
OS: FreeBSD15-64
Target: x86_64-native-bsdapp-gcc
FAILED: [code=1] app/dpdk-proc-info.p/proc-info_main.c.o
gcc -Iapp/dpdk-proc-info.p -Iapp -I../app -Ilib/ethdev -I../lib/ethdev -Ilib/eal/common -I../lib/eal/common -I. -I.. -Iconfig -I../config -Ilib/eal/include -I../lib/eal/include -Ilib/eal/freebsd/include -I../lib/eal/freebsd/include -Ilib/eal/x86/include -I../lib/eal/x86/include -Ilib/eal -I../lib/eal -Ilib/kvargs -I../lib/kvargs -Ilib/log -I../lib/log -Ilib/metrics -I../lib/metrics -Ilib/telemetry -I../lib/telemetry -Ilib/argparse -I../lib/argparse -Ilib/net -I../lib/net -Ilib/mbuf -I../lib/mbuf -Ilib/mempool -I../lib/mempool -Ilib/ring -I../lib/ring -Ilib/meter -I../lib/meter -Ilib/security -I../lib/security -Ilib/cryptodev -I../lib/cryptodev -Ilib/rcu -I../lib/rcu -Ilib/eventdev -I../lib/eventdev -Ilib/hash -I../lib/hash -Ilib/timer -I../lib/timer -Ilib/dmadev -I../lib/dmadev -fdiagnostics-color=always -D_FILE_OFFSET_BITS=64 -Wall -Winvalid-pch -Wextra -Werror -std=c11 -O3 -include rte_config.h -Wvla -Wcast-qual -Wdeprecated -Wformat -Wformat-nonliteral -Wformat-security -Wmissing-declarations -Wmissing-prototypes -Wnested-externs -Wold-style-definition -Wpointer-arith -Wshadow -Wsign-compare -Wstrict-prototypes -Wundef -Wwrite-strings -Wno-packed-not-aligned -Wno-missing-field-initializers -D_GNU_SOURCE -D__BSD_VISIBLE -march=native -mno-avx512f -mrtm -DALLOW_EXPERIMENTAL_API -Wno-vla -MD -MQ app/dpdk-proc-info.p/proc-info_main.c.o -MF app/dpdk-proc-info.p/proc-info_main.c.o.d -o app/dpdk-proc-info.p/proc-info_main.c.o -c ../app/proc-info/main.c
../app/proc-info/main.c: In function 'show_module_eeprom_info':
../app/proc-info/main.c:1914:31: error: implicit declaration of function 'rte_eth_module_eeprom_parse' [-Wimplicit-function-declaration]
1914 | ret = rte_eth_module_eeprom_parse(module_info.type,
| ^~~~~~~~~~~~~~~~~~~~~~~~~~~
../app/proc-info/main.c:1914:31: error: nested extern declaration of 'rte_eth_module_eeprom_parse' [-Werror=nested-externs]
cc1: all warnings being treated as errors
[1716/2245] Compiling C object app/dpdk-test-acl.p/test-acl_main.c.o
[1717/2245] Compiling C object app/dpdk-test-compress-perf.p/test-compress-perf_comp_perf_options_parse.c.o
[1718/2245] Compiling C object app/dpdk-dumpcap.p/dumpcap_main.c.o
[1719/2245] Compiling C object app/dpdk-test-bbdev.p/test-bbdev_test_bbdev.c.o
[1720/2245] Compiling C object app/dpdk-test-bbdev.p/test-bbdev_test_bbdev_vector.c.o
[1721/2245] Compiling C object app/dpdk-pdump.p/pdump_main.c.o
[1722/2245] Compiling C object app/dpdk-test-compress-perf.p/test-compress-perf_comp_perf_test_common.c.o
[1723/2245] Compiling C object app/dpdk-test-compress-perf.p/test-compress-perf_comp_perf_test_cyclecount.c.o
[1724/2245] Compiling C object app/dpdk-test-bbdev.p/test-bbdev_test_bbdev_perf.c.o
ninja: build stopped
*Build Failed #3:
OS: FreeBSD15-64
Target: x86_64-native-bsdapp-clang
FAILED: [code=1] app/dpdk-proc-info.p/proc-info_main.c.o
clang -Iapp/dpdk-proc-info.p -Iapp -I../app -Ilib/ethdev -I../lib/ethdev -Ilib/eal/common -I../lib/eal/common -I. -I.. -Iconfig -I../config -Ilib/eal/include -I../lib/eal/include -Ilib/eal/freebsd/include -I../lib/eal/freebsd/include -Ilib/eal/x86/include -I../lib/eal/x86/include -Ilib/eal -I../lib/eal -Ilib/kvargs -I../lib/kvargs -Ilib/log -I../lib/log -Ilib/metrics -I../lib/metrics -Ilib/telemetry -I../lib/telemetry -Ilib/argparse -I../lib/argparse -Ilib/net -I../lib/net -Ilib/mbuf -I../lib/mbuf -Ilib/mempool -I../lib/mempool -Ilib/ring -I../lib/ring -Ilib/meter -I../lib/meter -Ilib/security -I../lib/security -Ilib/cryptodev -I../lib/cryptodev -Ilib/rcu -I../lib/rcu -Ilib/eventdev -I../lib/eventdev -Ilib/hash -I../lib/hash -Ilib/timer -I../lib/timer -Ilib/dmadev -I../lib/dmadev -fdiagnostics-color=always -D_FILE_OFFSET_BITS=64 -Wall -Winvalid-pch -Wextra -Werror -std=c11 -O3 -include rte_config.h -Wvla -Wcast-qual -Wcomma -Wdeprecated -Wformat -Wformat-nonliteral -Wformat-security -Wmissing-declarations -Wmissing-prototypes -Wnested-externs -Wold-style-definition -Wpointer-arith -Wshadow -Wsign-compare -Wstrict-prototypes -Wundef -Wwrite-strings -Wno-missing-field-initializers -D_GNU_SOURCE -D__BSD_VISIBLE -march=native -mrtm -DALLOW_EXPERIMENTAL_API -Wno-vla -MD -MQ app/dpdk-proc-info.p/proc-info_main.c.o -MF app/dpdk-proc-info.p/proc-info_main.c.o.d -o app/dpdk-proc-info.p/proc-info_main.c.o -c ../app/proc-info/main.c
../app/proc-info/main.c:1914:10: error: call to undeclared function 'rte_eth_module_eeprom_parse'; ISO C99 and later do not support implicit function declarations [-Werror,-Wimplicit-function-declaration]
1914 | ret = rte_eth_module_eeprom_parse(module_info.type,
| ^
1 error generated.
[1727/2266] Compiling C object app/dpdk-test-compress-perf.p/test-compress-perf_comp_perf_options_parse.c.o
[1728/2266] Compiling C object app/dpdk-dumpcap.p/dumpcap_main.c.o
[1729/2266] Compiling C object app/dpdk-test-acl.p/test-acl_main.c.o
[1730/2266] Compiling C object app/dpdk-pdump.p/pdump_main.c.o
[1731/2266] Compiling C object app/dpdk-test-bbdev.p/test-bbdev_test_bbdev.c.o
[1732/2266] Compiling C object app/dpdk-test-compress-perf.p/test-compress-perf_comp_perf_test_common.c.o
[1733/2266] Compiling C object app/dpdk-test-bbdev.p/test-bbdev_test_bbdev_vector.c.o
[1734/2266] Compiling C object app/dpdk-test-compress-perf.p/test-compress-perf_comp_perf_test_cyclecount.c.o
[1735/2266] Compiling C object app/dpdk-test-bbdev.p/test-bbdev_test_bbdev_perf.c.o
ninja: build stopped
*Build Failed #4:
OS: FreeBSD15-64
Target: x86_64-native-bsdapp-gcc+shared
FAILED: [code=1] app/dpdk-proc-info.p/proc-info_main.c.o
gcc -Iapp/dpdk-proc-info.p -Iapp -I../app -Ilib/ethdev -I../lib/ethdev -Ilib/eal/common -I../lib/eal/common -I. -I.. -Iconfig -I../config -Ilib/eal/include -I../lib/eal/include -Ilib/eal/freebsd/include -I../lib/eal/freebsd/include -Ilib/eal/x86/include -I../lib/eal/x86/include -Ilib/eal -I../lib/eal -Ilib/kvargs -I../lib/kvargs -Ilib/log -I../lib/log -Ilib/metrics -I../lib/metrics -Ilib/telemetry -I../lib/telemetry -Ilib/argparse -I../lib/argparse -Ilib/net -I../lib/net -Ilib/mbuf -I../lib/mbuf -Ilib/mempool -I../lib/mempool -Ilib/ring -I../lib/ring -Ilib/meter -I../lib/meter -Ilib/security -I../lib/security -Ilib/cryptodev -I../lib/cryptodev -Ilib/rcu -I../lib/rcu -Ilib/eventdev -I../lib/eventdev -Ilib/hash -I../lib/hash -Ilib/timer -I../lib/timer -Ilib/dmadev -I../lib/dmadev -fdiagnostics-color=always -D_FILE_OFFSET_BITS=64 -Wall -Winvalid-pch -Wextra -Werror -std=c11 -O3 -include rte_config.h -Wvla -Wcast-qual -Wdeprecated -Wformat -Wformat-nonliteral -Wformat-security -Wmissing-declarations -Wmissing-prototypes -Wnested-externs -Wold-style-definition -Wpointer-arith -Wshadow -Wsign-compare -Wstrict-prototypes -Wundef -Wwrite-strings -Wno-packed-not-aligned -Wno-missing-field-initializers -D_GNU_SOURCE -D__BSD_VISIBLE -march=native -mno-avx512f -mrtm -DALLOW_EXPERIMENTAL_API -Wno-vla -MD -MQ app/dpdk-proc-info.p/proc-info_main.c.o -MF app/dpdk-proc-info.p/proc-info_main.c.o.d -o app/dpdk-proc-info.p/proc-info_main.c.o -c ../app/proc-info/main.c
../app/proc-info/main.c: In function 'show_module_eeprom_info':
../app/proc-info/main.c:1914:31: error: implicit declaration of function 'rte_eth_module_eeprom_parse' [-Wimplicit-function-declaration]
1914 | ret = rte_eth_module_eeprom_parse(module_info.type,
| ^~~~~~~~~~~~~~~~~~~~~~~~~~~
../app/proc-info/main.c:1914:31: error: nested extern declaration of 'rte_eth_module_eeprom_parse' [-Werror=nested-externs]
cc1: all warnings being treated as errors
[1767/2122] Compiling C object drivers/librte_net_sxe2_avx2_lib.a.p/net_sxe2_sxe2_txrx_vec_avx2.c.o
[1768/2122] Compiling C object app/dpdk-test-bbdev.p/test-bbdev_main.c.o
[1769/2122] Compiling C object app/dpdk-test-acl.p/test-acl_main.c.o
[1770/2122] Compiling C object app/dpdk-dumpcap.p/dumpcap_main.c.o
[1771/2122] Compiling C object app/dpdk-test-compress-perf.p/test-compress-perf_comp_perf_options_parse.c.o
[1772/2122] Compiling C object app/dpdk-test-bbdev.p/test-bbdev_test_bbdev.c.o
[1773/2122] Compiling C object app/dpdk-pdump.p/pdump_main.c.o
[1774/2122] Compiling C object app/dpdk-test-bbdev.p/test-bbdev_test_bbdev_vector.c.o
[1775/2122] Compiling C object app/dpdk-test-bbdev.p/test-bbdev_test_bbdev_perf.c.o
ninja: build stopped
*Build Failed #5:
OS: FreeBSD15-64
Target: x86_64-native-bsdapp-gcc+debug
FAILED: [code=1] app/dpdk-proc-info.p/proc-info_main.c.o
gcc -Iapp/dpdk-proc-info.p -Iapp -I../app -Ilib/ethdev -I../lib/ethdev -Ilib/eal/common -I../lib/eal/common -I. -I.. -Iconfig -I../config -Ilib/eal/include -I../lib/eal/include -Ilib/eal/freebsd/include -I../lib/eal/freebsd/include -Ilib/eal/x86/include -I../lib/eal/x86/include -Ilib/eal -I../lib/eal -Ilib/kvargs -I../lib/kvargs -Ilib/log -I../lib/log -Ilib/metrics -I../lib/metrics -Ilib/telemetry -I../lib/telemetry -Ilib/argparse -I../lib/argparse -Ilib/net -I../lib/net -Ilib/mbuf -I../lib/mbuf -Ilib/mempool -I../lib/mempool -Ilib/ring -I../lib/ring -Ilib/meter -I../lib/meter -Ilib/security -I../lib/security -Ilib/cryptodev -I../lib/cryptodev -Ilib/rcu -I../lib/rcu -Ilib/eventdev -I../lib/eventdev -Ilib/hash -I../lib/hash -Ilib/timer -I../lib/timer -Ilib/dmadev -I../lib/dmadev -fdiagnostics-color=always -D_FILE_OFFSET_BITS=64 -Wall -Winvalid-pch -Wextra -Werror -std=c11 -O2 -g -include rte_config.h -Wvla -Wcast-qual -Wdeprecated -Wformat -Wformat-nonliteral -Wformat-security -Wmissing-declarations -Wmissing-prototypes -Wnested-externs -Wold-style-definition -Wpointer-arith -Wshadow -Wsign-compare -Wstrict-prototypes -Wundef -Wwrite-strings -Wno-packed-not-aligned -Wno-missing-field-initializers -D_GNU_SOURCE -D__BSD_VISIBLE -march=native -mno-avx512f -mrtm -DALLOW_EXPERIMENTAL_API -Wno-vla -MD -MQ app/dpdk-proc-info.p/proc-info_main.c.o -MF app/dpdk-proc-info.p/proc-info_main.c.o.d -o app/dpdk-proc-info.p/proc-info_main.c.o -c ../app/proc-info/main.c
../app/proc-info/main.c: In function 'show_module_eeprom_info':
../app/proc-info/main.c:1914:31: error: implicit declaration of function 'rte_eth_module_eeprom_parse' [-Wimplicit-function-declaration]
1914 | ret = rte_eth_module_eeprom_parse(module_info.type,
| ^~~~~~~~~~~~~~~~~~~~~~~~~~~
../app/proc-info/main.c:1914:31: error: nested extern declaration of 'rte_eth_module_eeprom_parse' [-Werror=nested-externs]
cc1: all warnings being treated as errors
[1716/2245] Compiling C object app/dpdk-test-compress-perf.p/test-compress-perf_comp_perf_options_parse.c.o
[1717/2245] Compiling C object app/dpdk-test-acl.p/test-acl_main.c.o
[1718/2245] Compiling C object app/dpdk-dumpcap.p/dumpcap_main.c.o
[1719/2245] Compiling C object app/dpdk-test-bbdev.p/test-bbdev_test_bbdev.c.o
[1720/2245] Compiling C object app/dpdk-test-bbdev.p/test-bbdev_test_bbdev_vector.c.o
[1721/2245] Compiling C object app/dpdk-test-compress-perf.p/test-compress-perf_comp_perf_test_common.c.o
[1722/2245] Compiling C object app/dpdk-pdump.p/pdump_main.c.o
[1723/2245] Compiling C object app/dpdk-test-compress-perf.p/test-compress-perf_comp_perf_test_cyclecount.c.o
[1724/2245] Compiling C object app/dpdk-test-bbdev.p/test-bbdev_test_bbdev_perf.c.o
ninja: build stopped
*Build Failed #6:
OS: RHEL9.8-64
Target: x86_64-native-linuxapp-gcc
FAILED: app/dpdk-proc-info.p/proc-info_main.c.o
gcc -Iapp/dpdk-proc-info.p -Iapp -I../app -Ilib/ethdev -I../lib/ethdev -Ilib/eal/common -I../lib/eal/common -I. -I.. -Iconfig -I../config -Ilib/eal/include -I../lib/eal/include -Ilib/eal/linux/include -I../lib/eal/linux/include -Ilib/eal/x86/include -I../lib/eal/x86/include -I../kernel/linux -Ilib/eal -I../lib/eal -Ilib/kvargs -I../lib/kvargs -Ilib/log -I../lib/log -Ilib/metrics -I../lib/metrics -Ilib/telemetry -I../lib/telemetry -Ilib/argparse -I../lib/argparse -Ilib/net -I../lib/net -Ilib/mbuf -I../lib/mbuf -Ilib/mempool -I../lib/mempool -Ilib/ring -I../lib/ring -Ilib/meter -I../lib/meter -Ilib/security -I../lib/security -Ilib/cryptodev -I../lib/cryptodev -Ilib/rcu -I../lib/rcu -Ilib/eventdev -I../lib/eventdev -Ilib/hash -I../lib/hash -Ilib/timer -I../lib/timer -Ilib/dmadev -I../lib/dmadev -fdiagnostics-color=always -D_FILE_OFFSET_BITS=64 -Wall -Winvalid-pch -Wextra -Werror -std=c11 -O3 -include rte_config.h -Wvla -Wcast-qual -Wdeprecated -Wformat -Wformat-nonliteral -Wformat-security -Wmissing-declarations -Wmissing-prototypes -Wnested-externs -Wold-style-definition -Wpointer-arith -Wshadow -Wsign-compare -Wstrict-prototypes -Wundef -Wwrite-strings -Wno-packed-not-aligned -Wno-missing-field-initializers -D_GNU_SOURCE -march=native -mrtm -DALLOW_EXPERIMENTAL_API -Wno-vla -MD -MQ app/dpdk-proc-info.p/proc-info_main.c.o -MF app/dpdk-proc-info.p/proc-info_main.c.o.d -o app/dpdk-proc-info.p/proc-info_main.c.o -c ../app/proc-info/main.c
../app/proc-info/main.c: In function ‘show_module_eeprom_info’:
../app/proc-info/main.c:1914:31: error: implicit declaration of function ‘rte_eth_module_eeprom_parse’ [-Werror=implicit-function-declaration]
1914 | ret = rte_eth_module_eeprom_parse(module_info.type,
| ^~~~~~~~~~~~~~~~~~~~~~~~~~~
../app/proc-info/main.c:1914:31: error: nested extern declaration of ‘rte_eth_module_eeprom_parse’ [-Werror=nested-externs]
cc1: all warnings being treated as errors
[3172/3655] Compiling C object app/dpdk-test-compress-perf.p/test-compress-perf_comp_perf_test_verify.c.o
[3173/3655] Compiling C object app/dpdk-test-bbdev.p/test-bbdev_test_bbdev.c.o
[3174/3655] Compiling C object app/dpdk-test-compress-perf.p/test-compress-perf_comp_perf_test_cyclecount.c.o
[3175/3655] Generating drivers/rte_crypto_cnxk.pmd.c with a custom command
[3176/3655] Compiling C object app/dpdk-test-compress-perf.p/test-compress-perf_comp_perf_test_common.c.o
[3177/3655] Compiling C object app/dpdk-test-crypto-perf.p/test-crypto-perf_main.c.o
[3178/3655] Compiling C object app/dpdk-test-crypto-perf.p/test-crypto-perf_cperf_options_parsing.c.o
[3179/3655] Compiling C object app/dpdk-test-crypto-perf.p/test-crypto-perf_cperf_ops.c.o
[3180/3655] Compiling C object app/dpdk-test-bbdev.p/test-bbdev_test_bbdev_perf.c.o
ninja: build stopped
*Build Failed #7:
OS: RHEL9.8-64
Target: x86_64-native-linuxapp-clang
FAILED: app/dpdk-proc-info.p/proc-info_main.c.o
clang -Iapp/dpdk-proc-info.p -Iapp -I../app -Ilib/ethdev -I../lib/ethdev -Ilib/eal/common -I../lib/eal/common -I. -I.. -Iconfig -I../config -Ilib/eal/include -I../lib/eal/include -Ilib/eal/linux/include -I../lib/eal/linux/include -Ilib/eal/x86/include -I../lib/eal/x86/include -I../kernel/linux -Ilib/eal -I../lib/eal -Ilib/kvargs -I../lib/kvargs -Ilib/log -I../lib/log -Ilib/metrics -I../lib/metrics -Ilib/telemetry -I../lib/telemetry -Ilib/argparse -I../lib/argparse -Ilib/net -I../lib/net -Ilib/mbuf -I../lib/mbuf -Ilib/mempool -I../lib/mempool -Ilib/ring -I../lib/ring -Ilib/meter -I../lib/meter -Ilib/security -I../lib/security -Ilib/cryptodev -I../lib/cryptodev -Ilib/rcu -I../lib/rcu -Ilib/eventdev -I../lib/eventdev -Ilib/hash -I../lib/hash -Ilib/timer -I../lib/timer -Ilib/dmadev -I../lib/dmadev -fdiagnostics-color=always -D_FILE_OFFSET_BITS=64 -Wall -Winvalid-pch -Wextra -Werror -std=c11 -O3 -include rte_config.h -Wvla -Wcast-qual -Wcomma -Wdeprecated -Wformat -Wformat-nonliteral -Wformat-security -Wmissing-declarations -Wmissing-prototypes -Wnested-externs -Wold-style-definition -Wpointer-arith -Wshadow -Wsign-compare -Wstrict-prototypes -Wundef -Wwrite-strings -Wno-missing-field-initializers -D_GNU_SOURCE -march=native -mrtm -DALLOW_EXPERIMENTAL_API -Wno-vla -MD -MQ app/dpdk-proc-info.p/proc-info_main.c.o -MF app/dpdk-proc-info.p/proc-info_main.c.o.d -o app/dpdk-proc-info.p/proc-info_main.c.o -c ../app/proc-info/main.c
../app/proc-info/main.c:1914:10: error: call to undeclared function 'rte_eth_module_eeprom_parse'; ISO C99 and later do not support implicit function declarations [-Wimplicit-function-declaration]
1914 | ret = rte_eth_module_eeprom_parse(module_info.type,
| ^
1 error generated.
[3179/3655] Compiling C object app/dpdk-test-compress-perf.p/test-compress-perf_comp_perf_test_common.c.o
[3180/3655] Compiling C object app/dpdk-test-compress-perf.p/test-compress-perf_comp_perf_test_verify.c.o
[3181/3655] Compiling C object app/dpdk-test-crypto-perf.p/test-crypto-perf_cperf_test_throughput.c.o
[3182/3655] Compiling C object app/dpdk-test-compress-perf.p/test-compress-perf_comp_perf_test_cyclecount.c.o
[3183/3655] Compiling C object app/dpdk-test-compress-perf.p/test-compress-perf_main.c.o
[3184/3655] Linking target app/dpdk-test-cmdline
[3185/3655] Linking target app/dpdk-test-acl
[3186/3655] Linking target app/dpdk-pdump
[3187/3655] Linking target app/dpdk-graph
ninja: build stopped
*Build Failed #8:
OS: RHEL9.8-64
Target: x86_64-native-linuxapp-gcc+shared
FAILED: app/dpdk-proc-info.p/proc-info_main.c.o
gcc -Iapp/dpdk-proc-info.p -Iapp -I../app -Ilib/ethdev -I../lib/ethdev -Ilib/eal/common -I../lib/eal/common -I. -I.. -Iconfig -I../config -Ilib/eal/include -I../lib/eal/include -Ilib/eal/linux/include -I../lib/eal/linux/include -Ilib/eal/x86/include -I../lib/eal/x86/include -I../kernel/linux -Ilib/eal -I../lib/eal -Ilib/kvargs -I../lib/kvargs -Ilib/log -I../lib/log -Ilib/metrics -I../lib/metrics -Ilib/telemetry -I../lib/telemetry -Ilib/argparse -I../lib/argparse -Ilib/net -I../lib/net -Ilib/mbuf -I../lib/mbuf -Ilib/mempool -I../lib/mempool -Ilib/ring -I../lib/ring -Ilib/meter -I../lib/meter -Ilib/security -I../lib/security -Ilib/cryptodev -I../lib/cryptodev -Ilib/rcu -I../lib/rcu -Ilib/eventdev -I../lib/eventdev -Ilib/hash -I../lib/hash -Ilib/timer -I../lib/timer -Ilib/dmadev -I../lib/dmadev -fdiagnostics-color=always -D_FILE_OFFSET_BITS=64 -Wall -Winvalid-pch -Wextra -Werror -std=c11 -O3 -include rte_config.h -Wvla -Wcast-qual -Wdeprecated -Wformat -Wformat-nonliteral -Wformat-security -Wmissing-declarations -Wmissing-prototypes -Wnested-externs -Wold-style-definition -Wpointer-arith -Wshadow -Wsign-compare -Wstrict-prototypes -Wundef -Wwrite-strings -Wno-packed-not-aligned -Wno-missing-field-initializers -D_GNU_SOURCE -march=native -mrtm -DALLOW_EXPERIMENTAL_API -Wno-vla -MD -MQ app/dpdk-proc-info.p/proc-info_main.c.o -MF app/dpdk-proc-info.p/proc-info_main.c.o.d -o app/dpdk-proc-info.p/proc-info_main.c.o -c ../app/proc-info/main.c
../app/proc-info/main.c: In function ‘show_module_eeprom_info’:
../app/proc-info/main.c:1914:31: error: implicit declaration of function ‘rte_eth_module_eeprom_parse’ [-Werror=implicit-function-declaration]
1914 | ret = rte_eth_module_eeprom_parse(module_info.type,
| ^~~~~~~~~~~~~~~~~~~~~~~~~~~
../app/proc-info/main.c:1914:31: error: nested extern declaration of ‘rte_eth_module_eeprom_parse’ [-Werror=nested-externs]
cc1: all warnings being treated as errors
[3188/3508] Generating drivers/rte_baseband_acc.pmd.c with a custom command
[3189/3508] Compiling C object app/dpdk-graph.p/graph_feature.c.o
[3190/3508] Compiling C object app/dpdk-graph.p/graph_ip4_route.c.o
[3191/3508] Compiling C object app/dpdk-graph.p/graph_ethdev.c.o
[3192/3508] Compiling C object app/dpdk-graph.p/graph_graph.c.o
[3193/3508] Compiling C object app/dpdk-graph.p/graph_ip6_route.c.o
[3194/3508] Compiling C object app/dpdk-graph.p/graph_ip4_output_hook.c.o
[3195/3508] Compiling C object app/dpdk-graph.p/graph_l2fwd.c.o
[3196/3508] Compiling C object app/dpdk-graph.p/graph_l3fwd.c.o
ninja: build stopped
*Build Failed #9:
OS: RHEL9.8-64
Target: x86_64-native-linuxapp-gcc+debug
FAILED: app/dpdk-proc-info.p/proc-info_main.c.o
gcc -Iapp/dpdk-proc-info.p -Iapp -I../app -Ilib/ethdev -I../lib/ethdev -Ilib/eal/common -I../lib/eal/common -I. -I.. -Iconfig -I../config -Ilib/eal/include -I../lib/eal/include -Ilib/eal/linux/include -I../lib/eal/linux/include -Ilib/eal/x86/include -I../lib/eal/x86/include -I../kernel/linux -Ilib/eal -I../lib/eal -Ilib/kvargs -I../lib/kvargs -Ilib/log -I../lib/log -Ilib/metrics -I../lib/metrics -Ilib/telemetry -I../lib/telemetry -Ilib/argparse -I../lib/argparse -Ilib/net -I../lib/net -Ilib/mbuf -I../lib/mbuf -Ilib/mempool -I../lib/mempool -Ilib/ring -I../lib/ring -Ilib/meter -I../lib/meter -Ilib/security -I../lib/security -Ilib/cryptodev -I../lib/cryptodev -Ilib/rcu -I../lib/rcu -Ilib/eventdev -I../lib/eventdev -Ilib/hash -I../lib/hash -Ilib/timer -I../lib/timer -Ilib/dmadev -I../lib/dmadev -fdiagnostics-color=always -D_FILE_OFFSET_BITS=64 -Wall -Winvalid-pch -Wextra -Werror -std=c11 -O2 -g -include rte_config.h -Wvla -Wcast-qual -Wdeprecated -Wformat -Wformat-nonliteral -Wformat-security -Wmissing-declarations -Wmissing-prototypes -Wnested-externs -Wold-style-definition -Wpointer-arith -Wshadow -Wsign-compare -Wstrict-prototypes -Wundef -Wwrite-strings -Wno-packed-not-aligned -Wno-missing-field-initializers -D_GNU_SOURCE -march=native -mrtm -DALLOW_EXPERIMENTAL_API -Wno-vla -MD -MQ app/dpdk-proc-info.p/proc-info_main.c.o -MF app/dpdk-proc-info.p/proc-info_main.c.o.d -o app/dpdk-proc-info.p/proc-info_main.c.o -c ../app/proc-info/main.c
../app/proc-info/main.c: In function ‘show_module_eeprom_info’:
../app/proc-info/main.c:1914:31: error: implicit declaration of function ‘rte_eth_module_eeprom_parse’ [-Werror=implicit-function-declaration]
1914 | ret = rte_eth_module_eeprom_parse(module_info.type,
| ^~~~~~~~~~~~~~~~~~~~~~~~~~~
../app/proc-info/main.c:1914:31: error: nested extern declaration of ‘rte_eth_module_eeprom_parse’ [-Werror=nested-externs]
cc1: all warnings being treated as errors
[3166/3655] Compiling C object app/dpdk-pdump.p/pdump_main.c.o
[3167/3655] Compiling C object app/dpdk-test-bbdev.p/test-bbdev_test_bbdev.c.o
[3168/3655] Compiling C object app/dpdk-test-compress-perf.p/test-compress-perf_comp_perf_test_throughput.c.o
[3169/3655] Compiling C object app/dpdk-test-compress-perf.p/test-compress-perf_comp_perf_test_cyclecount.c.o
[3170/3655] Compiling C object app/dpdk-test-compress-perf.p/test-compress-perf_comp_perf_test_common.c.o
[3171/3655] Compiling C object app/dpdk-test-compress-perf.p/test-compress-perf_comp_perf_test_verify.c.o
[3172/3655] Compiling C object app/dpdk-test-crypto-perf.p/test-crypto-perf_cperf_test_throughput.c.o
[3173/3655] Compiling C object drivers/libtmp_rte_crypto_cnxk.a.p/crypto_cnxk_cn10k_cryptodev_ops.c.o
[3174/3655] Compiling C object app/dpdk-test-bbdev.p/test-bbdev_test_bbdev_perf.c.o
ninja: build stopped
*Build Failed #10:
OS: SUSE16-64
Target: x86_64-native-linuxapp-clang
FAILED: app/dpdk-proc-info.p/proc-info_main.c.o
clang -Iapp/dpdk-proc-info.p -Iapp -I../app -Ilib/ethdev -I../lib/ethdev -Ilib/eal/common -I../lib/eal/common -I. -I.. -Iconfig -I../config -Ilib/eal/include -I../lib/eal/include -Ilib/eal/linux/include -I../lib/eal/linux/include -Ilib/eal/x86/include -I../lib/eal/x86/include -I../kernel/linux -Ilib/eal -I../lib/eal -Ilib/kvargs -I../lib/kvargs -Ilib/log -I../lib/log -Ilib/metrics -I../lib/metrics -Ilib/telemetry -I../lib/telemetry -Ilib/argparse -I../lib/argparse -Ilib/net -I../lib/net -Ilib/mbuf -I../lib/mbuf -Ilib/mempool -I../lib/mempool -Ilib/ring -I../lib/ring -Ilib/meter -I../lib/meter -Ilib/security -I../lib/security -Ilib/cryptodev -I../lib/cryptodev -Ilib/rcu -I../lib/rcu -Ilib/eventdev -I../lib/eventdev -Ilib/hash -I../lib/hash -Ilib/timer -I../lib/timer -Ilib/dmadev -I../lib/dmadev -fdiagnostics-color=always -D_FILE_OFFSET_BITS=64 -Wall -Winvalid-pch -Wextra -Werror -std=c11 -O3 -include rte_config.h -Wvla -Wcast-qual -Wcomma -Wdeprecated -Wformat -Wformat-nonliteral -Wformat-security -Wmissing-declarations -Wmissing-prototypes -Wnested-externs -Wold-style-definition -Wpointer-arith -Wshadow -Wsign-compare -Wstrict-prototypes -Wundef -Wwrite-strings -Wno-missing-field-initializers -D_GNU_SOURCE -march=native -mrtm -DALLOW_EXPERIMENTAL_API -Wno-vla -MD -MQ app/dpdk-proc-info.p/proc-info_main.c.o -MF app/dpdk-proc-info.p/proc-info_main.c.o.d -o app/dpdk-proc-info.p/proc-info_main.c.o -c ../app/proc-info/main.c
../app/proc-info/main.c:1914:10: error: call to undeclared function 'rte_eth_module_eeprom_parse'; ISO C99 and later do not support implicit function declarations [-Wimplicit-function-declaration]
1914 | ret = rte_eth_module_eeprom_parse(module_info.type,
| ^
1 error generated.
[3153/3637] Compiling C object app/dpdk-test-compress-perf.p/test-compress-perf_main.c.o
[3154/3637] Compiling C object app/dpdk-test-compress-perf.p/test-compress-perf_comp_perf_test_throughput.c.o
[3155/3637] Compiling C object app/dpdk-test-bbdev.p/test-bbdev_test_bbdev.c.o
[3156/3637] Compiling C object app/dpdk-test-bbdev.p/test-bbdev_test_bbdev_vector.c.o
[3157/3637] Linking target app/dpdk-test-acl
[3158/3637] Compiling C object app/dpdk-pdump.p/pdump_main.c.o
[3159/3637] Compiling C object app/dpdk-test-compress-perf.p/test-compress-perf_comp_perf_options_parse.c.o
[3160/3637] Linking target app/dpdk-graph
[3161/3637] Compiling C object app/dpdk-test-bbdev.p/test-bbdev_test_bbdev_perf.c.o
ninja: build stopped
*Build Failed #11:
OS: SUSE16-64
Target: x86_64-native-linuxapp-gcc
FAILED: app/dpdk-proc-info.p/proc-info_main.c.o
gcc -Iapp/dpdk-proc-info.p -Iapp -I../app -Ilib/ethdev -I../lib/ethdev -Ilib/eal/common -I../lib/eal/common -I. -I.. -Iconfig -I../config -Ilib/eal/include -I../lib/eal/include -Ilib/eal/linux/include -I../lib/eal/linux/include -Ilib/eal/x86/include -I../lib/eal/x86/include -I../kernel/linux -Ilib/eal -I../lib/eal -Ilib/kvargs -I../lib/kvargs -Ilib/log -I../lib/log -Ilib/metrics -I../lib/metrics -Ilib/telemetry -I../lib/telemetry -Ilib/argparse -I../lib/argparse -Ilib/net -I../lib/net -Ilib/mbuf -I../lib/mbuf -Ilib/mempool -I../lib/mempool -Ilib/ring -I../lib/ring -Ilib/meter -I../lib/meter -Ilib/security -I../lib/security -Ilib/cryptodev -I../lib/cryptodev -Ilib/rcu -I../lib/rcu -Ilib/eventdev -I../lib/eventdev -Ilib/hash -I../lib/hash -Ilib/timer -I../lib/timer -Ilib/dmadev -I../lib/dmadev -fdiagnostics-color=always -D_FILE_OFFSET_BITS=64 -Wall -Winvalid-pch -Wextra -Werror -std=c11 -O3 -include rte_config.h -Wvla -Wcast-qual -Wdeprecated -Wformat -Wformat-nonliteral -Wformat-security -Wmissing-declarations -Wmissing-prototypes -Wnested-externs -Wold-style-definition -Wpointer-arith -Wshadow -Wsign-compare -Wstrict-prototypes -Wundef -Wwrite-strings -Wno-packed-not-aligned -Wno-missing-field-initializers -fzero-init-padding-bits=all -D_GNU_SOURCE -march=native -mrtm -DALLOW_EXPERIMENTAL_API -Wno-vla -MD -MQ app/dpdk-proc-info.p/proc-info_main.c.o -MF app/dpdk-proc-info.p/proc-info_main.c.o.d -o app/dpdk-proc-info.p/proc-info_main.c.o -c ../app/proc-info/main.c
../app/proc-info/main.c: In function ‘show_module_eeprom_info’:
../app/proc-info/main.c:1914:31: error: implicit declaration of function ‘rte_eth_module_eeprom_parse’ [-Wimplicit-function-declaration]
1914 | ret = rte_eth_module_eeprom_parse(module_info.type,
| ^~~~~~~~~~~~~~~~~~~~~~~~~~~
../app/proc-info/main.c:1914:31: error: nested extern declaration of ‘rte_eth_module_eeprom_parse’ [-Werror=nested-externs]
cc1: all warnings being treated as errors
[3153/3637] Compiling C object app/dpdk-test-acl.p/test-acl_main.c.o
[3154/3637] Compiling C object app/dpdk-test-bbdev.p/test-bbdev_main.c.o
[3155/3637] Compiling C object app/dpdk-test-bbdev.p/test-bbdev_test_bbdev.c.o
[3156/3637] Compiling C object app/dpdk-test-compress-perf.p/test-compress-perf_comp_perf_test_throughput.c.o
[3157/3637] Linking target app/dpdk-graph
[3158/3637] Compiling C object app/dpdk-test-compress-perf.p/test-compress-perf_comp_perf_test_verify.c.o
[3159/3637] Compiling C object app/dpdk-test-bbdev.p/test-bbdev_test_bbdev_vector.c.o
[3160/3637] Compiling C object app/dpdk-pdump.p/pdump_main.c.o
[3161/3637] Compiling C object app/dpdk-test-bbdev.p/test-bbdev_test_bbdev_perf.c.o
ninja: build stopped
*Build Failed #12:
OS: AzureLinux4.0-64
Target: x86_64-native-linuxapp-gcc
FAILED: app/dpdk-proc-info.p/proc-info_main.c.o
gcc -Iapp/dpdk-proc-info.p -Iapp -I../app -Ilib/ethdev -I../lib/ethdev -Ilib/eal/common -I../lib/eal/common -I. -I.. -Iconfig -I../config -Ilib/eal/include -I../lib/eal/include -Ilib/eal/linux/include -I../lib/eal/linux/include -Ilib/eal/x86/include -I../lib/eal/x86/include -I../kernel/linux -Ilib/eal -I../lib/eal -Ilib/kvargs -I../lib/kvargs -Ilib/log -I../lib/log -Ilib/metrics -I../lib/metrics -Ilib/telemetry -I../lib/telemetry -Ilib/argparse -I../lib/argparse -Ilib/net -I../lib/net -Ilib/mbuf -I../lib/mbuf -Ilib/mempool -I../lib/mempool -Ilib/ring -I../lib/ring -Ilib/meter -I../lib/meter -Ilib/security -I../lib/security -Ilib/cryptodev -I../lib/cryptodev -Ilib/rcu -I../lib/rcu -Ilib/eventdev -I../lib/eventdev -Ilib/hash -I../lib/hash -Ilib/timer -I../lib/timer -Ilib/dmadev -I../lib/dmadev -fdiagnostics-color=always -D_FILE_OFFSET_BITS=64 -Wall -Winvalid-pch -Wextra -Werror -std=c11 -O3 -include rte_config.h -Wvla -Wcast-qual -Wdeprecated -Wformat -Wformat-nonliteral -Wformat-security -Wmissing-declarations -Wmissing-prototypes -Wnested-externs -Wold-style-definition -Wpointer-arith -Wshadow -Wsign-compare -Wstrict-prototypes -Wundef -Wwrite-strings -Wno-packed-not-aligned -Wno-missing-field-initializers -fzero-init-padding-bits=all -D_GNU_SOURCE -march=native -mrtm -DALLOW_EXPERIMENTAL_API -Wno-vla -MD -MQ app/dpdk-proc-info.p/proc-info_main.c.o -MF app/dpdk-proc-info.p/proc-info_main.c.o.d -o app/dpdk-proc-info.p/proc-info_main.c.o -c ../app/proc-info/main.c
../app/proc-info/main.c: In function ‘show_module_eeprom_info’:
../app/proc-info/main.c:1914:31: error: implicit declaration of function ‘rte_eth_module_eeprom_parse’ [-Wimplicit-function-declaration]
1914 | ret = rte_eth_module_eeprom_parse(module_info.type,
| ^~~~~~~~~~~~~~~~~~~~~~~~~~~
../app/proc-info/main.c:1914:31: error: nested extern declaration of ‘rte_eth_module_eeprom_parse’ [-Werror=nested-externs]
cc1: all warnings being treated as errors
[3172/3655] Compiling C object app/dpdk-graph.p/graph_utils.c.o
[3173/3655] Compiling C object app/dpdk-test-bbdev.p/test-bbdev_main.c.o
[3174/3655] Compiling C object app/dpdk-test-compress-perf.p/test-compress-perf_comp_perf_test_throughput.c.o
[3175/3655] Compiling C object app/dpdk-test-bbdev.p/test-bbdev_test_bbdev.c.o
[3176/3655] Compiling C object app/dpdk-test-acl.p/test-acl_main.c.o
[3177/3655] Compiling C object app/dpdk-test-compress-perf.p/test-compress-perf_comp_perf_test_cyclecount.c.o
[3178/3655] Compiling C object app/dpdk-test-bbdev.p/test-bbdev_test_bbdev_vector.c.o
[3179/3655] Compiling C object app/dpdk-pdump.p/pdump_main.c.o
[3180/3655] Compiling C object app/dpdk-test-bbdev.p/test-bbdev_test_bbdev_perf.c.o
ninja: build stopped
*Build Failed #13:
OS: UB2604-32
Target: i686-native-linuxapp-gcc
FAILED: app/dpdk-proc-info.p/proc-info_main.c.o
gcc -Iapp/dpdk-proc-info.p -Iapp -I../app -Ilib/ethdev -I../lib/ethdev -Ilib/eal/common -I../lib/eal/common -I. -I.. -Iconfig -I../config -Ilib/eal/include -I../lib/eal/include -Ilib/eal/linux/include -I../lib/eal/linux/include -Ilib/eal/x86/include -I../lib/eal/x86/include -I../kernel/linux -Ilib/eal -I../lib/eal -Ilib/kvargs -I../lib/kvargs -Ilib/log -I../lib/log -Ilib/metrics -I../lib/metrics -Ilib/telemetry -I../lib/telemetry -Ilib/argparse -I../lib/argparse -Ilib/net -I../lib/net -Ilib/mbuf -I../lib/mbuf -Ilib/mempool -I../lib/mempool -Ilib/ring -I../lib/ring -Ilib/meter -I../lib/meter -Ilib/security -I../lib/security -Ilib/cryptodev -I../lib/cryptodev -Ilib/rcu -I../lib/rcu -Ilib/eventdev -I../lib/eventdev -Ilib/hash -I../lib/hash -Ilib/timer -I../lib/timer -Ilib/dmadev -I../lib/dmadev -fdiagnostics-color=always -D_FILE_OFFSET_BITS=64 -Wall -Winvalid-pch -Wextra -Werror -std=c11 -O3 -include rte_config.h -Wvla -Wcast-qual -Wdeprecated -Wformat -Wformat-nonliteral -Wformat-security -Wmissing-declarations -Wmissing-prototypes -Wnested-externs -Wold-style-definition -Wpointer-arith -Wshadow -Wsign-compare -Wstrict-prototypes -Wundef -Wwrite-strings -Wno-packed-not-aligned -Wno-missing-field-initializers -fzero-init-padding-bits=all -Wno-pointer-to-int-cast -D_GNU_SOURCE -m32 -march=native -mrtm -DALLOW_EXPERIMENTAL_API -Wno-vla -MD -MQ app/dpdk-proc-info.p/proc-info_main.c.o -MF app/dpdk-proc-info.p/proc-info_main.c.o.d -o app/dpdk-proc-info.p/proc-info_main.c.o -c ../app/proc-info/main.c
../app/proc-info/main.c: In function ‘show_module_eeprom_info’:
../app/proc-info/main.c:1914:31: error: implicit declaration of function ‘rte_eth_module_eeprom_parse’ [-Wimplicit-function-declaration]
1914 | ret = rte_eth_module_eeprom_parse(module_info.type,
| ^~~~~~~~~~~~~~~~~~~~~~~~~~~
../app/proc-info/main.c:1914:31: error: nested extern declaration of ‘rte_eth_module_eeprom_parse’ [-Werror=nested-externs]
cc1: all warnings being treated as errors
[2229/2749] Compiling C object drivers/librte_power_intel_uncore.a.p/meson-generated_.._rte_power_intel_uncore.pmd.c.o
[2230/2749] Linking target drivers/librte_power_intel_pstate.so.27.0
[2231/2749] Compiling C object app/dpdk-graph.p/graph_cli.c.o
[2232/2749] Compiling C object app/dpdk-graph.p/graph_conn.c.o
[2233/2749] Compiling C object drivers/libtmp_rte_baseband_turbo_sw.a.p/baseband_turbo_sw_bbdev_turbo_software.c.o
[2234/2749] Compiling C object app/dpdk-graph.p/graph_ethdev_rx.c.o
[2235/2749] Compiling C object app/dpdk-graph.p/graph_feature.c.o
[2236/2749] Compiling C object app/dpdk-graph.p/graph_ethdev.c.o
[2237/2749] Compiling C object drivers/libtmp_rte_baseband_acc.a.p/baseband_acc_rte_vrb_pmd.c.o
ninja: build stopped
*Build Failed #14:
OS: RHEL10.2-64
Target: x86_64-native-linuxapp-gcc
FAILED: app/dpdk-proc-info.p/proc-info_main.c.o
gcc -Iapp/dpdk-proc-info.p -Iapp -I../app -Ilib/ethdev -I../lib/ethdev -Ilib/eal/common -I../lib/eal/common -I. -I.. -Iconfig -I../config -Ilib/eal/include -I../lib/eal/include -Ilib/eal/linux/include -I../lib/eal/linux/include -Ilib/eal/x86/include -I../lib/eal/x86/include -I../kernel/linux -Ilib/eal -I../lib/eal -Ilib/kvargs -I../lib/kvargs -Ilib/log -I../lib/log -Ilib/metrics -I../lib/metrics -Ilib/telemetry -I../lib/telemetry -Ilib/argparse -I../lib/argparse -Ilib/net -I../lib/net -Ilib/mbuf -I../lib/mbuf -Ilib/mempool -I../lib/mempool -Ilib/ring -I../lib/ring -Ilib/meter -I../lib/meter -Ilib/security -I../lib/security -Ilib/cryptodev -I../lib/cryptodev -Ilib/rcu -I../lib/rcu -Ilib/eventdev -I../lib/eventdev -Ilib/hash -I../lib/hash -Ilib/timer -I../lib/timer -Ilib/dmadev -I../lib/dmadev -fdiagnostics-color=always -D_FILE_OFFSET_BITS=64 -Wall -Winvalid-pch -Wextra -Werror -std=c11 -O3 -include rte_config.h -Wvla -Wcast-qual -Wdeprecated -Wformat -Wformat-nonliteral -Wformat-security -Wmissing-declarations -Wmissing-prototypes -Wnested-externs -Wold-style-definition -Wpointer-arith -Wshadow -Wsign-compare -Wstrict-prototypes -Wundef -Wwrite-strings -Wno-packed-not-aligned -Wno-missing-field-initializers -D_GNU_SOURCE -march=native -mrtm -DALLOW_EXPERIMENTAL_API -Wno-vla -MD -MQ app/dpdk-proc-info.p/proc-info_main.c.o -MF app/dpdk-proc-info.p/proc-info_main.c.o.d -o app/dpdk-proc-info.p/proc-info_main.c.o -c ../app/proc-info/main.c
../app/proc-info/main.c: In function ‘show_module_eeprom_info’:
../app/proc-info/main.c:1914:31: error: implicit declaration of function ‘rte_eth_module_eeprom_parse’ [-Wimplicit-function-declaration]
1914 | ret = rte_eth_module_eeprom_parse(module_info.type,
| ^~~~~~~~~~~~~~~~~~~~~~~~~~~
../app/proc-info/main.c:1914:31: error: nested extern declaration of ‘rte_eth_module_eeprom_parse’ [-Werror=nested-externs]
cc1: all warnings being treated as errors
[3174/3655] Compiling C object app/dpdk-test-bbdev.p/test-bbdev_test_bbdev.c.o
[3175/3655] Compiling C object app/dpdk-test-crypto-perf.p/test-crypto-perf_main.c.o
[3176/3655] Compiling C object app/dpdk-test-crypto-perf.p/test-crypto-perf_cperf_options_parsing.c.o
[3177/3655] Compiling C object app/dpdk-test-compress-perf.p/test-compress-perf_comp_perf_test_common.c.o
[3178/3655] Linking target app/dpdk-graph
[3179/3655] Compiling C object app/dpdk-pdump.p/pdump_main.c.o
[3180/3655] Linking target app/dpdk-test-acl
[3181/3655] Compiling C object app/dpdk-test-compress-perf.p/test-compress-perf_comp_perf_test_cyclecount.c.o
[3182/3655] Compiling C object app/dpdk-test-bbdev.p/test-bbdev_test_bbdev_perf.c.o
ninja: build stopped
*Build Failed #15:
OS: UB2604-64
Target: x86_64-native-linuxapp-gcc+16byte
FAILED: app/dpdk-proc-info.p/proc-info_main.c.o
gcc -Iapp/dpdk-proc-info.p -Iapp -I../app -Ilib/ethdev -I../lib/ethdev -Ilib/eal/common -I../lib/eal/common -I. -I.. -Iconfig -I../config -Ilib/eal/include -I../lib/eal/include -Ilib/eal/linux/include -I../lib/eal/linux/include -Ilib/eal/x86/include -I../lib/eal/x86/include -I../kernel/linux -Ilib/eal -I../lib/eal -Ilib/kvargs -I../lib/kvargs -Ilib/log -I../lib/log -Ilib/metrics -I../lib/metrics -Ilib/telemetry -I../lib/telemetry -Ilib/argparse -I../lib/argparse -Ilib/net -I../lib/net -Ilib/mbuf -I../lib/mbuf -Ilib/mempool -I../lib/mempool -Ilib/ring -I../lib/ring -Ilib/meter -I../lib/meter -Ilib/security -I../lib/security -Ilib/cryptodev -I../lib/cryptodev -Ilib/rcu -I../lib/rcu -Ilib/eventdev -I../lib/eventdev -Ilib/hash -I../lib/hash -Ilib/timer -I../lib/timer -Ilib/dmadev -I../lib/dmadev -fdiagnostics-color=always -D_FILE_OFFSET_BITS=64 -Wall -Winvalid-pch -Wextra -Werror -std=c11 -O3 -include rte_config.h -Wvla -Wcast-qual -Wdeprecated -Wformat -Wformat-nonliteral -Wformat-security -Wmissing-declarations -Wmissing-prototypes -Wnested-externs -Wold-style-definition -Wpointer-arith -Wshadow -Wsign-compare -Wstrict-prototypes -Wundef -Wwrite-strings -Wno-packed-not-aligned -Wno-missing-field-initializers -fzero-init-padding-bits=all -D_GNU_SOURCE -DRTE_LIBRTE_I40E_16BYTE_RX_DESC -DRTE_LIBRTE_ICE_16BYTE_RX_DESC -march=native -mrtm -DALLOW_EXPERIMENTAL_API -Wno-vla -MD -MQ app/dpdk-proc-info.p/proc-info_main.c.o -MF app/dpdk-proc-info.p/proc-info_main.c.o.d -o app/dpdk-proc-info.p/proc-info_main.c.o -c ../app/proc-info/main.c
../app/proc-info/main.c: In function ‘show_module_eeprom_info’:
../app/proc-info/main.c:1914:31: error: implicit declaration of function ‘rte_eth_module_eeprom_parse’ [-Wimplicit-function-declaration]
1914 | ret = rte_eth_module_eeprom_parse(module_info.type,
| ^~~~~~~~~~~~~~~~~~~~~~~~~~~
../app/proc-info/main.c:1914:31: error: nested extern declaration of ‘rte_eth_module_eeprom_parse’ [-Werror=nested-externs]
cc1: all warnings being treated as errors
[3420/3896] Compiling C object app/dpdk-test-bbdev.p/test-bbdev_main.c.o
[3421/3896] Linking target app/dpdk-pdump
[3422/3896] Compiling C object app/dpdk-test-acl.p/test-acl_main.c.o
[3423/3896] Compiling C object app/dpdk-test-compress-perf.p/test-compress-perf_comp_perf_test_throughput.c.o
[3424/3896] Compiling C object app/dpdk-test-compress-perf.p/test-compress-perf_comp_perf_test_common.c.o
[3425/3896] Linking target app/dpdk-graph
[3426/3896] Compiling C object app/dpdk-test-compress-perf.p/test-compress-perf_comp_perf_test_cyclecount.c.o
[3427/3896] Compiling C object app/dpdk-test-bbdev.p/test-bbdev_test_bbdev.c.o
[3428/3896] Compiling C object app/dpdk-test-bbdev.p/test-bbdev_test_bbdev_perf.c.o
ninja: build stopped
*Build Failed #16:
OS: UB2604-64
Target: x86_64-native-linuxapp-gcc
FAILED: app/dpdk-proc-info.p/proc-info_main.c.o
gcc -Iapp/dpdk-proc-info.p -Iapp -I../app -Ilib/ethdev -I../lib/ethdev -Ilib/eal/common -I../lib/eal/common -I. -I.. -Iconfig -I../config -Ilib/eal/include -I../lib/eal/include -Ilib/eal/linux/include -I../lib/eal/linux/include -Ilib/eal/x86/include -I../lib/eal/x86/include -I../kernel/linux -Ilib/eal -I../lib/eal -Ilib/kvargs -I../lib/kvargs -Ilib/log -I../lib/log -Ilib/metrics -I../lib/metrics -Ilib/telemetry -I../lib/telemetry -Ilib/argparse -I../lib/argparse -Ilib/net -I../lib/net -Ilib/mbuf -I../lib/mbuf -Ilib/mempool -I../lib/mempool -Ilib/ring -I../lib/ring -Ilib/meter -I../lib/meter -Ilib/security -I../lib/security -Ilib/cryptodev -I../lib/cryptodev -Ilib/rcu -I../lib/rcu -Ilib/eventdev -I../lib/eventdev -Ilib/hash -I../lib/hash -Ilib/timer -I../lib/timer -Ilib/dmadev -I../lib/dmadev -fdiagnostics-color=always -D_FILE_OFFSET_BITS=64 -Wall -Winvalid-pch -Wextra -Werror -std=c11 -O3 -include rte_config.h -Wvla -Wcast-qual -Wdeprecated -Wformat -Wformat-nonliteral -Wformat-security -Wmissing-declarations -Wmissing-prototypes -Wnested-externs -Wold-style-definition -Wpointer-arith -Wshadow -Wsign-compare -Wstrict-prototypes -Wundef -Wwrite-strings -Wno-packed-not-aligned -Wno-missing-field-initializers -fzero-init-padding-bits=all -D_GNU_SOURCE -march=native -mrtm -DALLOW_EXPERIMENTAL_API -Wno-vla -MD -MQ app/dpdk-proc-info.p/proc-info_main.c.o -MF app/dpdk-proc-info.p/proc-info_main.c.o.d -o app/dpdk-proc-info.p/proc-info_main.c.o -c ../app/proc-info/main.c
../app/proc-info/main.c: In function ‘show_module_eeprom_info’:
../app/proc-info/main.c:1914:31: error: implicit declaration of function ‘rte_eth_module_eeprom_parse’ [-Wimplicit-function-declaration]
1914 | ret = rte_eth_module_eeprom_parse(module_info.type,
| ^~~~~~~~~~~~~~~~~~~~~~~~~~~
../app/proc-info/main.c:1914:31: error: nested extern declaration of ‘rte_eth_module_eeprom_parse’ [-Werror=nested-externs]
cc1: all warnings being treated as errors
[3417/3896] Linking target app/dpdk-dumpcap
[3418/3896] Linking target examples/dpdk-link_status_interrupt
[3419/3896] Compiling C object app/dpdk-test-compress-perf.p/test-compress-perf_main.c.o
[3420/3896] Compiling C object app/dpdk-test-bbdev.p/test-bbdev_test_bbdev_vector.c.o
[3421/3896] Compiling C object app/dpdk-test-bbdev.p/test-bbdev_test_bbdev.c.o
[3422/3896] Compiling C object app/dpdk-test-compress-perf.p/test-compress-perf_comp_perf_options_parse.c.o
[3423/3896] Compiling C object app/dpdk-pdump.p/pdump_main.c.o
[3424/3896] Linking target app/dpdk-graph
[3425/3896] Compiling C object app/dpdk-test-bbdev.p/test-bbdev_test_bbdev_perf.c.o
ninja: build stopped
*Build Failed #17:
OS: UB2604-64
Target: x86_64-native-linuxapp-clang
FAILED: app/dpdk-proc-info.p/proc-info_main.c.o
clang -Iapp/dpdk-proc-info.p -Iapp -I../app -Ilib/ethdev -I../lib/ethdev -Ilib/eal/common -I../lib/eal/common -I. -I.. -Iconfig -I../config -Ilib/eal/include -I../lib/eal/include -Ilib/eal/linux/include -I../lib/eal/linux/include -Ilib/eal/x86/include -I../lib/eal/x86/include -I../kernel/linux -Ilib/eal -I../lib/eal -Ilib/kvargs -I../lib/kvargs -Ilib/log -I../lib/log -Ilib/metrics -I../lib/metrics -Ilib/telemetry -I../lib/telemetry -Ilib/argparse -I../lib/argparse -Ilib/net -I../lib/net -Ilib/mbuf -I../lib/mbuf -Ilib/mempool -I../lib/mempool -Ilib/ring -I../lib/ring -Ilib/meter -I../lib/meter -Ilib/security -I../lib/security -Ilib/cryptodev -I../lib/cryptodev -Ilib/rcu -I../lib/rcu -Ilib/eventdev -I../lib/eventdev -Ilib/hash -I../lib/hash -Ilib/timer -I../lib/timer -Ilib/dmadev -I../lib/dmadev -fdiagnostics-color=always -D_FILE_OFFSET_BITS=64 -Wall -Winvalid-pch -Wextra -Werror -std=c11 -O3 -include rte_config.h -Wvla -Wcast-qual -Wcomma -Wdeprecated -Wformat -Wformat-nonliteral -Wformat-security -Wmissing-declarations -Wmissing-prototypes -Wnested-externs -Wold-style-definition -Wpointer-arith -Wshadow -Wsign-compare -Wstrict-prototypes -Wundef -Wwrite-strings -Wno-missing-field-initializers -D_GNU_SOURCE -march=native -mrtm -DALLOW_EXPERIMENTAL_API -Wno-vla -MD -MQ app/dpdk-proc-info.p/proc-info_main.c.o -MF app/dpdk-proc-info.p/proc-info_main.c.o.d -o app/dpdk-proc-info.p/proc-info_main.c.o -c ../app/proc-info/main.c
../app/proc-info/main.c:1914:10: error: call to undeclared function 'rte_eth_module_eeprom_parse'; ISO C99 and later do not support implicit function declarations [-Wimplicit-function-declaration]
1914 | ret = rte_eth_module_eeprom_parse(module_info.type,
| ^
1 error generated.
[3421/3897] Compiling C object app/dpdk-test-bbdev.p/test-bbdev_main.c.o
[3422/3897] Compiling C object app/dpdk-test-bbdev.p/test-bbdev_test_bbdev_vector.c.o
[3423/3897] Compiling C object app/dpdk-test-compress-perf.p/test-compress-perf_main.c.o
[3424/3897] Linking target app/dpdk-pdump
[3425/3897] Compiling C object app/dpdk-test-compress-perf.p/test-compress-perf_comp_perf_options_parse.c.o
[3426/3897] Compiling C object app/dpdk-test-bbdev.p/test-bbdev_test_bbdev.c.o
[3427/3897] Compiling C object app/dpdk-test-compress-perf.p/test-compress-perf_comp_perf_test_cyclecount.c.o
[3428/3897] Linking target app/dpdk-graph
[3429/3897] Compiling C object app/dpdk-test-bbdev.p/test-bbdev_test_bbdev_perf.c.o
ninja: build stopped
*Build Failed #18:
OS: UB2604-64
Target: x86_64-native-linuxapp-doc
FAILED: app/dpdk-proc-info.p/proc-info_main.c.o
gcc -Iapp/dpdk-proc-info.p -Iapp -I../app -Ilib/ethdev -I../lib/ethdev -Ilib/eal/common -I../lib/eal/common -I. -I.. -Iconfig -I../config -Ilib/eal/include -I../lib/eal/include -Ilib/eal/linux/include -I../lib/eal/linux/include -Ilib/eal/x86/include -I../lib/eal/x86/include -I../kernel/linux -Ilib/eal -I../lib/eal -Ilib/kvargs -I../lib/kvargs -Ilib/log -I../lib/log -Ilib/metrics -I../lib/metrics -Ilib/telemetry -I../lib/telemetry -Ilib/argparse -I../lib/argparse -Ilib/net -I../lib/net -Ilib/mbuf -I../lib/mbuf -Ilib/mempool -I../lib/mempool -Ilib/ring -I../lib/ring -Ilib/meter -I../lib/meter -Ilib/security -I../lib/security -Ilib/cryptodev -I../lib/cryptodev -Ilib/rcu -I../lib/rcu -Ilib/eventdev -I../lib/eventdev -Ilib/hash -I../lib/hash -Ilib/timer -I../lib/timer -Ilib/dmadev -I../lib/dmadev -fdiagnostics-color=always -D_FILE_OFFSET_BITS=64 -Wall -Winvalid-pch -Wextra -Werror -std=c11 -O3 -include rte_config.h -Wvla -Wcast-qual -Wdeprecated -Wformat -Wformat-nonliteral -Wformat-security -Wmissing-declarations -Wmissing-prototypes -Wnested-externs -Wold-style-definition -Wpointer-arith -Wshadow -Wsign-compare -Wstrict-prototypes -Wundef -Wwrite-strings -Wno-packed-not-aligned -Wno-missing-field-initializers -fzero-init-padding-bits=all -D_GNU_SOURCE -march=native -mrtm -DALLOW_EXPERIMENTAL_API -Wno-vla -MD -MQ app/dpdk-proc-info.p/proc-info_main.c.o -MF app/dpdk-proc-info.p/proc-info_main.c.o.d -o app/dpdk-proc-info.p/proc-info_main.c.o -c ../app/proc-info/main.c
../app/proc-info/main.c: In function ‘show_module_eeprom_info’:
../app/proc-info/main.c:1914:31: error: implicit declaration of function ‘rte_eth_module_eeprom_parse’ [-Wimplicit-function-declaration]
1914 | ret = rte_eth_module_eeprom_parse(module_info.type,
| ^~~~~~~~~~~~~~~~~~~~~~~~~~~
../app/proc-info/main.c:1914:31: error: nested extern declaration of ‘rte_eth_module_eeprom_parse’ [-Werror=nested-externs]
cc1: all warnings being treated as errors
[3407/3719] Compiling C object app/dpdk-test-cmdline.p/test-cmdline_cmdline_test.c.o
[3408/3719] Linking target app/dpdk-dumpcap
[3409/3719] Compiling C object app/dpdk-test-compress-perf.p/test-compress-perf_main.c.o
[3410/3719] Linking target app/dpdk-pdump
[3411/3719] Compiling C object app/dpdk-test-compress-perf.p/test-compress-perf_comp_perf_options_parse.c.o
[3412/3719] Compiling C object app/dpdk-test-bbdev.p/test-bbdev_test_bbdev_vector.c.o
[3413/3719] Compiling C object app/dpdk-test-bbdev.p/test-bbdev_test_bbdev.c.o
[3414/3719] Linking target app/dpdk-graph
[3415/3719] Compiling C object app/dpdk-test-bbdev.p/test-bbdev_test_bbdev_perf.c.o
ninja: build stopped
*Build Failed #19:
OS: RHEL10.2-64RT
Target: x86_64-native-linuxapp-gcc
FAILED: app/dpdk-proc-info.p/proc-info_main.c.o
gcc -Iapp/dpdk-proc-info.p -Iapp -I../app -Ilib/ethdev -I../lib/ethdev -Ilib/eal/common -I../lib/eal/common -I. -I.. -Iconfig -I../config -Ilib/eal/include -I../lib/eal/include -Ilib/eal/linux/include -I../lib/eal/linux/include -Ilib/eal/x86/include -I../lib/eal/x86/include -I../kernel/linux -Ilib/eal -I../lib/eal -Ilib/kvargs -I../lib/kvargs -Ilib/log -I../lib/log -Ilib/metrics -I../lib/metrics -Ilib/telemetry -I../lib/telemetry -Ilib/argparse -I../lib/argparse -Ilib/net -I../lib/net -Ilib/mbuf -I../lib/mbuf -Ilib/mempool -I../lib/mempool -Ilib/ring -I../lib/ring -Ilib/meter -I../lib/meter -Ilib/security -I../lib/security -Ilib/cryptodev -I../lib/cryptodev -Ilib/rcu -I../lib/rcu -Ilib/eventdev -I../lib/eventdev -Ilib/hash -I../lib/hash -Ilib/timer -I../lib/timer -Ilib/dmadev -I../lib/dmadev -fdiagnostics-color=always -D_FILE_OFFSET_BITS=64 -Wall -Winvalid-pch -Wextra -Werror -std=c11 -O3 -include rte_config.h -Wvla -Wcast-qual -Wdeprecated -Wformat -Wformat-nonliteral -Wformat-security -Wmissing-declarations -Wmissing-prototypes -Wnested-externs -Wold-style-definition -Wpointer-arith -Wshadow -Wsign-compare -Wstrict-prototypes -Wundef -Wwrite-strings -Wno-packed-not-aligned -Wno-missing-field-initializers -D_GNU_SOURCE -march=native -mrtm -DALLOW_EXPERIMENTAL_API -Wno-vla -MD -MQ app/dpdk-proc-info.p/proc-info_main.c.o -MF app/dpdk-proc-info.p/proc-info_main.c.o.d -o app/dpdk-proc-info.p/proc-info_main.c.o -c ../app/proc-info/main.c
../app/proc-info/main.c: In function ‘show_module_eeprom_info’:
../app/proc-info/main.c:1914:31: error: implicit declaration of function ‘rte_eth_module_eeprom_parse’ [-Wimplicit-function-declaration]
1914 | ret = rte_eth_module_eeprom_parse(module_info.type,
| ^~~~~~~~~~~~~~~~~~~~~~~~~~~
../app/proc-info/main.c:1914:31: error: nested extern declaration of ‘rte_eth_module_eeprom_parse’ [-Werror=nested-externs]
cc1: all warnings being treated as errors
[3174/3655] Compiling C object app/dpdk-test-acl.p/test-acl_main.c.o
[3175/3655] Compiling C object app/dpdk-test-compress-perf.p/test-compress-perf_main.c.o
[3176/3655] Compiling C object app/dpdk-test-compress-perf.p/test-compress-perf_comp_perf_test_throughput.c.o
[3177/3655] Compiling C object app/dpdk-test-compress-perf.p/test-compress-perf_comp_perf_test_verify.c.o
[3178/3655] Compiling C object app/dpdk-test-bbdev.p/test-bbdev_test_bbdev.c.o
[3179/3655] Compiling C object app/dpdk-pdump.p/pdump_main.c.o
[3180/3655] Linking target app/dpdk-graph
[3181/3655] Compiling C object app/dpdk-test-compress-perf.p/test-compress-perf_comp_perf_test_cyclecount.c.o
[3182/3655] Compiling C object app/dpdk-test-bbdev.p/test-bbdev_test_bbdev_perf.c.o
ninja: build stopped
*Build Failed #20:
OS: UB2404-64
Target: x86_64-native-linuxapp-gcc
FAILED: app/dpdk-proc-info.p/proc-info_main.c.o
gcc -Iapp/dpdk-proc-info.p -Iapp -I../app -Ilib/ethdev -I../lib/ethdev -Ilib/eal/common -I../lib/eal/common -I. -I.. -Iconfig -I../config -Ilib/eal/include -I../lib/eal/include -Ilib/eal/linux/include -I../lib/eal/linux/include -Ilib/eal/x86/include -I../lib/eal/x86/include -I../kernel/linux -Ilib/eal -I../lib/eal -Ilib/kvargs -I../lib/kvargs -Ilib/log -I../lib/log -Ilib/metrics -I../lib/metrics -Ilib/telemetry -I../lib/telemetry -Ilib/argparse -I../lib/argparse -Ilib/net -I../lib/net -Ilib/mbuf -I../lib/mbuf -Ilib/mempool -I../lib/mempool -Ilib/ring -I../lib/ring -Ilib/meter -I../lib/meter -Ilib/security -I../lib/security -Ilib/cryptodev -I../lib/cryptodev -Ilib/rcu -I../lib/rcu -Ilib/eventdev -I../lib/eventdev -Ilib/hash -I../lib/hash -Ilib/timer -I../lib/timer -Ilib/dmadev -I../lib/dmadev -fdiagnostics-color=always -D_FILE_OFFSET_BITS=64 -Wall -Winvalid-pch -Wextra -Werror -std=c11 -O3 -include rte_config.h -Wvla -Wcast-qual -Wdeprecated -Wformat -Wformat-nonliteral -Wformat-security -Wmissing-declarations -Wmissing-prototypes -Wnested-externs -Wold-style-definition -Wpointer-arith -Wshadow -Wsign-compare -Wstrict-prototypes -Wundef -Wwrite-strings -Wno-packed-not-aligned -Wno-missing-field-initializers -D_GNU_SOURCE -march=native -mrtm -DALLOW_EXPERIMENTAL_API -Wno-vla -MD -MQ app/dpdk-proc-info.p/proc-info_main.c.o -MF app/dpdk-proc-info.p/proc-info_main.c.o.d -o app/dpdk-proc-info.p/proc-info_main.c.o -c ../app/proc-info/main.c
../app/proc-info/main.c: In function ‘show_module_eeprom_info’:
../app/proc-info/main.c:1914:31: error: implicit declaration of function ‘rte_eth_module_eeprom_parse’ [-Werror=implicit-function-declaration]
1914 | ret = rte_eth_module_eeprom_parse(module_info.type,
| ^~~~~~~~~~~~~~~~~~~~~~~~~~~
../app/proc-info/main.c:1914:31: error: nested extern declaration of ‘rte_eth_module_eeprom_parse’ [-Werror=nested-externs]
cc1: all warnings being treated as errors
[3420/3896] Linking target drivers/librte_baseband_acc.so.27.0
[3421/3896] Compiling C object app/dpdk-test-crypto-perf.p/test-crypto-perf_cperf_test_verify.c.o
[3422/3896] Compiling C object app/dpdk-pdump.p/pdump_main.c.o
[3423/3896] Linking target examples/dpdk-l2fwd-crypto
[3424/3896] Linking target examples/dpdk-ipv4_multicast
[3425/3896] Linking target app/dpdk-dumpcap
[3426/3896] Linking target app/dpdk-test-cmdline
[3427/3896] Linking target app/dpdk-graph
[3428/3896] Compiling C object app/dpdk-test-bbdev.p/test-bbdev_test_bbdev_perf.c.o
ninja: build stopped
*Build Failed #21:
OS: Fedora44-64
Target: x86_64-native-linuxapp-gcc
FAILED: app/dpdk-proc-info.p/proc-info_main.c.o
gcc -Iapp/dpdk-proc-info.p -Iapp -I../app -Ilib/ethdev -I../lib/ethdev -Ilib/eal/common -I../lib/eal/common -I. -I.. -Iconfig -I../config -Ilib/eal/include -I../lib/eal/include -Ilib/eal/linux/include -I../lib/eal/linux/include -Ilib/eal/x86/include -I../lib/eal/x86/include -I../kernel/linux -Ilib/eal -I../lib/eal -Ilib/kvargs -I../lib/kvargs -Ilib/log -I../lib/log -Ilib/metrics -I../lib/metrics -Ilib/telemetry -I../lib/telemetry -Ilib/argparse -I../lib/argparse -Ilib/net -I../lib/net -Ilib/mbuf -I../lib/mbuf -Ilib/mempool -I../lib/mempool -Ilib/ring -I../lib/ring -Ilib/meter -I../lib/meter -Ilib/security -I../lib/security -Ilib/cryptodev -I../lib/cryptodev -Ilib/rcu -I../lib/rcu -Ilib/eventdev -I../lib/eventdev -Ilib/hash -I../lib/hash -Ilib/timer -I../lib/timer -Ilib/dmadev -I../lib/dmadev -fdiagnostics-color=always -D_FILE_OFFSET_BITS=64 -Wall -Winvalid-pch -Wextra -Werror -std=c11 -O3 -include rte_config.h -Wvla -Wcast-qual -Wdeprecated -Wformat -Wformat-nonliteral -Wformat-security -Wmissing-declarations -Wmissing-prototypes -Wnested-externs -Wold-style-definition -Wpointer-arith -Wshadow -Wsign-compare -Wstrict-prototypes -Wundef -Wwrite-strings -Wno-packed-not-aligned -Wno-missing-field-initializers -fzero-init-padding-bits=all -D_GNU_SOURCE -march=native -mrtm -DALLOW_EXPERIMENTAL_API -Wno-vla -MD -MQ app/dpdk-proc-info.p/proc-info_main.c.o -MF app/dpdk-proc-info.p/proc-info_main.c.o.d -o app/dpdk-proc-info.p/proc-info_main.c.o -c ../app/proc-info/main.c
../app/proc-info/main.c: In function ‘show_module_eeprom_info’:
../app/proc-info/main.c:1914:31: error: implicit declaration of function ‘rte_eth_module_eeprom_parse’ [-Wimplicit-function-declaration]
1914 | ret = rte_eth_module_eeprom_parse(module_info.type,
| ^~~~~~~~~~~~~~~~~~~~~~~~~~~
../app/proc-info/main.c:1914:31: error: nested extern declaration of ‘rte_eth_module_eeprom_parse’ [-Werror=nested-externs]
cc1: all warnings being treated as errors
[3175/3655] Compiling C object app/dpdk-test-compress-perf.p/test-compress-perf_main.c.o
[3176/3655] Compiling C object app/dpdk-test-acl.p/test-acl_main.c.o
[3177/3655] Compiling C object app/dpdk-test-compress-perf.p/test-compress-perf_comp_perf_options_parse.c.o
[3178/3655] Linking target app/dpdk-pdump
[3179/3655] Compiling C object app/dpdk-test-compress-perf.p/test-compress-perf_comp_perf_test_common.c.o
[3180/3655] Linking target app/dpdk-graph
[3181/3655] Compiling C object app/dpdk-test-compress-perf.p/test-compress-perf_comp_perf_test_cyclecount.c.o
[3182/3655] Compiling C object app/dpdk-test-bbdev.p/test-bbdev_test_bbdev_vector.c.o
[3183/3655] Compiling C object app/dpdk-test-bbdev.p/test-bbdev_test_bbdev_perf.c.o
ninja: build stopped
*Build Failed #22:
OS: Fedora44-64
Target: x86_64-native-linuxapp-clang
FAILED: app/dpdk-proc-info.p/proc-info_main.c.o
clang -Iapp/dpdk-proc-info.p -Iapp -I../app -Ilib/ethdev -I../lib/ethdev -Ilib/eal/common -I../lib/eal/common -I. -I.. -Iconfig -I../config -Ilib/eal/include -I../lib/eal/include -Ilib/eal/linux/include -I../lib/eal/linux/include -Ilib/eal/x86/include -I../lib/eal/x86/include -I../kernel/linux -Ilib/eal -I../lib/eal -Ilib/kvargs -I../lib/kvargs -Ilib/log -I../lib/log -Ilib/metrics -I../lib/metrics -Ilib/telemetry -I../lib/telemetry -Ilib/argparse -I../lib/argparse -Ilib/net -I../lib/net -Ilib/mbuf -I../lib/mbuf -Ilib/mempool -I../lib/mempool -Ilib/ring -I../lib/ring -Ilib/meter -I../lib/meter -Ilib/security -I../lib/security -Ilib/cryptodev -I../lib/cryptodev -Ilib/rcu -I../lib/rcu -Ilib/eventdev -I../lib/eventdev -Ilib/hash -I../lib/hash -Ilib/timer -I../lib/timer -Ilib/dmadev -I../lib/dmadev -fdiagnostics-color=always -D_FILE_OFFSET_BITS=64 -Wall -Winvalid-pch -Wextra -Werror -std=c11 -O3 -include rte_config.h -Wvla -Wcast-qual -Wcomma -Wdeprecated -Wformat -Wformat-nonliteral -Wformat-security -Wmissing-declarations -Wmissing-prototypes -Wnested-externs -Wold-style-definition -Wpointer-arith -Wshadow -Wsign-compare -Wstrict-prototypes -Wundef -Wwrite-strings -Wno-missing-field-initializers -D_GNU_SOURCE -march=native -mrtm -DALLOW_EXPERIMENTAL_API -Wno-vla -MD -MQ app/dpdk-proc-info.p/proc-info_main.c.o -MF app/dpdk-proc-info.p/proc-info_main.c.o.d -o app/dpdk-proc-info.p/proc-info_main.c.o -c ../app/proc-info/main.c
../app/proc-info/main.c:1914:10: error: call to undeclared function 'rte_eth_module_eeprom_parse'; ISO C99 and later do not support implicit function declarations [-Wimplicit-function-declaration]
1914 | ret = rte_eth_module_eeprom_parse(module_info.type,
| ^
1 error generated.
[3176/3655] Compiling C object app/dpdk-test-bbdev.p/test-bbdev_main.c.o
[3177/3655] Compiling C object app/dpdk-test-compress-perf.p/test-compress-perf_main.c.o
[3178/3655] Compiling C object app/dpdk-test-acl.p/test-acl_main.c.o
[3179/3655] Compiling C object app/dpdk-test-bbdev.p/test-bbdev_test_bbdev.c.o
[3180/3655] Linking target app/dpdk-pdump
[3181/3655] Compiling C object app/dpdk-test-bbdev.p/test-bbdev_test_bbdev_vector.c.o
[3182/3655] Linking target app/dpdk-graph
[3183/3655] Linking target app/dpdk-test-cmdline
[3184/3655] Compiling C object app/dpdk-test-bbdev.p/test-bbdev_test_bbdev_perf.c.o
ninja: build stopped
*Build Failed #23:
OS: OpenEuler2404-64
Target: x86_64-native-linuxapp-gcc
FAILED: app/dpdk-proc-info.p/proc-info_main.c.o
gcc -Iapp/dpdk-proc-info.p -Iapp -I../app -Ilib/ethdev -I../lib/ethdev -Ilib/eal/common -I../lib/eal/common -I. -I.. -Iconfig -I../config -Ilib/eal/include -I../lib/eal/include -Ilib/eal/linux/include -I../lib/eal/linux/include -Ilib/eal/x86/include -I../lib/eal/x86/include -I../kernel/linux -Ilib/eal -I../lib/eal -Ilib/kvargs -I../lib/kvargs -Ilib/log -I../lib/log -Ilib/metrics -I../lib/metrics -Ilib/telemetry -I../lib/telemetry -Ilib/argparse -I../lib/argparse -Ilib/net -I../lib/net -Ilib/mbuf -I../lib/mbuf -Ilib/mempool -I../lib/mempool -Ilib/ring -I../lib/ring -Ilib/meter -I../lib/meter -Ilib/security -I../lib/security -Ilib/cryptodev -I../lib/cryptodev -Ilib/rcu -I../lib/rcu -Ilib/eventdev -I../lib/eventdev -Ilib/hash -I../lib/hash -Ilib/timer -I../lib/timer -Ilib/dmadev -I../lib/dmadev -fdiagnostics-color=always -D_FILE_OFFSET_BITS=64 -Wall -Winvalid-pch -Wextra -Werror -std=c11 -O3 -include rte_config.h -Wvla -Wcast-qual -Wdeprecated -Wformat -Wformat-nonliteral -Wformat-security -Wmissing-declarations -Wmissing-prototypes -Wnested-externs -Wold-style-definition -Wpointer-arith -Wshadow -Wsign-compare -Wstrict-prototypes -Wundef -Wwrite-strings -Wno-packed-not-aligned -Wno-missing-field-initializers -D_GNU_SOURCE -march=native -mrtm -DALLOW_EXPERIMENTAL_API -Wno-vla -MD -MQ app/dpdk-proc-info.p/proc-info_main.c.o -MF app/dpdk-proc-info.p/proc-info_main.c.o.d -o app/dpdk-proc-info.p/proc-info_main.c.o -c ../app/proc-info/main.c
../app/proc-info/main.c: In function ‘show_module_eeprom_info’:
../app/proc-info/main.c:1914:31: error: implicit declaration of function ‘rte_eth_module_eeprom_parse’ [-Werror=implicit-function-declaration]
1914 | ret = rte_eth_module_eeprom_parse(module_info.type,
| ^~~~~~~~~~~~~~~~~~~~~~~~~~~
../app/proc-info/main.c:1914:31: error: nested extern declaration of ‘rte_eth_module_eeprom_parse’ [-Werror=nested-externs]
cc1: all warnings being treated as errors
[3153/3655] Compiling C object app/dpdk-graph.p/graph_ethdev.c.o
[3154/3655] Compiling C object drivers/libtmp_rte_crypto_cnxk.a.p/crypto_cnxk_cn10k_cryptodev_ops.c.o
[3155/3655] Compiling C object app/dpdk-graph.p/graph_ip4_route.c.o
[3156/3655] Compiling C object app/dpdk-graph.p/graph_graph.c.o
[3157/3655] Compiling C object app/dpdk-graph.p/graph_feature.c.o
[3158/3655] Compiling C object app/dpdk-graph.p/graph_ip6_route.c.o
[3159/3655] Compiling C object app/dpdk-graph.p/graph_l2fwd.c.o
[3160/3655] Compiling C object app/dpdk-graph.p/graph_ip4_output_hook.c.o
[3161/3655] Compiling C object app/dpdk-test-bbdev.p/test-bbdev_test_bbdev_perf.c.o
ninja: build stopped
DPDK STV team
More information about the test-report
mailing list