compilation|FAILURE| pw(171012) sid(39578) job(PER_PATCH_BUILD20525)[v1, 17/17] net/hinic3: add mbox count telemetry support

sys_stv at intel.com sys_stv at intel.com
Sat Oct 10 17:20:31 CEST 2026


Test-Label: Intel-compilation
Test-Status: FAILURE
http://dpdk.org/patch/171012

_Compilation issues_

Submitter: Jiacheng Ye <yejiacheng4 at h-partners.com>
Date: 2026-10-10 14:45:08
Reply_mail: <20261010144509.2731-18-yejiacheng4 at h-partners.com>

DPDK git baseline: Repo:dpdk-next-net, CommitID: 1d020e166fcecec245d3118f6cadbadf2d5d2169


Meson Build Summary: 23 Builds Done, 16 Successful, 7 Failures, 0 Blocked

+-------------------+------------+--------------+------------+------------+-----------+----------+------------+
| os                | gcc-static | clang-static | icc-static | gcc-shared | gcc-debug | document | gcc-16byte |
+-------------------+------------+--------------+------------+------------+-----------+----------+------------+
| OpenAnolis8.10-64 | pass       |              |            |            |           |          |            |
| FreeBSD15-64      | pass       | pass         |            | pass       | pass      |          |            |
| RHEL9.8-64        | pass       | pass         |            | pass       | pass      |          |            |
| SUSE16-64         | pass       | pass         |            |            |           |          |            |
| AzureLinux4.0-64  | fail       |              |            |            |           |          |            |
| UB2604-32         | pass       |              |            |            |           |          |            |
| RHEL10.2-64       | pass       |              |            |            |           |          |            |
| UB2604-64         | fail       | fail         |            |            |           | fail     | fail       |
| RHEL10.2-64RT     | pass       |              |            |            |           |          |            |
| UB2404-64         | pass       |              |            |            |           |          |            |
| Fedora44-64       | fail       | fail         |            |            |           |          |            |
| OpenEuler2404-64  | pass       |              |            |            |           |          |            |
+-------------------+------------+--------------+------------+------------+-----------+----------+------------+

Comments: 
Because of DPDK bug (https://bugs.dpdk.org/show_bug.cgi?id=928),
All the dpdk-next-* branch add `Ddisable_drivers=event/cnxk` option when build with ICC complier. 
 
Test environment and configuration as below:


OS: OpenAnolis8.10-64
	Kernel Version: 5.10.134-18.an8.x86_64
	GCC Version: gcc (GCC) 8.5.0 20210514 (Anolis 8.5.0-24.0.1)
	Clang Version: 18.1.8 (Red Hat 18.1.8-1.0.1.module+an8.9.0+11287+9d0292d3)
	x86_64-native-linuxapp-gcc

OS: FreeBSD15-64
	Kernel Version: 15.1-RELEASE-p3
	GCC Version: gcc (FreeBSD Ports Collection) 14.2.0
	Clang Version: 19.1.7 (https://github.com/llvm/llvm-project.git llvmorg-19.1.7-0-gcd708029e0b2)
	x86_64-native-bsdapp-gcc
	x86_64-native-bsdapp-clang
	x86_64-native-bsdapp-gcc+shared
	x86_64-native-bsdapp-gcc+debug

OS: RHEL9.8-64
	Kernel Version: 5.14.0-687.5.3.el9_8.x86_64
	GCC Version: gcc (GCC) 11.5.0 20240719 (Red Hat 11.5.0-14)
	Clang Version: 21.1.8 (Red Hat, Inc. 21.1.8-2.el9)
	x86_64-native-linuxapp-gcc
	x86_64-native-linuxapp-clang
	x86_64-native-linuxapp-gcc+shared
	x86_64-native-linuxapp-gcc+debug

OS: SUSE16-64
	Kernel Version: 6.12.0-160000.26-default
	GCC Version: gcc (SUSE Linux) 15.2.0
	Clang Version: 19.1.7
	x86_64-native-linuxapp-clang
	x86_64-native-linuxapp-gcc

OS: AzureLinux4.0-64
	Kernel Version: 6.18.31-1.3.azl4.x86_64
	GCC Version: gcc (GCC) 15.2.1 20260123 (Red Hat 15.2.1-7)
	Clang Version: 21.1.8 (Microsoft Corporation 21.1.8-8.azl4)
	x86_64-native-linuxapp-gcc

OS: UB2604-32
	Kernel Version: 7.0.0-31-generic
	GCC Version: gcc (Ubuntu 15.2.0-16ubuntu1) 15.2.0
	Clang Version: 21.1.8 (6ubuntu1)
	i686-native-linuxapp-gcc

OS: RHEL10.2-64
	Kernel Version: 6.12.0-211.7.3.el10_2.x86_64
	GCC Version: gcc (GCC) 14.3.1 20251022 (Red Hat 14.3.1-4)
	Clang Version: 21.1.8 (Red Hat, Inc. 21.1.8-1.el10)
	x86_64-native-linuxapp-gcc

OS: UB2604-64
	Kernel Version: 7.0.0-31-generic
	GCC Version: gcc (Ubuntu 15.2.0-16ubuntu1) 15.2.0
	Clang Version: 21.1.8 (6ubuntu1)
	x86_64-native-linuxapp-gcc+16byte
	x86_64-native-linuxapp-gcc
	x86_64-native-linuxapp-clang
	x86_64-native-linuxapp-doc

OS: RHEL10.2-64RT
	Kernel Version: 6.12.0-211.7.3.el10_2.x86_64+rt
	GCC Version: gcc (GCC) 14.3.1 20251022 (Red Hat 14.3.1-4)
	Clang Version: 21.1.8 (Red Hat, Inc. 21.1.8-1.el10)
	x86_64-native-linuxapp-gcc

OS: UB2404-64
	Kernel Version: 6.8.0-139-generic
	GCC Version: gcc (Ubuntu 13.3.0-6ubuntu2~24.04.1) 13.3.0
	Clang Version: 18.1.3 (1ubuntu1)
	x86_64-native-linuxapp-gcc

OS: Fedora44-64
	Kernel Version: 6.19.10-300.fc44.x86_64
	GCC Version: gcc (GCC) 16.0.1 20260321 (Red Hat 16.0.1-0)
	Clang Version: 22.1.8 (Fedora 22.1.8-4.fc44)
	x86_64-native-linuxapp-gcc
	x86_64-native-linuxapp-clang

OS: OpenEuler2404-64
	Kernel Version: 6.6.0-159.4.13.167.oe2403sp4.x86_64
	GCC Version: gcc (GCC) 12.3.1 (openEuler 12.3.1-110.oe2403sp4)
	Clang Version: 17.0.6 ( 17.0.6-67.oe2403sp4)
	x86_64-native-linuxapp-gcc



*Build Failed #1:
OS: AzureLinux4.0-64
Target: x86_64-native-linuxapp-gcc
FAILED: drivers/libtmp_rte_net_hinic3.a.p/net_hinic3_hinic3_nic_io.c.o 
gcc -Idrivers/libtmp_rte_net_hinic3.a.p -Idrivers -I../drivers -Idrivers/net/hinic3 -I../drivers/net/hinic3 -Idrivers/net/hinic3/base -I../drivers/net/hinic3/base -Idrivers/net/hinic3/htn_adapt -I../drivers/net/hinic3/htn_adapt -Idrivers/net/hinic3/stn_adapt -I../drivers/net/hinic3/stn_adapt -Ilib/ethdev -I../lib/ethdev -Ilib/eal/common -I../lib/eal/common -I. -I.. -Iconfig -I../config -Ilib/eal/include -I../lib/eal/include -Ilib/eal/linux/include -I../lib/eal/linux/include -Ilib/eal/x86/include -I../lib/eal/x86/include -I../kernel/linux -Ilib/eal -I../lib/eal -Ilib/kvargs -I../lib/kvargs -Ilib/log -I../lib/log -Ilib/metrics -I../lib/metrics -Ilib/telemetry -I../lib/telemetry -Ilib/argparse -I../lib/argparse -Ilib/net -I../lib/net -Ilib/mbuf -I../lib/mbuf -Ilib/mempool -I../lib/mempool -Ilib/ring -I../lib/ring -Ilib/meter -I../lib/meter -Idrivers/bus/pci -I../drivers/bus/pci -I../drivers/bus/pci/linux -Ilib/pci -I../lib/pci -Idrivers/bus/vdev -I../drivers/bus/vdev -fdiagnostics-color=always -D_FILE_OFFSET_BITS=64 -Wall -Winvalid-pch -Wextra -Werror -std=c11 -O3 -include rte_config.h -Wvla -Wcast-qual -Wdeprecated -Wformat -Wformat-nonliteral -Wformat-security -Wmissing-declarations -Wmissing-prototypes -Wnested-externs -Wold-style-definition -Wpointer-arith -Wshadow -Wsign-compare -Wstrict-prototypes -Wundef -Wwrite-strings -Wno-packed-not-aligned -Wno-missing-field-initializers -fzero-init-padding-bits=all -D_GNU_SOURCE -fPIC -march=native -mrtm -DALLOW_EXPERIMENTAL_API -DALLOW_INTERNAL_API -Wno-format-truncation -Wno-address-of-packed-member -DHW_CONVERT_ENDIAN -DRTE_COMPONENT_CLASS=pmd_net -DRTE_COMPONENT_NAME=hinic3 -DRTE_LOG_DEFAULT_LOGTYPE=pmd.net.hinic3 -MD -MQ drivers/libtmp_rte_net_hinic3.a.p/net_hinic3_hinic3_nic_io.c.o -MF drivers/libtmp_rte_net_hinic3.a.p/net_hinic3_hinic3_nic_io.c.o.d -o drivers/libtmp_rte_net_hinic3.a.p/net_hinic3_hinic3_nic_io.c.o -c ../drivers/net/hinic3/hinic3_nic_io.c
In file included from ../drivers/net/hinic3/hinic3_nic_io.c:12:
../drivers/net/hinic3/hinic3_tx.h:412:9: error: ‘IPV6_VERSION’ redefined [-Werror]
  412 | #define IPV6_VERSION 6
      |         ^~~~~~~~~~~~
In file included from ../lib/net/rte_ip4.h:28,
                 from ../lib/net/rte_ip.h:9,
                 from ../lib/ethdev/rte_flow.h:25,
                 from ../lib/ethdev/rte_eth_ctrl.h:11,
                 from ../lib/ethdev/rte_ethdev.h:1483,
                 from ../drivers/net/hinic3/base/hinic3_compat.h:8,
                 from ../drivers/net/hinic3/hinic3_nic_io.c:5:
/usr/include/netinet/ip6.h:49:9: note: this is the location of the previous definition
   49 | #define IPV6_VERSION       0x60
      |         ^~~~~~~~~~~~
cc1: all warnings being treated as errors
[1642/3656] Generating drivers/rte_net_hinic.pmd.c with a custom command
[1643/3656] Compiling C object drivers/libtmp_rte_net_hinic3.a.p/net_hinic3_base_hinic3_wq.c.o
[1644/3656] Compiling C object drivers/libtmp_rte_net_hinic3.a.p/net_hinic3_hinic3_telemetry.c.o
[1645/3656] Compiling C object drivers/libtmp_rte_net_hinic3.a.p/net_hinic3_hinic3_fdir.c.o
[1646/3656] Compiling C object drivers/libtmp_rte_net_hinic3.a.p/net_hinic3_hinic3_flow.c.o
[1647/3656] Compiling C object drivers/libtmp_rte_net_hinic3.a.p/net_hinic3_htn_adapt_hinic3_htn_cmdq.c.o
[1648/3656] Compiling C object drivers/libtmp_rte_net_hinic3.a.p/net_hinic3_hinic3_ethdev.c.o
FAILED: drivers/libtmp_rte_net_hinic3.a.p/net_hinic3_hinic3_ethdev.c.o 
gcc -Idrivers/libtmp_rte_net_hinic3.a.p -Idrivers -I../drivers -Idrivers/net/hinic3 -I../drivers/net/hinic3 -Idrivers/net/hinic3/base -I../drivers/net/hinic3/base -Idrivers/net/hinic3/htn_adapt -I../drivers/net/hinic3/htn_adapt -Idrivers/net/hinic3/stn_adapt -I../drivers/net/hinic3/stn_adapt -Ilib/ethdev -I../lib/ethdev -Ilib/eal/common -I../lib/eal/common -I. -I.. -Iconfig -I../config -Ilib/eal/include -I../lib/eal/include -Ilib/eal/linux/include -I../lib/eal/linux/include -Ilib/eal/x86/include -I../lib/eal/x86/include -I../kernel/linux -Ilib/eal -I../lib/eal -Ilib/kvargs -I../lib/kvargs -Ilib/log -I../lib/log -Ilib/metrics -I../lib/metrics -Ilib/telemetry -I../lib/telemetry -Ilib/argparse -I../lib/argparse -Ilib/net -I../lib/net -Ilib/mbuf -I../lib/mbuf -Ilib/mempool -I../lib/mempool -Ilib/ring -I../lib/ring -Ilib/meter -I../lib/meter -Idrivers/bus/pci -I../drivers/bus/pci -I../drivers/bus/pci/linux -Ilib/pci -I../lib/pci -Idrivers/bus/vdev -I../drivers/bus/vdev -fdiagnostics-color=always -D_FILE_OFFSET_BITS=64 -Wall -Winvalid-pch -Wextra -Werror -std=c11 -O3 -include rte_config.h -Wvla -Wcast-qual -Wdeprecated -Wformat -Wformat-nonliteral -Wformat-security -Wmissing-declarations -Wmissing-prototypes -Wnested-externs -Wold-style-definition -Wpointer-arith -Wshadow -Wsign-compare -Wstrict-prototypes -Wundef -Wwrite-strings -Wno-packed-not-aligned -Wno-missing-field-initializers -fzero-init-padding-bits=all -D_GNU_SOURCE -fPIC -march=native -mrtm -DALLOW_EXPERIMENTAL_API -DALLOW_INTERNAL_API -Wno-format-truncation -Wno-address-of-packed-member -DHW_CONVERT_ENDIAN -DRTE_COMPONENT_CLASS=pmd_net -DRTE_COMPONENT_NAME=hinic3 -DRTE_LOG_DEFAULT_LOGTYPE=pmd.net.hinic3 -MD -MQ drivers/libtmp_rte_net_hinic3.a.p/net_hinic3_hinic3_ethdev.c.o -MF drivers/libtmp_rte_net_hinic3.a.p/net_hinic3_hinic3_ethdev.c.o.d -o drivers/libtmp_rte_net_hinic3.a.p/net_hinic3_hinic3_ethdev.c.o -c ../drivers/net/hinic3/hinic3_ethdev.c
In file included from ../drivers/net/hinic3/hinic3_ethdev.c:21:
../drivers/net/hinic3/hinic3_tx.h:412:9: error: ‘IPV6_VERSION’ redefined [-Werror]
  412 | #define IPV6_VERSION 6
      |         ^~~~~~~~~~~~
In file included from ../lib/net/rte_ip4.h:28,
                 from ../lib/net/rte_ip.h:9,
                 from ../lib/ethdev/rte_flow.h:25,
                 from ../lib/ethdev/rte_eth_ctrl.h:11,
                 from ../lib/ethdev/rte_ethdev.h:1483,
                 from ../lib/ethdev/ethdev_driver.h:21,
                 from ../lib/ethdev/ethdev_pci.h:13,
                 from ../drivers/net/hinic3/hinic3_ethdev.c:4:
/usr/include/netinet/ip6.h:49:9: note: this is the location of the previous definition
   49 | #define IPV6_VERSION       0x60
      |         ^~~~~~~~~~~~
cc1: all warnings being treated as errors
[1649/3656] Compiling C object drivers/libtmp_rte_net_hinic3.a.p/net_hinic3_hinic3_rx.c.o
FAILED: drivers/libtmp_rte_net_hinic3.a.p/net_hinic3_hinic3_rx.c.o 
gcc -Idrivers/libtmp_rte_net_hinic3.a.p -Idrivers -I../drivers -Idrivers/net/hinic3 -I../drivers/net/hinic3 -Idrivers/net/hinic3/base -I../drivers/net/hinic3/base -Idrivers/net/hinic3/htn_adapt -I../drivers/net/hinic3/htn_adapt -Idrivers/net/hinic3/stn_adapt -I../drivers/net/hinic3/stn_adapt -Ilib/ethdev -I../lib/ethdev -Ilib/eal/common -I../lib/eal/common -I. -I.. -Iconfig -I../config -Ilib/eal/include -I../lib/eal/include -Ilib/eal/linux/include -I../lib/eal/linux/include -Ilib/eal/x86/include -I../lib/eal/x86/include -I../kernel/linux -Ilib/eal -I../lib/eal -Ilib/kvargs -I../lib/kvargs -Ilib/log -I../lib/log -Ilib/metrics -I../lib/metrics -Ilib/telemetry -I../lib/telemetry -Ilib/argparse -I../lib/argparse -Ilib/net -I../lib/net -Ilib/mbuf -I../lib/mbuf -Ilib/mempool -I../lib/mempool -Ilib/ring -I../lib/ring -Ilib/meter -I../lib/meter -Idrivers/bus/pci -I../drivers/bus/pci -I../drivers/bus/pci/linux -Ilib/pci -I../lib/pci -Idrivers/bus/vdev -I../drivers/bus/vdev -fdiagnostics-color=always -D_FILE_OFFSET_BITS=64 -Wall -Winvalid-pch -Wextra -Werror -std=c11 -O3 -include rte_config.h -Wvla -Wcast-qual -Wdeprecated -Wformat -Wformat-nonliteral -Wformat-security -Wmissing-declarations -Wmissing-prototypes -Wnested-externs -Wold-style-definition -Wpointer-arith -Wshadow -Wsign-compare -Wstrict-prototypes -Wundef -Wwrite-strings -Wno-packed-not-aligned -Wno-missing-field-initializers -fzero-init-padding-bits=all -D_GNU_SOURCE -fPIC -march=native -mrtm -DALLOW_EXPERIMENTAL_API -DALLOW_INTERNAL_API -Wno-format-truncation -Wno-address-of-packed-member -DHW_CONVERT_ENDIAN -DRTE_COMPONENT_CLASS=pmd_net -DRTE_COMPONENT_NAME=hinic3 -DRTE_LOG_DEFAULT_LOGTYPE=pmd.net.hinic3 -MD -MQ drivers/libtmp_rte_net_hinic3.a.p/net_hinic3_hinic3_rx.c.o -MF drivers/libtmp_rte_net_hinic3.a.p/net_hinic3_hinic3_rx.c.o.d -o drivers/libtmp_rte_net_hinic3.a.p/net_hinic3_hinic3_rx.c.o -c ../drivers/net/hinic3/hinic3_rx.c
In file included from ../drivers/net/hinic3/hinic3_rx.c:15:
../drivers/net/hinic3/hinic3_tx.h:412:9: error: ‘IPV6_VERSION’ redefined [-Werror]
  412 | #define IPV6_VERSION 6
      |         ^~~~~~~~~~~~
In file included from ../lib/net/rte_ip4.h:28,
                 from ../lib/net/rte_ip.h:9,
                 from ../lib/ethdev/rte_flow.h:25,
                 from ../lib/ethdev/rte_eth_ctrl.h:11,
                 from ../lib/ethdev/rte_ethdev.h:1483,
                 from ../drivers/net/hinic3/base/hinic3_compat.h:8,
                 from ../drivers/net/hinic3/hinic3_rx.c:7:
/usr/include/netinet/ip6.h:49:9: note: this is the location of the previous definition
   49 | #define IPV6_VERSION       0x60
      |         ^~~~~~~~~~~~
cc1: all warnings being treated as errors
[1650/3656] Compiling C object drivers/libtmp_rte_net_hinic3.a.p/net_hinic3_hinic3_tx.c.o
FAILED: drivers/libtmp_rte_net_hinic3.a.p/net_hinic3_hinic3_tx.c.o 
gcc -Idrivers/libtmp_rte_net_hinic3.a.p -Idrivers -I../drivers -Idrivers/net/hinic3 -I../drivers/net/hinic3 -Idrivers/net/hinic3/base -I../drivers/net/hinic3/base -Idrivers/net/hinic3/htn_adapt -I../drivers/net/hinic3/htn_adapt -Idrivers/net/hinic3/stn_adapt -I../drivers/net/hinic3/stn_adapt -Ilib/ethdev -I../lib/ethdev -Ilib/eal/common -I../lib/eal/common -I. -I.. -Iconfig -I../config -Ilib/eal/include -I../lib/eal/include -Ilib/eal/linux/include -I../lib/eal/linux/include -Ilib/eal/x86/include -I../lib/eal/x86/include -I../kernel/linux -Ilib/eal -I../lib/eal -Ilib/kvargs -I../lib/kvargs -Ilib/log -I../lib/log -Ilib/metrics -I../lib/metrics -Ilib/telemetry -I../lib/telemetry -Ilib/argparse -I../lib/argparse -Ilib/net -I../lib/net -Ilib/mbuf -I../lib/mbuf -Ilib/mempool -I../lib/mempool -Ilib/ring -I../lib/ring -Ilib/meter -I../lib/meter -Idrivers/bus/pci -I../drivers/bus/pci -I../drivers/bus/pci/linux -Ilib/pci -I../lib/pci -Idrivers/bus/vdev -I../drivers/bus/vdev -fdiagnostics-color=always -D_FILE_OFFSET_BITS=64 -Wall -Winvalid-pch -Wextra -Werror -std=c11 -O3 -include rte_config.h -Wvla -Wcast-qual -Wdeprecated -Wformat -Wformat-nonliteral -Wformat-security -Wmissing-declarations -Wmissing-prototypes -Wnested-externs -Wold-style-definition -Wpointer-arith -Wshadow -Wsign-compare -Wstrict-prototypes -Wundef -Wwrite-strings -Wno-packed-not-aligned -Wno-missing-field-initializers -fzero-init-padding-bits=all -D_GNU_SOURCE -fPIC -march=native -mrtm -DALLOW_EXPERIMENTAL_API -DALLOW_INTERNAL_API -Wno-format-truncation -Wno-address-of-packed-member -DHW_CONVERT_ENDIAN -DRTE_COMPONENT_CLASS=pmd_net -DRTE_COMPONENT_NAME=hinic3 -DRTE_LOG_DEFAULT_LOGTYPE=pmd.net.hinic3 -MD -MQ drivers/libtmp_rte_net_hinic3.a.p/net_hinic3_hinic3_tx.c.o -MF drivers/libtmp_rte_net_hinic3.a.p/net_hinic3_hinic3_tx.c.o.d -o drivers/libtmp_rte_net_hinic3.a.p/net_hinic3_hinic3_tx.c.o -c ../drivers/net/hinic3/hinic3_tx.c
In file included from ../drivers/net/hinic3/hinic3_tx.c:10:
../drivers/net/hinic3/hinic3_tx.h:412:9: error: ‘IPV6_VERSION’ redefined [-Werror]
  412 | #define IPV6_VERSION 6
      |         ^~~~~~~~~~~~
In file included from ../lib/net/rte_ip4.h:28,
                 from ../lib/net/rte_ip.h:9,
                 from ../lib/ethdev/rte_flow.h:25,
                 from ../lib/ethdev/rte_eth_ctrl.h:11,
                 from ../lib/ethdev/rte_ethdev.h:1483,
                 from ../drivers/net/hinic3/base/hinic3_compat.h:8,
                 from ../drivers/net/hinic3/hinic3_tx.c:5:
/usr/include/netinet/ip6.h:49:9: note: this is the location of the previous definition
   49 | #define IPV6_VERSION       0x60
      |         ^~~~~~~~~~~~
cc1: all warnings being treated as errors
ninja: build stopped




*Build Failed #2:
OS: UB2604-64
Target: x86_64-native-linuxapp-gcc+16byte
FAILED: drivers/libtmp_rte_net_hinic3.a.p/net_hinic3_hinic3_nic_io.c.o 
gcc -Idrivers/libtmp_rte_net_hinic3.a.p -Idrivers -I../drivers -Idrivers/net/hinic3 -I../drivers/net/hinic3 -Idrivers/net/hinic3/base -I../drivers/net/hinic3/base -Idrivers/net/hinic3/htn_adapt -I../drivers/net/hinic3/htn_adapt -Idrivers/net/hinic3/stn_adapt -I../drivers/net/hinic3/stn_adapt -Ilib/ethdev -I../lib/ethdev -Ilib/eal/common -I../lib/eal/common -I. -I.. -Iconfig -I../config -Ilib/eal/include -I../lib/eal/include -Ilib/eal/linux/include -I../lib/eal/linux/include -Ilib/eal/x86/include -I../lib/eal/x86/include -I../kernel/linux -Ilib/eal -I../lib/eal -Ilib/kvargs -I../lib/kvargs -Ilib/log -I../lib/log -Ilib/metrics -I../lib/metrics -Ilib/telemetry -I../lib/telemetry -Ilib/argparse -I../lib/argparse -Ilib/net -I../lib/net -Ilib/mbuf -I../lib/mbuf -Ilib/mempool -I../lib/mempool -Ilib/ring -I../lib/ring -Ilib/meter -I../lib/meter -Idrivers/bus/pci -I../drivers/bus/pci -I../drivers/bus/pci/linux -Ilib/pci -I../lib/pci -Idrivers/bus/vdev -I../drivers/bus/vdev -fdiagnostics-color=always -D_FILE_OFFSET_BITS=64 -Wall -Winvalid-pch -Wextra -Werror -std=c11 -O3 -include rte_config.h -Wvla -Wcast-qual -Wdeprecated -Wformat -Wformat-nonliteral -Wformat-security -Wmissing-declarations -Wmissing-prototypes -Wnested-externs -Wold-style-definition -Wpointer-arith -Wshadow -Wsign-compare -Wstrict-prototypes -Wundef -Wwrite-strings -Wno-packed-not-aligned -Wno-missing-field-initializers -fzero-init-padding-bits=all -D_GNU_SOURCE -DRTE_LIBRTE_I40E_16BYTE_RX_DESC -DRTE_LIBRTE_ICE_16BYTE_RX_DESC -fPIC -march=native -mrtm -DALLOW_EXPERIMENTAL_API -DALLOW_INTERNAL_API -Wno-format-truncation -Wno-address-of-packed-member -DHW_CONVERT_ENDIAN -DRTE_COMPONENT_CLASS=pmd_net -DRTE_COMPONENT_NAME=hinic3 -DRTE_LOG_DEFAULT_LOGTYPE=pmd.net.hinic3 -MD -MQ drivers/libtmp_rte_net_hinic3.a.p/net_hinic3_hinic3_nic_io.c.o -MF drivers/libtmp_rte_net_hinic3.a.p/net_hinic3_hinic3_nic_io.c.o.d -o drivers/libtmp_rte_net_hinic3.a.p/net_hinic3_hinic3_nic_io.c.o -c ../drivers/net/hinic3/hinic3_nic_io.c
In file included from ../drivers/net/hinic3/hinic3_nic_io.c:12:
../drivers/net/hinic3/hinic3_tx.h:412:9: error: ‘IPV6_VERSION’ redefined [-Werror]
  412 | #define IPV6_VERSION 6
      |         ^~~~~~~~~~~~
In file included from ../lib/net/rte_ip4.h:28,
                 from ../lib/net/rte_ip.h:9,
                 from ../lib/ethdev/rte_flow.h:25,
                 from ../lib/ethdev/rte_eth_ctrl.h:11,
                 from ../lib/ethdev/rte_ethdev.h:1483,
                 from ../drivers/net/hinic3/base/hinic3_compat.h:8,
                 from ../drivers/net/hinic3/hinic3_nic_io.c:5:
/usr/include/netinet/ip6.h:49:9: note: this is the location of the previous definition
   49 | #define IPV6_VERSION       0x60
      |         ^~~~~~~~~~~~
cc1: all warnings being treated as errors
[1665/3897] Compiling C object drivers/librte_net_hinic.so.27.0.p/meson-generated_.._rte_net_hinic.pmd.c.o
[1666/3897] Compiling C object drivers/libtmp_rte_net_hinic3.a.p/net_hinic3_hinic3_flow.c.o
[1667/3897] Compiling C object drivers/libtmp_rte_net_hinic3.a.p/net_hinic3_htn_adapt_hinic3_htn_cmdq.c.o
[1668/3897] Compiling C object drivers/libtmp_rte_net_hinic3.a.p/net_hinic3_base_hinic3_cmdq_enhance.c.o
[1669/3897] Compiling C object drivers/libtmp_rte_net_hinic3.a.p/net_hinic3_hinic3_fdir.c.o
[1670/3897] Compiling C object drivers/libtmp_rte_net_hinic3.a.p/net_hinic3_stn_adapt_hinic3_stn_cmdq.c.o
[1671/3897] Compiling C object drivers/libtmp_rte_net_hinic3.a.p/net_hinic3_hinic3_tx.c.o
FAILED: drivers/libtmp_rte_net_hinic3.a.p/net_hinic3_hinic3_tx.c.o 
gcc -Idrivers/libtmp_rte_net_hinic3.a.p -Idrivers -I../drivers -Idrivers/net/hinic3 -I../drivers/net/hinic3 -Idrivers/net/hinic3/base -I../drivers/net/hinic3/base -Idrivers/net/hinic3/htn_adapt -I../drivers/net/hinic3/htn_adapt -Idrivers/net/hinic3/stn_adapt -I../drivers/net/hinic3/stn_adapt -Ilib/ethdev -I../lib/ethdev -Ilib/eal/common -I../lib/eal/common -I. -I.. -Iconfig -I../config -Ilib/eal/include -I../lib/eal/include -Ilib/eal/linux/include -I../lib/eal/linux/include -Ilib/eal/x86/include -I../lib/eal/x86/include -I../kernel/linux -Ilib/eal -I../lib/eal -Ilib/kvargs -I../lib/kvargs -Ilib/log -I../lib/log -Ilib/metrics -I../lib/metrics -Ilib/telemetry -I../lib/telemetry -Ilib/argparse -I../lib/argparse -Ilib/net -I../lib/net -Ilib/mbuf -I../lib/mbuf -Ilib/mempool -I../lib/mempool -Ilib/ring -I../lib/ring -Ilib/meter -I../lib/meter -Idrivers/bus/pci -I../drivers/bus/pci -I../drivers/bus/pci/linux -Ilib/pci -I../lib/pci -Idrivers/bus/vdev -I../drivers/bus/vdev -fdiagnostics-color=always -D_FILE_OFFSET_BITS=64 -Wall -Winvalid-pch -Wextra -Werror -std=c11 -O3 -include rte_config.h -Wvla -Wcast-qual -Wdeprecated -Wformat -Wformat-nonliteral -Wformat-security -Wmissing-declarations -Wmissing-prototypes -Wnested-externs -Wold-style-definition -Wpointer-arith -Wshadow -Wsign-compare -Wstrict-prototypes -Wundef -Wwrite-strings -Wno-packed-not-aligned -Wno-missing-field-initializers -fzero-init-padding-bits=all -D_GNU_SOURCE -DRTE_LIBRTE_I40E_16BYTE_RX_DESC -DRTE_LIBRTE_ICE_16BYTE_RX_DESC -fPIC -march=native -mrtm -DALLOW_EXPERIMENTAL_API -DALLOW_INTERNAL_API -Wno-format-truncation -Wno-address-of-packed-member -DHW_CONVERT_ENDIAN -DRTE_COMPONENT_CLASS=pmd_net -DRTE_COMPONENT_NAME=hinic3 -DRTE_LOG_DEFAULT_LOGTYPE=pmd.net.hinic3 -MD -MQ drivers/libtmp_rte_net_hinic3.a.p/net_hinic3_hinic3_tx.c.o -MF drivers/libtmp_rte_net_hinic3.a.p/net_hinic3_hinic3_tx.c.o.d -o drivers/libtmp_rte_net_hinic3.a.p/net_hinic3_hinic3_tx.c.o -c ../drivers/net/hinic3/hinic3_tx.c
In file included from ../drivers/net/hinic3/hinic3_tx.c:10:
../drivers/net/hinic3/hinic3_tx.h:412:9: error: ‘IPV6_VERSION’ redefined [-Werror]
  412 | #define IPV6_VERSION 6
      |         ^~~~~~~~~~~~
In file included from ../lib/net/rte_ip4.h:28,
                 from ../lib/net/rte_ip.h:9,
                 from ../lib/ethdev/rte_flow.h:25,
                 from ../lib/ethdev/rte_eth_ctrl.h:11,
                 from ../lib/ethdev/rte_ethdev.h:1483,
                 from ../drivers/net/hinic3/base/hinic3_compat.h:8,
                 from ../drivers/net/hinic3/hinic3_tx.c:5:
/usr/include/netinet/ip6.h:49:9: note: this is the location of the previous definition
   49 | #define IPV6_VERSION       0x60
      |         ^~~~~~~~~~~~
cc1: all warnings being treated as errors
[1672/3897] Compiling C object drivers/libtmp_rte_net_hinic3.a.p/net_hinic3_hinic3_rx.c.o
FAILED: drivers/libtmp_rte_net_hinic3.a.p/net_hinic3_hinic3_rx.c.o 
gcc -Idrivers/libtmp_rte_net_hinic3.a.p -Idrivers -I../drivers -Idrivers/net/hinic3 -I../drivers/net/hinic3 -Idrivers/net/hinic3/base -I../drivers/net/hinic3/base -Idrivers/net/hinic3/htn_adapt -I../drivers/net/hinic3/htn_adapt -Idrivers/net/hinic3/stn_adapt -I../drivers/net/hinic3/stn_adapt -Ilib/ethdev -I../lib/ethdev -Ilib/eal/common -I../lib/eal/common -I. -I.. -Iconfig -I../config -Ilib/eal/include -I../lib/eal/include -Ilib/eal/linux/include -I../lib/eal/linux/include -Ilib/eal/x86/include -I../lib/eal/x86/include -I../kernel/linux -Ilib/eal -I../lib/eal -Ilib/kvargs -I../lib/kvargs -Ilib/log -I../lib/log -Ilib/metrics -I../lib/metrics -Ilib/telemetry -I../lib/telemetry -Ilib/argparse -I../lib/argparse -Ilib/net -I../lib/net -Ilib/mbuf -I../lib/mbuf -Ilib/mempool -I../lib/mempool -Ilib/ring -I../lib/ring -Ilib/meter -I../lib/meter -Idrivers/bus/pci -I../drivers/bus/pci -I../drivers/bus/pci/linux -Ilib/pci -I../lib/pci -Idrivers/bus/vdev -I../drivers/bus/vdev -fdiagnostics-color=always -D_FILE_OFFSET_BITS=64 -Wall -Winvalid-pch -Wextra -Werror -std=c11 -O3 -include rte_config.h -Wvla -Wcast-qual -Wdeprecated -Wformat -Wformat-nonliteral -Wformat-security -Wmissing-declarations -Wmissing-prototypes -Wnested-externs -Wold-style-definition -Wpointer-arith -Wshadow -Wsign-compare -Wstrict-prototypes -Wundef -Wwrite-strings -Wno-packed-not-aligned -Wno-missing-field-initializers -fzero-init-padding-bits=all -D_GNU_SOURCE -DRTE_LIBRTE_I40E_16BYTE_RX_DESC -DRTE_LIBRTE_ICE_16BYTE_RX_DESC -fPIC -march=native -mrtm -DALLOW_EXPERIMENTAL_API -DALLOW_INTERNAL_API -Wno-format-truncation -Wno-address-of-packed-member -DHW_CONVERT_ENDIAN -DRTE_COMPONENT_CLASS=pmd_net -DRTE_COMPONENT_NAME=hinic3 -DRTE_LOG_DEFAULT_LOGTYPE=pmd.net.hinic3 -MD -MQ drivers/libtmp_rte_net_hinic3.a.p/net_hinic3_hinic3_rx.c.o -MF drivers/libtmp_rte_net_hinic3.a.p/net_hinic3_hinic3_rx.c.o.d -o drivers/libtmp_rte_net_hinic3.a.p/net_hinic3_hinic3_rx.c.o -c ../drivers/net/hinic3/hinic3_rx.c
In file included from ../drivers/net/hinic3/hinic3_rx.c:15:
../drivers/net/hinic3/hinic3_tx.h:412:9: error: ‘IPV6_VERSION’ redefined [-Werror]
  412 | #define IPV6_VERSION 6
      |         ^~~~~~~~~~~~
In file included from ../lib/net/rte_ip4.h:28,
                 from ../lib/net/rte_ip.h:9,
                 from ../lib/ethdev/rte_flow.h:25,
                 from ../lib/ethdev/rte_eth_ctrl.h:11,
                 from ../lib/ethdev/rte_ethdev.h:1483,
                 from ../drivers/net/hinic3/base/hinic3_compat.h:8,
                 from ../drivers/net/hinic3/hinic3_rx.c:7:
/usr/include/netinet/ip6.h:49:9: note: this is the location of the previous definition
   49 | #define IPV6_VERSION       0x60
      |         ^~~~~~~~~~~~
cc1: all warnings being treated as errors
[1673/3897] Compiling C object drivers/libtmp_rte_net_hinic3.a.p/net_hinic3_hinic3_ethdev.c.o
FAILED: drivers/libtmp_rte_net_hinic3.a.p/net_hinic3_hinic3_ethdev.c.o 
gcc -Idrivers/libtmp_rte_net_hinic3.a.p -Idrivers -I../drivers -Idrivers/net/hinic3 -I../drivers/net/hinic3 -Idrivers/net/hinic3/base -I../drivers/net/hinic3/base -Idrivers/net/hinic3/htn_adapt -I../drivers/net/hinic3/htn_adapt -Idrivers/net/hinic3/stn_adapt -I../drivers/net/hinic3/stn_adapt -Ilib/ethdev -I../lib/ethdev -Ilib/eal/common -I../lib/eal/common -I. -I.. -Iconfig -I../config -Ilib/eal/include -I../lib/eal/include -Ilib/eal/linux/include -I../lib/eal/linux/include -Ilib/eal/x86/include -I../lib/eal/x86/include -I../kernel/linux -Ilib/eal -I../lib/eal -Ilib/kvargs -I../lib/kvargs -Ilib/log -I../lib/log -Ilib/metrics -I../lib/metrics -Ilib/telemetry -I../lib/telemetry -Ilib/argparse -I../lib/argparse -Ilib/net -I../lib/net -Ilib/mbuf -I../lib/mbuf -Ilib/mempool -I../lib/mempool -Ilib/ring -I../lib/ring -Ilib/meter -I../lib/meter -Idrivers/bus/pci -I../drivers/bus/pci -I../drivers/bus/pci/linux -Ilib/pci -I../lib/pci -Idrivers/bus/vdev -I../drivers/bus/vdev -fdiagnostics-color=always -D_FILE_OFFSET_BITS=64 -Wall -Winvalid-pch -Wextra -Werror -std=c11 -O3 -include rte_config.h -Wvla -Wcast-qual -Wdeprecated -Wformat -Wformat-nonliteral -Wformat-security -Wmissing-declarations -Wmissing-prototypes -Wnested-externs -Wold-style-definition -Wpointer-arith -Wshadow -Wsign-compare -Wstrict-prototypes -Wundef -Wwrite-strings -Wno-packed-not-aligned -Wno-missing-field-initializers -fzero-init-padding-bits=all -D_GNU_SOURCE -DRTE_LIBRTE_I40E_16BYTE_RX_DESC -DRTE_LIBRTE_ICE_16BYTE_RX_DESC -fPIC -march=native -mrtm -DALLOW_EXPERIMENTAL_API -DALLOW_INTERNAL_API -Wno-format-truncation -Wno-address-of-packed-member -DHW_CONVERT_ENDIAN -DRTE_COMPONENT_CLASS=pmd_net -DRTE_COMPONENT_NAME=hinic3 -DRTE_LOG_DEFAULT_LOGTYPE=pmd.net.hinic3 -MD -MQ drivers/libtmp_rte_net_hinic3.a.p/net_hinic3_hinic3_ethdev.c.o -MF drivers/libtmp_rte_net_hinic3.a.p/net_hinic3_hinic3_ethdev.c.o.d -o drivers/libtmp_rte_net_hinic3.a.p/net_hinic3_hinic3_ethdev.c.o -c ../drivers/net/hinic3/hinic3_ethdev.c
In file included from ../drivers/net/hinic3/hinic3_ethdev.c:21:
../drivers/net/hinic3/hinic3_tx.h:412:9: error: ‘IPV6_VERSION’ redefined [-Werror]
  412 | #define IPV6_VERSION 6
      |         ^~~~~~~~~~~~
In file included from ../lib/net/rte_ip4.h:28,
                 from ../lib/net/rte_ip.h:9,
                 from ../lib/ethdev/rte_flow.h:25,
                 from ../lib/ethdev/rte_eth_ctrl.h:11,
                 from ../lib/ethdev/rte_ethdev.h:1483,
                 from ../lib/ethdev/ethdev_driver.h:21,
                 from ../lib/ethdev/ethdev_pci.h:13,
                 from ../drivers/net/hinic3/hinic3_ethdev.c:4:
/usr/include/netinet/ip6.h:49:9: note: this is the location of the previous definition
   49 | #define IPV6_VERSION       0x60
      |         ^~~~~~~~~~~~
cc1: all warnings being treated as errors
ninja: build stopped




*Build Failed #3:
OS: UB2604-64
Target: x86_64-native-linuxapp-gcc
FAILED: drivers/libtmp_rte_net_hinic3.a.p/net_hinic3_hinic3_nic_io.c.o 
gcc -Idrivers/libtmp_rte_net_hinic3.a.p -Idrivers -I../drivers -Idrivers/net/hinic3 -I../drivers/net/hinic3 -Idrivers/net/hinic3/base -I../drivers/net/hinic3/base -Idrivers/net/hinic3/htn_adapt -I../drivers/net/hinic3/htn_adapt -Idrivers/net/hinic3/stn_adapt -I../drivers/net/hinic3/stn_adapt -Ilib/ethdev -I../lib/ethdev -Ilib/eal/common -I../lib/eal/common -I. -I.. -Iconfig -I../config -Ilib/eal/include -I../lib/eal/include -Ilib/eal/linux/include -I../lib/eal/linux/include -Ilib/eal/x86/include -I../lib/eal/x86/include -I../kernel/linux -Ilib/eal -I../lib/eal -Ilib/kvargs -I../lib/kvargs -Ilib/log -I../lib/log -Ilib/metrics -I../lib/metrics -Ilib/telemetry -I../lib/telemetry -Ilib/argparse -I../lib/argparse -Ilib/net -I../lib/net -Ilib/mbuf -I../lib/mbuf -Ilib/mempool -I../lib/mempool -Ilib/ring -I../lib/ring -Ilib/meter -I../lib/meter -Idrivers/bus/pci -I../drivers/bus/pci -I../drivers/bus/pci/linux -Ilib/pci -I../lib/pci -Idrivers/bus/vdev -I../drivers/bus/vdev -fdiagnostics-color=always -D_FILE_OFFSET_BITS=64 -Wall -Winvalid-pch -Wextra -Werror -std=c11 -O3 -include rte_config.h -Wvla -Wcast-qual -Wdeprecated -Wformat -Wformat-nonliteral -Wformat-security -Wmissing-declarations -Wmissing-prototypes -Wnested-externs -Wold-style-definition -Wpointer-arith -Wshadow -Wsign-compare -Wstrict-prototypes -Wundef -Wwrite-strings -Wno-packed-not-aligned -Wno-missing-field-initializers -fzero-init-padding-bits=all -D_GNU_SOURCE -fPIC -march=native -mrtm -DALLOW_EXPERIMENTAL_API -DALLOW_INTERNAL_API -Wno-format-truncation -Wno-address-of-packed-member -DHW_CONVERT_ENDIAN -DRTE_COMPONENT_CLASS=pmd_net -DRTE_COMPONENT_NAME=hinic3 -DRTE_LOG_DEFAULT_LOGTYPE=pmd.net.hinic3 -MD -MQ drivers/libtmp_rte_net_hinic3.a.p/net_hinic3_hinic3_nic_io.c.o -MF drivers/libtmp_rte_net_hinic3.a.p/net_hinic3_hinic3_nic_io.c.o.d -o drivers/libtmp_rte_net_hinic3.a.p/net_hinic3_hinic3_nic_io.c.o -c ../drivers/net/hinic3/hinic3_nic_io.c
In file included from ../drivers/net/hinic3/hinic3_nic_io.c:12:
../drivers/net/hinic3/hinic3_tx.h:412:9: error: ‘IPV6_VERSION’ redefined [-Werror]
  412 | #define IPV6_VERSION 6
      |         ^~~~~~~~~~~~
In file included from ../lib/net/rte_ip4.h:28,
                 from ../lib/net/rte_ip.h:9,
                 from ../lib/ethdev/rte_flow.h:25,
                 from ../lib/ethdev/rte_eth_ctrl.h:11,
                 from ../lib/ethdev/rte_ethdev.h:1483,
                 from ../drivers/net/hinic3/base/hinic3_compat.h:8,
                 from ../drivers/net/hinic3/hinic3_nic_io.c:5:
/usr/include/netinet/ip6.h:49:9: note: this is the location of the previous definition
   49 | #define IPV6_VERSION       0x60
      |         ^~~~~~~~~~~~
cc1: all warnings being treated as errors
[1667/3897] Generating drivers/rte_net_hinic.sym_chk with a custom command (wrapped by meson to capture output)
[1668/3897] Compiling C object drivers/libtmp_rte_net_hinic3.a.p/net_hinic3_hinic3_flow.c.o
[1669/3897] Compiling C object drivers/libtmp_rte_net_hinic3.a.p/net_hinic3_htn_adapt_hinic3_htn_cmdq.c.o
[1670/3897] Compiling C object drivers/libtmp_rte_net_hinic3.a.p/net_hinic3_stn_adapt_hinic3_stn_cmdq.c.o
[1671/3897] Compiling C object drivers/libtmp_rte_net_hinic3.a.p/net_hinic3_hinic3_fdir.c.o
[1672/3897] Compiling C object drivers/libtmp_rte_net_hinic3.a.p/net_hinic3_base_hinic3_cmdq_enhance.c.o
[1673/3897] Compiling C object drivers/libtmp_rte_net_hinic3.a.p/net_hinic3_hinic3_tx.c.o
FAILED: drivers/libtmp_rte_net_hinic3.a.p/net_hinic3_hinic3_tx.c.o 
gcc -Idrivers/libtmp_rte_net_hinic3.a.p -Idrivers -I../drivers -Idrivers/net/hinic3 -I../drivers/net/hinic3 -Idrivers/net/hinic3/base -I../drivers/net/hinic3/base -Idrivers/net/hinic3/htn_adapt -I../drivers/net/hinic3/htn_adapt -Idrivers/net/hinic3/stn_adapt -I../drivers/net/hinic3/stn_adapt -Ilib/ethdev -I../lib/ethdev -Ilib/eal/common -I../lib/eal/common -I. -I.. -Iconfig -I../config -Ilib/eal/include -I../lib/eal/include -Ilib/eal/linux/include -I../lib/eal/linux/include -Ilib/eal/x86/include -I../lib/eal/x86/include -I../kernel/linux -Ilib/eal -I../lib/eal -Ilib/kvargs -I../lib/kvargs -Ilib/log -I../lib/log -Ilib/metrics -I../lib/metrics -Ilib/telemetry -I../lib/telemetry -Ilib/argparse -I../lib/argparse -Ilib/net -I../lib/net -Ilib/mbuf -I../lib/mbuf -Ilib/mempool -I../lib/mempool -Ilib/ring -I../lib/ring -Ilib/meter -I../lib/meter -Idrivers/bus/pci -I../drivers/bus/pci -I../drivers/bus/pci/linux -Ilib/pci -I../lib/pci -Idrivers/bus/vdev -I../drivers/bus/vdev -fdiagnostics-color=always -D_FILE_OFFSET_BITS=64 -Wall -Winvalid-pch -Wextra -Werror -std=c11 -O3 -include rte_config.h -Wvla -Wcast-qual -Wdeprecated -Wformat -Wformat-nonliteral -Wformat-security -Wmissing-declarations -Wmissing-prototypes -Wnested-externs -Wold-style-definition -Wpointer-arith -Wshadow -Wsign-compare -Wstrict-prototypes -Wundef -Wwrite-strings -Wno-packed-not-aligned -Wno-missing-field-initializers -fzero-init-padding-bits=all -D_GNU_SOURCE -fPIC -march=native -mrtm -DALLOW_EXPERIMENTAL_API -DALLOW_INTERNAL_API -Wno-format-truncation -Wno-address-of-packed-member -DHW_CONVERT_ENDIAN -DRTE_COMPONENT_CLASS=pmd_net -DRTE_COMPONENT_NAME=hinic3 -DRTE_LOG_DEFAULT_LOGTYPE=pmd.net.hinic3 -MD -MQ drivers/libtmp_rte_net_hinic3.a.p/net_hinic3_hinic3_tx.c.o -MF drivers/libtmp_rte_net_hinic3.a.p/net_hinic3_hinic3_tx.c.o.d -o drivers/libtmp_rte_net_hinic3.a.p/net_hinic3_hinic3_tx.c.o -c ../drivers/net/hinic3/hinic3_tx.c
In file included from ../drivers/net/hinic3/hinic3_tx.c:10:
../drivers/net/hinic3/hinic3_tx.h:412:9: error: ‘IPV6_VERSION’ redefined [-Werror]
  412 | #define IPV6_VERSION 6
      |         ^~~~~~~~~~~~
In file included from ../lib/net/rte_ip4.h:28,
                 from ../lib/net/rte_ip.h:9,
                 from ../lib/ethdev/rte_flow.h:25,
                 from ../lib/ethdev/rte_eth_ctrl.h:11,
                 from ../lib/ethdev/rte_ethdev.h:1483,
                 from ../drivers/net/hinic3/base/hinic3_compat.h:8,
                 from ../drivers/net/hinic3/hinic3_tx.c:5:
/usr/include/netinet/ip6.h:49:9: note: this is the location of the previous definition
   49 | #define IPV6_VERSION       0x60
      |         ^~~~~~~~~~~~
cc1: all warnings being treated as errors
[1674/3897] Compiling C object drivers/libtmp_rte_net_hinic3.a.p/net_hinic3_hinic3_rx.c.o
FAILED: drivers/libtmp_rte_net_hinic3.a.p/net_hinic3_hinic3_rx.c.o 
gcc -Idrivers/libtmp_rte_net_hinic3.a.p -Idrivers -I../drivers -Idrivers/net/hinic3 -I../drivers/net/hinic3 -Idrivers/net/hinic3/base -I../drivers/net/hinic3/base -Idrivers/net/hinic3/htn_adapt -I../drivers/net/hinic3/htn_adapt -Idrivers/net/hinic3/stn_adapt -I../drivers/net/hinic3/stn_adapt -Ilib/ethdev -I../lib/ethdev -Ilib/eal/common -I../lib/eal/common -I. -I.. -Iconfig -I../config -Ilib/eal/include -I../lib/eal/include -Ilib/eal/linux/include -I../lib/eal/linux/include -Ilib/eal/x86/include -I../lib/eal/x86/include -I../kernel/linux -Ilib/eal -I../lib/eal -Ilib/kvargs -I../lib/kvargs -Ilib/log -I../lib/log -Ilib/metrics -I../lib/metrics -Ilib/telemetry -I../lib/telemetry -Ilib/argparse -I../lib/argparse -Ilib/net -I../lib/net -Ilib/mbuf -I../lib/mbuf -Ilib/mempool -I../lib/mempool -Ilib/ring -I../lib/ring -Ilib/meter -I../lib/meter -Idrivers/bus/pci -I../drivers/bus/pci -I../drivers/bus/pci/linux -Ilib/pci -I../lib/pci -Idrivers/bus/vdev -I../drivers/bus/vdev -fdiagnostics-color=always -D_FILE_OFFSET_BITS=64 -Wall -Winvalid-pch -Wextra -Werror -std=c11 -O3 -include rte_config.h -Wvla -Wcast-qual -Wdeprecated -Wformat -Wformat-nonliteral -Wformat-security -Wmissing-declarations -Wmissing-prototypes -Wnested-externs -Wold-style-definition -Wpointer-arith -Wshadow -Wsign-compare -Wstrict-prototypes -Wundef -Wwrite-strings -Wno-packed-not-aligned -Wno-missing-field-initializers -fzero-init-padding-bits=all -D_GNU_SOURCE -fPIC -march=native -mrtm -DALLOW_EXPERIMENTAL_API -DALLOW_INTERNAL_API -Wno-format-truncation -Wno-address-of-packed-member -DHW_CONVERT_ENDIAN -DRTE_COMPONENT_CLASS=pmd_net -DRTE_COMPONENT_NAME=hinic3 -DRTE_LOG_DEFAULT_LOGTYPE=pmd.net.hinic3 -MD -MQ drivers/libtmp_rte_net_hinic3.a.p/net_hinic3_hinic3_rx.c.o -MF drivers/libtmp_rte_net_hinic3.a.p/net_hinic3_hinic3_rx.c.o.d -o drivers/libtmp_rte_net_hinic3.a.p/net_hinic3_hinic3_rx.c.o -c ../drivers/net/hinic3/hinic3_rx.c
In file included from ../drivers/net/hinic3/hinic3_rx.c:15:
../drivers/net/hinic3/hinic3_tx.h:412:9: error: ‘IPV6_VERSION’ redefined [-Werror]
  412 | #define IPV6_VERSION 6
      |         ^~~~~~~~~~~~
In file included from ../lib/net/rte_ip4.h:28,
                 from ../lib/net/rte_ip.h:9,
                 from ../lib/ethdev/rte_flow.h:25,
                 from ../lib/ethdev/rte_eth_ctrl.h:11,
                 from ../lib/ethdev/rte_ethdev.h:1483,
                 from ../drivers/net/hinic3/base/hinic3_compat.h:8,
                 from ../drivers/net/hinic3/hinic3_rx.c:7:
/usr/include/netinet/ip6.h:49:9: note: this is the location of the previous definition
   49 | #define IPV6_VERSION       0x60
      |         ^~~~~~~~~~~~
cc1: all warnings being treated as errors
[1675/3897] Compiling C object drivers/libtmp_rte_net_hinic3.a.p/net_hinic3_hinic3_ethdev.c.o
FAILED: drivers/libtmp_rte_net_hinic3.a.p/net_hinic3_hinic3_ethdev.c.o 
gcc -Idrivers/libtmp_rte_net_hinic3.a.p -Idrivers -I../drivers -Idrivers/net/hinic3 -I../drivers/net/hinic3 -Idrivers/net/hinic3/base -I../drivers/net/hinic3/base -Idrivers/net/hinic3/htn_adapt -I../drivers/net/hinic3/htn_adapt -Idrivers/net/hinic3/stn_adapt -I../drivers/net/hinic3/stn_adapt -Ilib/ethdev -I../lib/ethdev -Ilib/eal/common -I../lib/eal/common -I. -I.. -Iconfig -I../config -Ilib/eal/include -I../lib/eal/include -Ilib/eal/linux/include -I../lib/eal/linux/include -Ilib/eal/x86/include -I../lib/eal/x86/include -I../kernel/linux -Ilib/eal -I../lib/eal -Ilib/kvargs -I../lib/kvargs -Ilib/log -I../lib/log -Ilib/metrics -I../lib/metrics -Ilib/telemetry -I../lib/telemetry -Ilib/argparse -I../lib/argparse -Ilib/net -I../lib/net -Ilib/mbuf -I../lib/mbuf -Ilib/mempool -I../lib/mempool -Ilib/ring -I../lib/ring -Ilib/meter -I../lib/meter -Idrivers/bus/pci -I../drivers/bus/pci -I../drivers/bus/pci/linux -Ilib/pci -I../lib/pci -Idrivers/bus/vdev -I../drivers/bus/vdev -fdiagnostics-color=always -D_FILE_OFFSET_BITS=64 -Wall -Winvalid-pch -Wextra -Werror -std=c11 -O3 -include rte_config.h -Wvla -Wcast-qual -Wdeprecated -Wformat -Wformat-nonliteral -Wformat-security -Wmissing-declarations -Wmissing-prototypes -Wnested-externs -Wold-style-definition -Wpointer-arith -Wshadow -Wsign-compare -Wstrict-prototypes -Wundef -Wwrite-strings -Wno-packed-not-aligned -Wno-missing-field-initializers -fzero-init-padding-bits=all -D_GNU_SOURCE -fPIC -march=native -mrtm -DALLOW_EXPERIMENTAL_API -DALLOW_INTERNAL_API -Wno-format-truncation -Wno-address-of-packed-member -DHW_CONVERT_ENDIAN -DRTE_COMPONENT_CLASS=pmd_net -DRTE_COMPONENT_NAME=hinic3 -DRTE_LOG_DEFAULT_LOGTYPE=pmd.net.hinic3 -MD -MQ drivers/libtmp_rte_net_hinic3.a.p/net_hinic3_hinic3_ethdev.c.o -MF drivers/libtmp_rte_net_hinic3.a.p/net_hinic3_hinic3_ethdev.c.o.d -o drivers/libtmp_rte_net_hinic3.a.p/net_hinic3_hinic3_ethdev.c.o -c ../drivers/net/hinic3/hinic3_ethdev.c
In file included from ../drivers/net/hinic3/hinic3_ethdev.c:21:
../drivers/net/hinic3/hinic3_tx.h:412:9: error: ‘IPV6_VERSION’ redefined [-Werror]
  412 | #define IPV6_VERSION 6
      |         ^~~~~~~~~~~~
In file included from ../lib/net/rte_ip4.h:28,
                 from ../lib/net/rte_ip.h:9,
                 from ../lib/ethdev/rte_flow.h:25,
                 from ../lib/ethdev/rte_eth_ctrl.h:11,
                 from ../lib/ethdev/rte_ethdev.h:1483,
                 from ../lib/ethdev/ethdev_driver.h:21,
                 from ../lib/ethdev/ethdev_pci.h:13,
                 from ../drivers/net/hinic3/hinic3_ethdev.c:4:
/usr/include/netinet/ip6.h:49:9: note: this is the location of the previous definition
   49 | #define IPV6_VERSION       0x60
      |         ^~~~~~~~~~~~
cc1: all warnings being treated as errors
ninja: build stopped




*Build Failed #4:
OS: UB2604-64
Target: x86_64-native-linuxapp-clang
FAILED: drivers/libtmp_rte_net_hinic3.a.p/net_hinic3_hinic3_tx.c.o 
clang -Idrivers/libtmp_rte_net_hinic3.a.p -Idrivers -I../drivers -Idrivers/net/hinic3 -I../drivers/net/hinic3 -Idrivers/net/hinic3/base -I../drivers/net/hinic3/base -Idrivers/net/hinic3/htn_adapt -I../drivers/net/hinic3/htn_adapt -Idrivers/net/hinic3/stn_adapt -I../drivers/net/hinic3/stn_adapt -Ilib/ethdev -I../lib/ethdev -Ilib/eal/common -I../lib/eal/common -I. -I.. -Iconfig -I../config -Ilib/eal/include -I../lib/eal/include -Ilib/eal/linux/include -I../lib/eal/linux/include -Ilib/eal/x86/include -I../lib/eal/x86/include -I../kernel/linux -Ilib/eal -I../lib/eal -Ilib/kvargs -I../lib/kvargs -Ilib/log -I../lib/log -Ilib/metrics -I../lib/metrics -Ilib/telemetry -I../lib/telemetry -Ilib/argparse -I../lib/argparse -Ilib/net -I../lib/net -Ilib/mbuf -I../lib/mbuf -Ilib/mempool -I../lib/mempool -Ilib/ring -I../lib/ring -Ilib/meter -I../lib/meter -Idrivers/bus/pci -I../drivers/bus/pci -I../drivers/bus/pci/linux -Ilib/pci -I../lib/pci -Idrivers/bus/vdev -I../drivers/bus/vdev -fdiagnostics-color=always -D_FILE_OFFSET_BITS=64 -Wall -Winvalid-pch -Wextra -Werror -std=c11 -O3 -include rte_config.h -Wvla -Wcast-qual -Wcomma -Wdeprecated -Wformat -Wformat-nonliteral -Wformat-security -Wmissing-declarations -Wmissing-prototypes -Wnested-externs -Wold-style-definition -Wpointer-arith -Wshadow -Wsign-compare -Wstrict-prototypes -Wundef -Wwrite-strings -Wno-missing-field-initializers -D_GNU_SOURCE -fPIC -march=native -mrtm -DALLOW_EXPERIMENTAL_API -DALLOW_INTERNAL_API -Wno-format-truncation -Wno-address-of-packed-member -DHW_CONVERT_ENDIAN -DRTE_COMPONENT_CLASS=pmd_net -DRTE_COMPONENT_NAME=hinic3 -DRTE_LOG_DEFAULT_LOGTYPE=pmd.net.hinic3 -DRTE_ANNOTATE_LOCKS -Wthread-safety -MD -MQ drivers/libtmp_rte_net_hinic3.a.p/net_hinic3_hinic3_tx.c.o -MF drivers/libtmp_rte_net_hinic3.a.p/net_hinic3_hinic3_tx.c.o.d -o drivers/libtmp_rte_net_hinic3.a.p/net_hinic3_hinic3_tx.c.o -c ../drivers/net/hinic3/hinic3_tx.c
In file included from ../drivers/net/hinic3/hinic3_tx.c:10:
../drivers/net/hinic3/hinic3_tx.h:412:9: error: 'IPV6_VERSION' macro redefined [-Werror,-Wmacro-redefined]
  412 | #define IPV6_VERSION 6
      |         ^
/usr/include/netinet/ip6.h:49:9: note: previous definition is here
   49 | #define IPV6_VERSION       0x60
      |         ^
1 error generated.
[1664/3898] Generating drivers/rte_net_hinic.pmd.c with a custom command
[1665/3898] Compiling C object drivers/libtmp_rte_net_hinic3.a.p/net_hinic3_hinic3_rx.c.o
FAILED: drivers/libtmp_rte_net_hinic3.a.p/net_hinic3_hinic3_rx.c.o 
clang -Idrivers/libtmp_rte_net_hinic3.a.p -Idrivers -I../drivers -Idrivers/net/hinic3 -I../drivers/net/hinic3 -Idrivers/net/hinic3/base -I../drivers/net/hinic3/base -Idrivers/net/hinic3/htn_adapt -I../drivers/net/hinic3/htn_adapt -Idrivers/net/hinic3/stn_adapt -I../drivers/net/hinic3/stn_adapt -Ilib/ethdev -I../lib/ethdev -Ilib/eal/common -I../lib/eal/common -I. -I.. -Iconfig -I../config -Ilib/eal/include -I../lib/eal/include -Ilib/eal/linux/include -I../lib/eal/linux/include -Ilib/eal/x86/include -I../lib/eal/x86/include -I../kernel/linux -Ilib/eal -I../lib/eal -Ilib/kvargs -I../lib/kvargs -Ilib/log -I../lib/log -Ilib/metrics -I../lib/metrics -Ilib/telemetry -I../lib/telemetry -Ilib/argparse -I../lib/argparse -Ilib/net -I../lib/net -Ilib/mbuf -I../lib/mbuf -Ilib/mempool -I../lib/mempool -Ilib/ring -I../lib/ring -Ilib/meter -I../lib/meter -Idrivers/bus/pci -I../drivers/bus/pci -I../drivers/bus/pci/linux -Ilib/pci -I../lib/pci -Idrivers/bus/vdev -I../drivers/bus/vdev -fdiagnostics-color=always -D_FILE_OFFSET_BITS=64 -Wall -Winvalid-pch -Wextra -Werror -std=c11 -O3 -include rte_config.h -Wvla -Wcast-qual -Wcomma -Wdeprecated -Wformat -Wformat-nonliteral -Wformat-security -Wmissing-declarations -Wmissing-prototypes -Wnested-externs -Wold-style-definition -Wpointer-arith -Wshadow -Wsign-compare -Wstrict-prototypes -Wundef -Wwrite-strings -Wno-missing-field-initializers -D_GNU_SOURCE -fPIC -march=native -mrtm -DALLOW_EXPERIMENTAL_API -DALLOW_INTERNAL_API -Wno-format-truncation -Wno-address-of-packed-member -DHW_CONVERT_ENDIAN -DRTE_COMPONENT_CLASS=pmd_net -DRTE_COMPONENT_NAME=hinic3 -DRTE_LOG_DEFAULT_LOGTYPE=pmd.net.hinic3 -DRTE_ANNOTATE_LOCKS -Wthread-safety -MD -MQ drivers/libtmp_rte_net_hinic3.a.p/net_hinic3_hinic3_rx.c.o -MF drivers/libtmp_rte_net_hinic3.a.p/net_hinic3_hinic3_rx.c.o.d -o drivers/libtmp_rte_net_hinic3.a.p/net_hinic3_hinic3_rx.c.o -c ../drivers/net/hinic3/hinic3_rx.c
In file included from ../drivers/net/hinic3/hinic3_rx.c:15:
../drivers/net/hinic3/hinic3_tx.h:412:9: error: 'IPV6_VERSION' macro redefined [-Werror,-Wmacro-redefined]
  412 | #define IPV6_VERSION 6
      |         ^
/usr/include/netinet/ip6.h:49:9: note: previous definition is here
   49 | #define IPV6_VERSION       0x60
      |         ^
1 error generated.
[1666/3898] Compiling C object drivers/libtmp_rte_net_hinic3.a.p/net_hinic3_hinic3_nic_io.c.o
FAILED: drivers/libtmp_rte_net_hinic3.a.p/net_hinic3_hinic3_nic_io.c.o 
clang -Idrivers/libtmp_rte_net_hinic3.a.p -Idrivers -I../drivers -Idrivers/net/hinic3 -I../drivers/net/hinic3 -Idrivers/net/hinic3/base -I../drivers/net/hinic3/base -Idrivers/net/hinic3/htn_adapt -I../drivers/net/hinic3/htn_adapt -Idrivers/net/hinic3/stn_adapt -I../drivers/net/hinic3/stn_adapt -Ilib/ethdev -I../lib/ethdev -Ilib/eal/common -I../lib/eal/common -I. -I.. -Iconfig -I../config -Ilib/eal/include -I../lib/eal/include -Ilib/eal/linux/include -I../lib/eal/linux/include -Ilib/eal/x86/include -I../lib/eal/x86/include -I../kernel/linux -Ilib/eal -I../lib/eal -Ilib/kvargs -I../lib/kvargs -Ilib/log -I../lib/log -Ilib/metrics -I../lib/metrics -Ilib/telemetry -I../lib/telemetry -Ilib/argparse -I../lib/argparse -Ilib/net -I../lib/net -Ilib/mbuf -I../lib/mbuf -Ilib/mempool -I../lib/mempool -Ilib/ring -I../lib/ring -Ilib/meter -I../lib/meter -Idrivers/bus/pci -I../drivers/bus/pci -I../drivers/bus/pci/linux -Ilib/pci -I../lib/pci -Idrivers/bus/vdev -I../drivers/bus/vdev -fdiagnostics-color=always -D_FILE_OFFSET_BITS=64 -Wall -Winvalid-pch -Wextra -Werror -std=c11 -O3 -include rte_config.h -Wvla -Wcast-qual -Wcomma -Wdeprecated -Wformat -Wformat-nonliteral -Wformat-security -Wmissing-declarations -Wmissing-prototypes -Wnested-externs -Wold-style-definition -Wpointer-arith -Wshadow -Wsign-compare -Wstrict-prototypes -Wundef -Wwrite-strings -Wno-missing-field-initializers -D_GNU_SOURCE -fPIC -march=native -mrtm -DALLOW_EXPERIMENTAL_API -DALLOW_INTERNAL_API -Wno-format-truncation -Wno-address-of-packed-member -DHW_CONVERT_ENDIAN -DRTE_COMPONENT_CLASS=pmd_net -DRTE_COMPONENT_NAME=hinic3 -DRTE_LOG_DEFAULT_LOGTYPE=pmd.net.hinic3 -DRTE_ANNOTATE_LOCKS -Wthread-safety -MD -MQ drivers/libtmp_rte_net_hinic3.a.p/net_hinic3_hinic3_nic_io.c.o -MF drivers/libtmp_rte_net_hinic3.a.p/net_hinic3_hinic3_nic_io.c.o.d -o drivers/libtmp_rte_net_hinic3.a.p/net_hinic3_hinic3_nic_io.c.o -c ../drivers/net/hinic3/hinic3_nic_io.c
In file included from ../drivers/net/hinic3/hinic3_nic_io.c:12:
../drivers/net/hinic3/hinic3_tx.h:412:9: error: 'IPV6_VERSION' macro redefined [-Werror,-Wmacro-redefined]
  412 | #define IPV6_VERSION 6
      |         ^
/usr/include/netinet/ip6.h:49:9: note: previous definition is here
   49 | #define IPV6_VERSION       0x60
      |         ^
1 error generated.
[1667/3898] Compiling C object drivers/libtmp_rte_net_hinic3.a.p/net_hinic3_hinic3_ethdev.c.o
FAILED: drivers/libtmp_rte_net_hinic3.a.p/net_hinic3_hinic3_ethdev.c.o 
clang -Idrivers/libtmp_rte_net_hinic3.a.p -Idrivers -I../drivers -Idrivers/net/hinic3 -I../drivers/net/hinic3 -Idrivers/net/hinic3/base -I../drivers/net/hinic3/base -Idrivers/net/hinic3/htn_adapt -I../drivers/net/hinic3/htn_adapt -Idrivers/net/hinic3/stn_adapt -I../drivers/net/hinic3/stn_adapt -Ilib/ethdev -I../lib/ethdev -Ilib/eal/common -I../lib/eal/common -I. -I.. -Iconfig -I../config -Ilib/eal/include -I../lib/eal/include -Ilib/eal/linux/include -I../lib/eal/linux/include -Ilib/eal/x86/include -I../lib/eal/x86/include -I../kernel/linux -Ilib/eal -I../lib/eal -Ilib/kvargs -I../lib/kvargs -Ilib/log -I../lib/log -Ilib/metrics -I../lib/metrics -Ilib/telemetry -I../lib/telemetry -Ilib/argparse -I../lib/argparse -Ilib/net -I../lib/net -Ilib/mbuf -I../lib/mbuf -Ilib/mempool -I../lib/mempool -Ilib/ring -I../lib/ring -Ilib/meter -I../lib/meter -Idrivers/bus/pci -I../drivers/bus/pci -I../drivers/bus/pci/linux -Ilib/pci -I../lib/pci -Idrivers/bus/vdev -I../drivers/bus/vdev -fdiagnostics-color=always -D_FILE_OFFSET_BITS=64 -Wall -Winvalid-pch -Wextra -Werror -std=c11 -O3 -include rte_config.h -Wvla -Wcast-qual -Wcomma -Wdeprecated -Wformat -Wformat-nonliteral -Wformat-security -Wmissing-declarations -Wmissing-prototypes -Wnested-externs -Wold-style-definition -Wpointer-arith -Wshadow -Wsign-compare -Wstrict-prototypes -Wundef -Wwrite-strings -Wno-missing-field-initializers -D_GNU_SOURCE -fPIC -march=native -mrtm -DALLOW_EXPERIMENTAL_API -DALLOW_INTERNAL_API -Wno-format-truncation -Wno-address-of-packed-member -DHW_CONVERT_ENDIAN -DRTE_COMPONENT_CLASS=pmd_net -DRTE_COMPONENT_NAME=hinic3 -DRTE_LOG_DEFAULT_LOGTYPE=pmd.net.hinic3 -DRTE_ANNOTATE_LOCKS -Wthread-safety -MD -MQ drivers/libtmp_rte_net_hinic3.a.p/net_hinic3_hinic3_ethdev.c.o -MF drivers/libtmp_rte_net_hinic3.a.p/net_hinic3_hinic3_ethdev.c.o.d -o drivers/libtmp_rte_net_hinic3.a.p/net_hinic3_hinic3_ethdev.c.o -c ../drivers/net/hinic3/hinic3_ethdev.c
In file included from ../drivers/net/hinic3/hinic3_ethdev.c:21:
../drivers/net/hinic3/hinic3_tx.h:412:9: error: 'IPV6_VERSION' macro redefined [-Werror,-Wmacro-redefined]
  412 | #define IPV6_VERSION 6
      |         ^
/usr/include/netinet/ip6.h:49:9: note: previous definition is here
   49 | #define IPV6_VERSION       0x60
      |         ^
1 error generated.
[1668/3898] Compiling C object drivers/libtmp_rte_net_hinic3.a.p/net_hinic3_htn_adapt_hinic3_htn_cmdq.c.o
[1669/3898] Compiling C object drivers/libtmp_rte_net_hinic3.a.p/net_hinic3_hinic3_flow.c.o
[1670/3898] Compiling C object drivers/libtmp_rte_net_hinic3.a.p/net_hinic3_base_hinic3_cmdq_enhance.c.o
[1671/3898] Compiling C object drivers/libtmp_rte_net_hinic3.a.p/net_hinic3_hinic3_fdir.c.o
[1672/3898] Compiling C object drivers/libtmp_rte_net_hinic3.a.p/net_hinic3_stn_adapt_hinic3_stn_cmdq.c.o
ninja: build stopped




*Build Failed #5:
OS: UB2604-64
Target: x86_64-native-linuxapp-doc
FAILED: drivers/libtmp_rte_net_hinic3.a.p/net_hinic3_hinic3_nic_io.c.o 
gcc -Idrivers/libtmp_rte_net_hinic3.a.p -Idrivers -I../drivers -Idrivers/net/hinic3 -I../drivers/net/hinic3 -Idrivers/net/hinic3/base -I../drivers/net/hinic3/base -Idrivers/net/hinic3/htn_adapt -I../drivers/net/hinic3/htn_adapt -Idrivers/net/hinic3/stn_adapt -I../drivers/net/hinic3/stn_adapt -Ilib/ethdev -I../lib/ethdev -Ilib/eal/common -I../lib/eal/common -I. -I.. -Iconfig -I../config -Ilib/eal/include -I../lib/eal/include -Ilib/eal/linux/include -I../lib/eal/linux/include -Ilib/eal/x86/include -I../lib/eal/x86/include -I../kernel/linux -Ilib/eal -I../lib/eal -Ilib/kvargs -I../lib/kvargs -Ilib/log -I../lib/log -Ilib/metrics -I../lib/metrics -Ilib/telemetry -I../lib/telemetry -Ilib/argparse -I../lib/argparse -Ilib/net -I../lib/net -Ilib/mbuf -I../lib/mbuf -Ilib/mempool -I../lib/mempool -Ilib/ring -I../lib/ring -Ilib/meter -I../lib/meter -Idrivers/bus/pci -I../drivers/bus/pci -I../drivers/bus/pci/linux -Ilib/pci -I../lib/pci -Idrivers/bus/vdev -I../drivers/bus/vdev -fdiagnostics-color=always -D_FILE_OFFSET_BITS=64 -Wall -Winvalid-pch -Wextra -Werror -std=c11 -O3 -include rte_config.h -Wvla -Wcast-qual -Wdeprecated -Wformat -Wformat-nonliteral -Wformat-security -Wmissing-declarations -Wmissing-prototypes -Wnested-externs -Wold-style-definition -Wpointer-arith -Wshadow -Wsign-compare -Wstrict-prototypes -Wundef -Wwrite-strings -Wno-packed-not-aligned -Wno-missing-field-initializers -fzero-init-padding-bits=all -D_GNU_SOURCE -fPIC -march=native -mrtm -DALLOW_EXPERIMENTAL_API -DALLOW_INTERNAL_API -Wno-format-truncation -Wno-address-of-packed-member -DHW_CONVERT_ENDIAN -DRTE_COMPONENT_CLASS=pmd_net -DRTE_COMPONENT_NAME=hinic3 -DRTE_LOG_DEFAULT_LOGTYPE=pmd.net.hinic3 -MD -MQ drivers/libtmp_rte_net_hinic3.a.p/net_hinic3_hinic3_nic_io.c.o -MF drivers/libtmp_rte_net_hinic3.a.p/net_hinic3_hinic3_nic_io.c.o.d -o drivers/libtmp_rte_net_hinic3.a.p/net_hinic3_hinic3_nic_io.c.o -c ../drivers/net/hinic3/hinic3_nic_io.c
In file included from ../drivers/net/hinic3/hinic3_nic_io.c:12:
../drivers/net/hinic3/hinic3_tx.h:412:9: error: ‘IPV6_VERSION’ redefined [-Werror]
  412 | #define IPV6_VERSION 6
      |         ^~~~~~~~~~~~
In file included from ../lib/net/rte_ip4.h:28,
                 from ../lib/net/rte_ip.h:9,
                 from ../lib/ethdev/rte_flow.h:25,
                 from ../lib/ethdev/rte_eth_ctrl.h:11,
                 from ../lib/ethdev/rte_ethdev.h:1483,
                 from ../drivers/net/hinic3/base/hinic3_compat.h:8,
                 from ../drivers/net/hinic3/hinic3_nic_io.c:5:
/usr/include/netinet/ip6.h:49:9: note: this is the location of the previous definition
   49 | #define IPV6_VERSION       0x60
      |         ^~~~~~~~~~~~
cc1: all warnings being treated as errors
[1672/3720] Compiling C object drivers/libtmp_rte_net_hinic3.a.p/net_hinic3_hinic3_tx.c.o
FAILED: drivers/libtmp_rte_net_hinic3.a.p/net_hinic3_hinic3_tx.c.o 
gcc -Idrivers/libtmp_rte_net_hinic3.a.p -Idrivers -I../drivers -Idrivers/net/hinic3 -I../drivers/net/hinic3 -Idrivers/net/hinic3/base -I../drivers/net/hinic3/base -Idrivers/net/hinic3/htn_adapt -I../drivers/net/hinic3/htn_adapt -Idrivers/net/hinic3/stn_adapt -I../drivers/net/hinic3/stn_adapt -Ilib/ethdev -I../lib/ethdev -Ilib/eal/common -I../lib/eal/common -I. -I.. -Iconfig -I../config -Ilib/eal/include -I../lib/eal/include -Ilib/eal/linux/include -I../lib/eal/linux/include -Ilib/eal/x86/include -I../lib/eal/x86/include -I../kernel/linux -Ilib/eal -I../lib/eal -Ilib/kvargs -I../lib/kvargs -Ilib/log -I../lib/log -Ilib/metrics -I../lib/metrics -Ilib/telemetry -I../lib/telemetry -Ilib/argparse -I../lib/argparse -Ilib/net -I../lib/net -Ilib/mbuf -I../lib/mbuf -Ilib/mempool -I../lib/mempool -Ilib/ring -I../lib/ring -Ilib/meter -I../lib/meter -Idrivers/bus/pci -I../drivers/bus/pci -I../drivers/bus/pci/linux -Ilib/pci -I../lib/pci -Idrivers/bus/vdev -I../drivers/bus/vdev -fdiagnostics-color=always -D_FILE_OFFSET_BITS=64 -Wall -Winvalid-pch -Wextra -Werror -std=c11 -O3 -include rte_config.h -Wvla -Wcast-qual -Wdeprecated -Wformat -Wformat-nonliteral -Wformat-security -Wmissing-declarations -Wmissing-prototypes -Wnested-externs -Wold-style-definition -Wpointer-arith -Wshadow -Wsign-compare -Wstrict-prototypes -Wundef -Wwrite-strings -Wno-packed-not-aligned -Wno-missing-field-initializers -fzero-init-padding-bits=all -D_GNU_SOURCE -fPIC -march=native -mrtm -DALLOW_EXPERIMENTAL_API -DALLOW_INTERNAL_API -Wno-format-truncation -Wno-address-of-packed-member -DHW_CONVERT_ENDIAN -DRTE_COMPONENT_CLASS=pmd_net -DRTE_COMPONENT_NAME=hinic3 -DRTE_LOG_DEFAULT_LOGTYPE=pmd.net.hinic3 -MD -MQ drivers/libtmp_rte_net_hinic3.a.p/net_hinic3_hinic3_tx.c.o -MF drivers/libtmp_rte_net_hinic3.a.p/net_hinic3_hinic3_tx.c.o.d -o drivers/libtmp_rte_net_hinic3.a.p/net_hinic3_hinic3_tx.c.o -c ../drivers/net/hinic3/hinic3_tx.c
In file included from ../drivers/net/hinic3/hinic3_tx.c:10:
../drivers/net/hinic3/hinic3_tx.h:412:9: error: ‘IPV6_VERSION’ redefined [-Werror]
  412 | #define IPV6_VERSION 6
      |         ^~~~~~~~~~~~
In file included from ../lib/net/rte_ip4.h:28,
                 from ../lib/net/rte_ip.h:9,
                 from ../lib/ethdev/rte_flow.h:25,
                 from ../lib/ethdev/rte_eth_ctrl.h:11,
                 from ../lib/ethdev/rte_ethdev.h:1483,
                 from ../drivers/net/hinic3/base/hinic3_compat.h:8,
                 from ../drivers/net/hinic3/hinic3_tx.c:5:
/usr/include/netinet/ip6.h:49:9: note: this is the location of the previous definition
   49 | #define IPV6_VERSION       0x60
      |         ^~~~~~~~~~~~
cc1: all warnings being treated as errors
[1673/3720] Compiling C object drivers/libtmp_rte_net_hinic3.a.p/net_hinic3_hinic3_rx.c.o
FAILED: drivers/libtmp_rte_net_hinic3.a.p/net_hinic3_hinic3_rx.c.o 
gcc -Idrivers/libtmp_rte_net_hinic3.a.p -Idrivers -I../drivers -Idrivers/net/hinic3 -I../drivers/net/hinic3 -Idrivers/net/hinic3/base -I../drivers/net/hinic3/base -Idrivers/net/hinic3/htn_adapt -I../drivers/net/hinic3/htn_adapt -Idrivers/net/hinic3/stn_adapt -I../drivers/net/hinic3/stn_adapt -Ilib/ethdev -I../lib/ethdev -Ilib/eal/common -I../lib/eal/common -I. -I.. -Iconfig -I../config -Ilib/eal/include -I../lib/eal/include -Ilib/eal/linux/include -I../lib/eal/linux/include -Ilib/eal/x86/include -I../lib/eal/x86/include -I../kernel/linux -Ilib/eal -I../lib/eal -Ilib/kvargs -I../lib/kvargs -Ilib/log -I../lib/log -Ilib/metrics -I../lib/metrics -Ilib/telemetry -I../lib/telemetry -Ilib/argparse -I../lib/argparse -Ilib/net -I../lib/net -Ilib/mbuf -I../lib/mbuf -Ilib/mempool -I../lib/mempool -Ilib/ring -I../lib/ring -Ilib/meter -I../lib/meter -Idrivers/bus/pci -I../drivers/bus/pci -I../drivers/bus/pci/linux -Ilib/pci -I../lib/pci -Idrivers/bus/vdev -I../drivers/bus/vdev -fdiagnostics-color=always -D_FILE_OFFSET_BITS=64 -Wall -Winvalid-pch -Wextra -Werror -std=c11 -O3 -include rte_config.h -Wvla -Wcast-qual -Wdeprecated -Wformat -Wformat-nonliteral -Wformat-security -Wmissing-declarations -Wmissing-prototypes -Wnested-externs -Wold-style-definition -Wpointer-arith -Wshadow -Wsign-compare -Wstrict-prototypes -Wundef -Wwrite-strings -Wno-packed-not-aligned -Wno-missing-field-initializers -fzero-init-padding-bits=all -D_GNU_SOURCE -fPIC -march=native -mrtm -DALLOW_EXPERIMENTAL_API -DALLOW_INTERNAL_API -Wno-format-truncation -Wno-address-of-packed-member -DHW_CONVERT_ENDIAN -DRTE_COMPONENT_CLASS=pmd_net -DRTE_COMPONENT_NAME=hinic3 -DRTE_LOG_DEFAULT_LOGTYPE=pmd.net.hinic3 -MD -MQ drivers/libtmp_rte_net_hinic3.a.p/net_hinic3_hinic3_rx.c.o -MF drivers/libtmp_rte_net_hinic3.a.p/net_hinic3_hinic3_rx.c.o.d -o drivers/libtmp_rte_net_hinic3.a.p/net_hinic3_hinic3_rx.c.o -c ../drivers/net/hinic3/hinic3_rx.c
In file included from ../drivers/net/hinic3/hinic3_rx.c:15:
../drivers/net/hinic3/hinic3_tx.h:412:9: error: ‘IPV6_VERSION’ redefined [-Werror]
  412 | #define IPV6_VERSION 6
      |         ^~~~~~~~~~~~
In file included from ../lib/net/rte_ip4.h:28,
                 from ../lib/net/rte_ip.h:9,
                 from ../lib/ethdev/rte_flow.h:25,
                 from ../lib/ethdev/rte_eth_ctrl.h:11,
                 from ../lib/ethdev/rte_ethdev.h:1483,
                 from ../drivers/net/hinic3/base/hinic3_compat.h:8,
                 from ../drivers/net/hinic3/hinic3_rx.c:7:
/usr/include/netinet/ip6.h:49:9: note: this is the location of the previous definition
   49 | #define IPV6_VERSION       0x60
      |         ^~~~~~~~~~~~
cc1: all warnings being treated as errors
[1674/3720] Compiling C object drivers/libtmp_rte_net_hinic3.a.p/net_hinic3_base_hinic3_hw_cfg.c.o
[1675/3720] Compiling C object drivers/libtmp_rte_net_hinic3.a.p/net_hinic3_base_hinic3_hwdev.c.o
[1676/3720] Compiling C object drivers/libtmp_rte_net_hinic3.a.p/net_hinic3_base_hinic3_eqs.c.o
[1677/3720] Compiling C object drivers/libtmp_rte_net_hinic3.a.p/net_hinic3_base_hinic3_hw_comm.c.o
[1678/3720] Compiling C object drivers/libtmp_rte_net_hinic3.a.p/net_hinic3_base_hinic3_hwif.c.o
[1679/3720] Compiling C object drivers/libtmp_rte_net_hinic3.a.p/net_hinic3_hinic3_ethdev.c.o
FAILED: drivers/libtmp_rte_net_hinic3.a.p/net_hinic3_hinic3_ethdev.c.o 
gcc -Idrivers/libtmp_rte_net_hinic3.a.p -Idrivers -I../drivers -Idrivers/net/hinic3 -I../drivers/net/hinic3 -Idrivers/net/hinic3/base -I../drivers/net/hinic3/base -Idrivers/net/hinic3/htn_adapt -I../drivers/net/hinic3/htn_adapt -Idrivers/net/hinic3/stn_adapt -I../drivers/net/hinic3/stn_adapt -Ilib/ethdev -I../lib/ethdev -Ilib/eal/common -I../lib/eal/common -I. -I.. -Iconfig -I../config -Ilib/eal/include -I../lib/eal/include -Ilib/eal/linux/include -I../lib/eal/linux/include -Ilib/eal/x86/include -I../lib/eal/x86/include -I../kernel/linux -Ilib/eal -I../lib/eal -Ilib/kvargs -I../lib/kvargs -Ilib/log -I../lib/log -Ilib/metrics -I../lib/metrics -Ilib/telemetry -I../lib/telemetry -Ilib/argparse -I../lib/argparse -Ilib/net -I../lib/net -Ilib/mbuf -I../lib/mbuf -Ilib/mempool -I../lib/mempool -Ilib/ring -I../lib/ring -Ilib/meter -I../lib/meter -Idrivers/bus/pci -I../drivers/bus/pci -I../drivers/bus/pci/linux -Ilib/pci -I../lib/pci -Idrivers/bus/vdev -I../drivers/bus/vdev -fdiagnostics-color=always -D_FILE_OFFSET_BITS=64 -Wall -Winvalid-pch -Wextra -Werror -std=c11 -O3 -include rte_config.h -Wvla -Wcast-qual -Wdeprecated -Wformat -Wformat-nonliteral -Wformat-security -Wmissing-declarations -Wmissing-prototypes -Wnested-externs -Wold-style-definition -Wpointer-arith -Wshadow -Wsign-compare -Wstrict-prototypes -Wundef -Wwrite-strings -Wno-packed-not-aligned -Wno-missing-field-initializers -fzero-init-padding-bits=all -D_GNU_SOURCE -fPIC -march=native -mrtm -DALLOW_EXPERIMENTAL_API -DALLOW_INTERNAL_API -Wno-format-truncation -Wno-address-of-packed-member -DHW_CONVERT_ENDIAN -DRTE_COMPONENT_CLASS=pmd_net -DRTE_COMPONENT_NAME=hinic3 -DRTE_LOG_DEFAULT_LOGTYPE=pmd.net.hinic3 -MD -MQ drivers/libtmp_rte_net_hinic3.a.p/net_hinic3_hinic3_ethdev.c.o -MF drivers/libtmp_rte_net_hinic3.a.p/net_hinic3_hinic3_ethdev.c.o.d -o drivers/libtmp_rte_net_hinic3.a.p/net_hinic3_hinic3_ethdev.c.o -c ../drivers/net/hinic3/hinic3_ethdev.c
In file included from ../drivers/net/hinic3/hinic3_ethdev.c:21:
../drivers/net/hinic3/hinic3_tx.h:412:9: error: ‘IPV6_VERSION’ redefined [-Werror]
  412 | #define IPV6_VERSION 6
      |         ^~~~~~~~~~~~
In file included from ../lib/net/rte_ip4.h:28,
                 from ../lib/net/rte_ip.h:9,
                 from ../lib/ethdev/rte_flow.h:25,
                 from ../lib/ethdev/rte_eth_ctrl.h:11,
                 from ../lib/ethdev/rte_ethdev.h:1483,
                 from ../lib/ethdev/ethdev_driver.h:21,
                 from ../lib/ethdev/ethdev_pci.h:13,
                 from ../drivers/net/hinic3/hinic3_ethdev.c:4:
/usr/include/netinet/ip6.h:49:9: note: this is the location of the previous definition
   49 | #define IPV6_VERSION       0x60
      |         ^~~~~~~~~~~~
cc1: all warnings being treated as errors
[1680/3720] Compiling C object drivers/libtmp_rte_net_hinic3.a.p/net_hinic3_base_hinic3_cmdq.c.o
ninja: build stopped




*Build Failed #6:
OS: Fedora44-64
Target: x86_64-native-linuxapp-gcc
FAILED: drivers/libtmp_rte_net_hinic3.a.p/net_hinic3_hinic3_tx.c.o 
gcc -Idrivers/libtmp_rte_net_hinic3.a.p -Idrivers -I../drivers -Idrivers/net/hinic3 -I../drivers/net/hinic3 -Idrivers/net/hinic3/base -I../drivers/net/hinic3/base -Idrivers/net/hinic3/htn_adapt -I../drivers/net/hinic3/htn_adapt -Idrivers/net/hinic3/stn_adapt -I../drivers/net/hinic3/stn_adapt -Ilib/ethdev -I../lib/ethdev -Ilib/eal/common -I../lib/eal/common -I. -I.. -Iconfig -I../config -Ilib/eal/include -I../lib/eal/include -Ilib/eal/linux/include -I../lib/eal/linux/include -Ilib/eal/x86/include -I../lib/eal/x86/include -I../kernel/linux -Ilib/eal -I../lib/eal -Ilib/kvargs -I../lib/kvargs -Ilib/log -I../lib/log -Ilib/metrics -I../lib/metrics -Ilib/telemetry -I../lib/telemetry -Ilib/argparse -I../lib/argparse -Ilib/net -I../lib/net -Ilib/mbuf -I../lib/mbuf -Ilib/mempool -I../lib/mempool -Ilib/ring -I../lib/ring -Ilib/meter -I../lib/meter -Idrivers/bus/pci -I../drivers/bus/pci -I../drivers/bus/pci/linux -Ilib/pci -I../lib/pci -Idrivers/bus/vdev -I../drivers/bus/vdev -fdiagnostics-color=always -D_FILE_OFFSET_BITS=64 -Wall -Winvalid-pch -Wextra -Werror -std=c11 -O3 -include rte_config.h -Wvla -Wcast-qual -Wdeprecated -Wformat -Wformat-nonliteral -Wformat-security -Wmissing-declarations -Wmissing-prototypes -Wnested-externs -Wold-style-definition -Wpointer-arith -Wshadow -Wsign-compare -Wstrict-prototypes -Wundef -Wwrite-strings -Wno-packed-not-aligned -Wno-missing-field-initializers -fzero-init-padding-bits=all -D_GNU_SOURCE -fPIC -march=native -mrtm -DALLOW_EXPERIMENTAL_API -DALLOW_INTERNAL_API -Wno-format-truncation -Wno-address-of-packed-member -DHW_CONVERT_ENDIAN -DRTE_COMPONENT_CLASS=pmd_net -DRTE_COMPONENT_NAME=hinic3 -DRTE_LOG_DEFAULT_LOGTYPE=pmd.net.hinic3 -MD -MQ drivers/libtmp_rte_net_hinic3.a.p/net_hinic3_hinic3_tx.c.o -MF drivers/libtmp_rte_net_hinic3.a.p/net_hinic3_hinic3_tx.c.o.d -o drivers/libtmp_rte_net_hinic3.a.p/net_hinic3_hinic3_tx.c.o -c ../drivers/net/hinic3/hinic3_tx.c
In file included from ../drivers/net/hinic3/hinic3_tx.c:10:
../drivers/net/hinic3/hinic3_tx.h:412:9: error: ‘IPV6_VERSION’ redefined [-Werror]
  412 | #define IPV6_VERSION 6
      |         ^~~~~~~~~~~~
In file included from ../lib/net/rte_ip4.h:28,
                 from ../lib/net/rte_ip.h:9,
                 from ../lib/ethdev/rte_flow.h:25,
                 from ../lib/ethdev/rte_eth_ctrl.h:11,
                 from ../lib/ethdev/rte_ethdev.h:1483,
                 from ../drivers/net/hinic3/base/hinic3_compat.h:8,
                 from ../drivers/net/hinic3/hinic3_tx.c:5:
/usr/include/netinet/ip6.h:49:9: note: this is the location of the previous definition
   49 | #define IPV6_VERSION       0x60
      |         ^~~~~~~~~~~~
cc1: all warnings being treated as errors
[1649/3656] Compiling C object drivers/libtmp_rte_net_hinic3.a.p/net_hinic3_htn_adapt_hinic3_htn_cmdq.c.o
[1650/3656] Compiling C object drivers/libtmp_rte_net_hinic3.a.p/net_hinic3_hinic3_nic_io.c.o
FAILED: drivers/libtmp_rte_net_hinic3.a.p/net_hinic3_hinic3_nic_io.c.o 
gcc -Idrivers/libtmp_rte_net_hinic3.a.p -Idrivers -I../drivers -Idrivers/net/hinic3 -I../drivers/net/hinic3 -Idrivers/net/hinic3/base -I../drivers/net/hinic3/base -Idrivers/net/hinic3/htn_adapt -I../drivers/net/hinic3/htn_adapt -Idrivers/net/hinic3/stn_adapt -I../drivers/net/hinic3/stn_adapt -Ilib/ethdev -I../lib/ethdev -Ilib/eal/common -I../lib/eal/common -I. -I.. -Iconfig -I../config -Ilib/eal/include -I../lib/eal/include -Ilib/eal/linux/include -I../lib/eal/linux/include -Ilib/eal/x86/include -I../lib/eal/x86/include -I../kernel/linux -Ilib/eal -I../lib/eal -Ilib/kvargs -I../lib/kvargs -Ilib/log -I../lib/log -Ilib/metrics -I../lib/metrics -Ilib/telemetry -I../lib/telemetry -Ilib/argparse -I../lib/argparse -Ilib/net -I../lib/net -Ilib/mbuf -I../lib/mbuf -Ilib/mempool -I../lib/mempool -Ilib/ring -I../lib/ring -Ilib/meter -I../lib/meter -Idrivers/bus/pci -I../drivers/bus/pci -I../drivers/bus/pci/linux -Ilib/pci -I../lib/pci -Idrivers/bus/vdev -I../drivers/bus/vdev -fdiagnostics-color=always -D_FILE_OFFSET_BITS=64 -Wall -Winvalid-pch -Wextra -Werror -std=c11 -O3 -include rte_config.h -Wvla -Wcast-qual -Wdeprecated -Wformat -Wformat-nonliteral -Wformat-security -Wmissing-declarations -Wmissing-prototypes -Wnested-externs -Wold-style-definition -Wpointer-arith -Wshadow -Wsign-compare -Wstrict-prototypes -Wundef -Wwrite-strings -Wno-packed-not-aligned -Wno-missing-field-initializers -fzero-init-padding-bits=all -D_GNU_SOURCE -fPIC -march=native -mrtm -DALLOW_EXPERIMENTAL_API -DALLOW_INTERNAL_API -Wno-format-truncation -Wno-address-of-packed-member -DHW_CONVERT_ENDIAN -DRTE_COMPONENT_CLASS=pmd_net -DRTE_COMPONENT_NAME=hinic3 -DRTE_LOG_DEFAULT_LOGTYPE=pmd.net.hinic3 -MD -MQ drivers/libtmp_rte_net_hinic3.a.p/net_hinic3_hinic3_nic_io.c.o -MF drivers/libtmp_rte_net_hinic3.a.p/net_hinic3_hinic3_nic_io.c.o.d -o drivers/libtmp_rte_net_hinic3.a.p/net_hinic3_hinic3_nic_io.c.o -c ../drivers/net/hinic3/hinic3_nic_io.c
In file included from ../drivers/net/hinic3/hinic3_nic_io.c:12:
../drivers/net/hinic3/hinic3_tx.h:412:9: error: ‘IPV6_VERSION’ redefined [-Werror]
  412 | #define IPV6_VERSION 6
      |         ^~~~~~~~~~~~
In file included from ../lib/net/rte_ip4.h:28,
                 from ../lib/net/rte_ip.h:9,
                 from ../lib/ethdev/rte_flow.h:25,
                 from ../lib/ethdev/rte_eth_ctrl.h:11,
                 from ../lib/ethdev/rte_ethdev.h:1483,
                 from ../drivers/net/hinic3/base/hinic3_compat.h:8,
                 from ../drivers/net/hinic3/hinic3_nic_io.c:5:
/usr/include/netinet/ip6.h:49:9: note: this is the location of the previous definition
   49 | #define IPV6_VERSION       0x60
      |         ^~~~~~~~~~~~
cc1: all warnings being treated as errors
[1651/3656] Generating drivers/rte_net_hinic.sym_chk with a custom command (wrapped by meson to capture output)
[1652/3656] Compiling C object drivers/libtmp_rte_net_hinic3.a.p/net_hinic3_base_hinic3_cmdq_enhance.c.o
[1653/3656] Compiling C object drivers/libtmp_rte_net_hinic3.a.p/net_hinic3_hinic3_rx.c.o
FAILED: drivers/libtmp_rte_net_hinic3.a.p/net_hinic3_hinic3_rx.c.o 
gcc -Idrivers/libtmp_rte_net_hinic3.a.p -Idrivers -I../drivers -Idrivers/net/hinic3 -I../drivers/net/hinic3 -Idrivers/net/hinic3/base -I../drivers/net/hinic3/base -Idrivers/net/hinic3/htn_adapt -I../drivers/net/hinic3/htn_adapt -Idrivers/net/hinic3/stn_adapt -I../drivers/net/hinic3/stn_adapt -Ilib/ethdev -I../lib/ethdev -Ilib/eal/common -I../lib/eal/common -I. -I.. -Iconfig -I../config -Ilib/eal/include -I../lib/eal/include -Ilib/eal/linux/include -I../lib/eal/linux/include -Ilib/eal/x86/include -I../lib/eal/x86/include -I../kernel/linux -Ilib/eal -I../lib/eal -Ilib/kvargs -I../lib/kvargs -Ilib/log -I../lib/log -Ilib/metrics -I../lib/metrics -Ilib/telemetry -I../lib/telemetry -Ilib/argparse -I../lib/argparse -Ilib/net -I../lib/net -Ilib/mbuf -I../lib/mbuf -Ilib/mempool -I../lib/mempool -Ilib/ring -I../lib/ring -Ilib/meter -I../lib/meter -Idrivers/bus/pci -I../drivers/bus/pci -I../drivers/bus/pci/linux -Ilib/pci -I../lib/pci -Idrivers/bus/vdev -I../drivers/bus/vdev -fdiagnostics-color=always -D_FILE_OFFSET_BITS=64 -Wall -Winvalid-pch -Wextra -Werror -std=c11 -O3 -include rte_config.h -Wvla -Wcast-qual -Wdeprecated -Wformat -Wformat-nonliteral -Wformat-security -Wmissing-declarations -Wmissing-prototypes -Wnested-externs -Wold-style-definition -Wpointer-arith -Wshadow -Wsign-compare -Wstrict-prototypes -Wundef -Wwrite-strings -Wno-packed-not-aligned -Wno-missing-field-initializers -fzero-init-padding-bits=all -D_GNU_SOURCE -fPIC -march=native -mrtm -DALLOW_EXPERIMENTAL_API -DALLOW_INTERNAL_API -Wno-format-truncation -Wno-address-of-packed-member -DHW_CONVERT_ENDIAN -DRTE_COMPONENT_CLASS=pmd_net -DRTE_COMPONENT_NAME=hinic3 -DRTE_LOG_DEFAULT_LOGTYPE=pmd.net.hinic3 -MD -MQ drivers/libtmp_rte_net_hinic3.a.p/net_hinic3_hinic3_rx.c.o -MF drivers/libtmp_rte_net_hinic3.a.p/net_hinic3_hinic3_rx.c.o.d -o drivers/libtmp_rte_net_hinic3.a.p/net_hinic3_hinic3_rx.c.o -c ../drivers/net/hinic3/hinic3_rx.c
In file included from ../drivers/net/hinic3/hinic3_rx.c:15:
../drivers/net/hinic3/hinic3_tx.h:412:9: error: ‘IPV6_VERSION’ redefined [-Werror]
  412 | #define IPV6_VERSION 6
      |         ^~~~~~~~~~~~
In file included from ../lib/net/rte_ip4.h:28,
                 from ../lib/net/rte_ip.h:9,
                 from ../lib/ethdev/rte_flow.h:25,
                 from ../lib/ethdev/rte_eth_ctrl.h:11,
                 from ../lib/ethdev/rte_ethdev.h:1483,
                 from ../drivers/net/hinic3/base/hinic3_compat.h:8,
                 from ../drivers/net/hinic3/hinic3_rx.c:7:
/usr/include/netinet/ip6.h:49:9: note: this is the location of the previous definition
   49 | #define IPV6_VERSION       0x60
      |         ^~~~~~~~~~~~
cc1: all warnings being treated as errors
[1654/3656] Compiling C object drivers/libtmp_rte_net_hinic3.a.p/net_hinic3_stn_adapt_hinic3_stn_cmdq.c.o
[1655/3656] Compiling C object drivers/libtmp_rte_net_hinic3.a.p/net_hinic3_base_hinic3_cmdq.c.o
[1656/3656] Compiling C object drivers/libtmp_rte_net_hinic3.a.p/net_hinic3_base_hinic3_eqs.c.o
[1657/3656] Compiling C object drivers/libtmp_rte_net_hinic3.a.p/net_hinic3_hinic3_ethdev.c.o
FAILED: drivers/libtmp_rte_net_hinic3.a.p/net_hinic3_hinic3_ethdev.c.o 
gcc -Idrivers/libtmp_rte_net_hinic3.a.p -Idrivers -I../drivers -Idrivers/net/hinic3 -I../drivers/net/hinic3 -Idrivers/net/hinic3/base -I../drivers/net/hinic3/base -Idrivers/net/hinic3/htn_adapt -I../drivers/net/hinic3/htn_adapt -Idrivers/net/hinic3/stn_adapt -I../drivers/net/hinic3/stn_adapt -Ilib/ethdev -I../lib/ethdev -Ilib/eal/common -I../lib/eal/common -I. -I.. -Iconfig -I../config -Ilib/eal/include -I../lib/eal/include -Ilib/eal/linux/include -I../lib/eal/linux/include -Ilib/eal/x86/include -I../lib/eal/x86/include -I../kernel/linux -Ilib/eal -I../lib/eal -Ilib/kvargs -I../lib/kvargs -Ilib/log -I../lib/log -Ilib/metrics -I../lib/metrics -Ilib/telemetry -I../lib/telemetry -Ilib/argparse -I../lib/argparse -Ilib/net -I../lib/net -Ilib/mbuf -I../lib/mbuf -Ilib/mempool -I../lib/mempool -Ilib/ring -I../lib/ring -Ilib/meter -I../lib/meter -Idrivers/bus/pci -I../drivers/bus/pci -I../drivers/bus/pci/linux -Ilib/pci -I../lib/pci -Idrivers/bus/vdev -I../drivers/bus/vdev -fdiagnostics-color=always -D_FILE_OFFSET_BITS=64 -Wall -Winvalid-pch -Wextra -Werror -std=c11 -O3 -include rte_config.h -Wvla -Wcast-qual -Wdeprecated -Wformat -Wformat-nonliteral -Wformat-security -Wmissing-declarations -Wmissing-prototypes -Wnested-externs -Wold-style-definition -Wpointer-arith -Wshadow -Wsign-compare -Wstrict-prototypes -Wundef -Wwrite-strings -Wno-packed-not-aligned -Wno-missing-field-initializers -fzero-init-padding-bits=all -D_GNU_SOURCE -fPIC -march=native -mrtm -DALLOW_EXPERIMENTAL_API -DALLOW_INTERNAL_API -Wno-format-truncation -Wno-address-of-packed-member -DHW_CONVERT_ENDIAN -DRTE_COMPONENT_CLASS=pmd_net -DRTE_COMPONENT_NAME=hinic3 -DRTE_LOG_DEFAULT_LOGTYPE=pmd.net.hinic3 -MD -MQ drivers/libtmp_rte_net_hinic3.a.p/net_hinic3_hinic3_ethdev.c.o -MF drivers/libtmp_rte_net_hinic3.a.p/net_hinic3_hinic3_ethdev.c.o.d -o drivers/libtmp_rte_net_hinic3.a.p/net_hinic3_hinic3_ethdev.c.o -c ../drivers/net/hinic3/hinic3_ethdev.c
In file included from ../drivers/net/hinic3/hinic3_ethdev.c:21:
../drivers/net/hinic3/hinic3_tx.h:412:9: error: ‘IPV6_VERSION’ redefined [-Werror]
  412 | #define IPV6_VERSION 6
      |         ^~~~~~~~~~~~
In file included from ../lib/net/rte_ip4.h:28,
                 from ../lib/net/rte_ip.h:9,
                 from ../lib/ethdev/rte_flow.h:25,
                 from ../lib/ethdev/rte_eth_ctrl.h:11,
                 from ../lib/ethdev/rte_ethdev.h:1483,
                 from ../lib/ethdev/ethdev_driver.h:21,
                 from ../lib/ethdev/ethdev_pci.h:13,
                 from ../drivers/net/hinic3/hinic3_ethdev.c:4:
/usr/include/netinet/ip6.h:49:9: note: this is the location of the previous definition
   49 | #define IPV6_VERSION       0x60
      |         ^~~~~~~~~~~~
cc1: all warnings being treated as errors
ninja: build stopped




*Build Failed #7:
OS: Fedora44-64
Target: x86_64-native-linuxapp-clang
FAILED: drivers/libtmp_rte_net_hinic3.a.p/net_hinic3_hinic3_tx.c.o 
clang -Idrivers/libtmp_rte_net_hinic3.a.p -Idrivers -I../drivers -Idrivers/net/hinic3 -I../drivers/net/hinic3 -Idrivers/net/hinic3/base -I../drivers/net/hinic3/base -Idrivers/net/hinic3/htn_adapt -I../drivers/net/hinic3/htn_adapt -Idrivers/net/hinic3/stn_adapt -I../drivers/net/hinic3/stn_adapt -Ilib/ethdev -I../lib/ethdev -Ilib/eal/common -I../lib/eal/common -I. -I.. -Iconfig -I../config -Ilib/eal/include -I../lib/eal/include -Ilib/eal/linux/include -I../lib/eal/linux/include -Ilib/eal/x86/include -I../lib/eal/x86/include -I../kernel/linux -Ilib/eal -I../lib/eal -Ilib/kvargs -I../lib/kvargs -Ilib/log -I../lib/log -Ilib/metrics -I../lib/metrics -Ilib/telemetry -I../lib/telemetry -Ilib/argparse -I../lib/argparse -Ilib/net -I../lib/net -Ilib/mbuf -I../lib/mbuf -Ilib/mempool -I../lib/mempool -Ilib/ring -I../lib/ring -Ilib/meter -I../lib/meter -Idrivers/bus/pci -I../drivers/bus/pci -I../drivers/bus/pci/linux -Ilib/pci -I../lib/pci -Idrivers/bus/vdev -I../drivers/bus/vdev -fdiagnostics-color=always -D_FILE_OFFSET_BITS=64 -Wall -Winvalid-pch -Wextra -Werror -std=c11 -O3 -include rte_config.h -Wvla -Wcast-qual -Wcomma -Wdeprecated -Wformat -Wformat-nonliteral -Wformat-security -Wmissing-declarations -Wmissing-prototypes -Wnested-externs -Wold-style-definition -Wpointer-arith -Wshadow -Wsign-compare -Wstrict-prototypes -Wundef -Wwrite-strings -Wno-missing-field-initializers -D_GNU_SOURCE -fPIC -march=native -mrtm -DALLOW_EXPERIMENTAL_API -DALLOW_INTERNAL_API -Wno-format-truncation -Wno-address-of-packed-member -DHW_CONVERT_ENDIAN -DRTE_COMPONENT_CLASS=pmd_net -DRTE_COMPONENT_NAME=hinic3 -DRTE_LOG_DEFAULT_LOGTYPE=pmd.net.hinic3 -DRTE_ANNOTATE_LOCKS -Wthread-safety -MD -MQ drivers/libtmp_rte_net_hinic3.a.p/net_hinic3_hinic3_tx.c.o -MF drivers/libtmp_rte_net_hinic3.a.p/net_hinic3_hinic3_tx.c.o.d -o drivers/libtmp_rte_net_hinic3.a.p/net_hinic3_hinic3_tx.c.o -c ../drivers/net/hinic3/hinic3_tx.c
In file included from ../drivers/net/hinic3/hinic3_tx.c:10:
../drivers/net/hinic3/hinic3_tx.h:412:9: error: 'IPV6_VERSION' macro redefined [-Werror,-Wmacro-redefined]
  412 | #define IPV6_VERSION 6
      |         ^
/usr/include/netinet/ip6.h:49:9: note: previous definition is here
   49 | #define IPV6_VERSION       0x60
      |         ^
1 error generated.
[1640/3656] Compiling C object drivers/libtmp_rte_net_hinic.a.p/net_hinic_base_hinic_pmd_mbox.c.o
[1641/3656] Compiling C object drivers/libtmp_rte_net_hinic3.a.p/net_hinic3_base_hinic3_wq.c.o
[1642/3656] Compiling C object drivers/libtmp_rte_net_hinic3.a.p/net_hinic3_hinic3_flow.c.o
[1643/3656] Compiling C object drivers/libtmp_rte_net_hinic3.a.p/net_hinic3_hinic3_fdir.c.o
[1644/3656] Compiling C object drivers/libtmp_rte_net_hinic3.a.p/net_hinic3_htn_adapt_hinic3_htn_cmdq.c.o
[1645/3656] Compiling C object drivers/libtmp_rte_net_hinic3.a.p/net_hinic3_hinic3_nic_io.c.o
FAILED: drivers/libtmp_rte_net_hinic3.a.p/net_hinic3_hinic3_nic_io.c.o 
clang -Idrivers/libtmp_rte_net_hinic3.a.p -Idrivers -I../drivers -Idrivers/net/hinic3 -I../drivers/net/hinic3 -Idrivers/net/hinic3/base -I../drivers/net/hinic3/base -Idrivers/net/hinic3/htn_adapt -I../drivers/net/hinic3/htn_adapt -Idrivers/net/hinic3/stn_adapt -I../drivers/net/hinic3/stn_adapt -Ilib/ethdev -I../lib/ethdev -Ilib/eal/common -I../lib/eal/common -I. -I.. -Iconfig -I../config -Ilib/eal/include -I../lib/eal/include -Ilib/eal/linux/include -I../lib/eal/linux/include -Ilib/eal/x86/include -I../lib/eal/x86/include -I../kernel/linux -Ilib/eal -I../lib/eal -Ilib/kvargs -I../lib/kvargs -Ilib/log -I../lib/log -Ilib/metrics -I../lib/metrics -Ilib/telemetry -I../lib/telemetry -Ilib/argparse -I../lib/argparse -Ilib/net -I../lib/net -Ilib/mbuf -I../lib/mbuf -Ilib/mempool -I../lib/mempool -Ilib/ring -I../lib/ring -Ilib/meter -I../lib/meter -Idrivers/bus/pci -I../drivers/bus/pci -I../drivers/bus/pci/linux -Ilib/pci -I../lib/pci -Idrivers/bus/vdev -I../drivers/bus/vdev -fdiagnostics-color=always -D_FILE_OFFSET_BITS=64 -Wall -Winvalid-pch -Wextra -Werror -std=c11 -O3 -include rte_config.h -Wvla -Wcast-qual -Wcomma -Wdeprecated -Wformat -Wformat-nonliteral -Wformat-security -Wmissing-declarations -Wmissing-prototypes -Wnested-externs -Wold-style-definition -Wpointer-arith -Wshadow -Wsign-compare -Wstrict-prototypes -Wundef -Wwrite-strings -Wno-missing-field-initializers -D_GNU_SOURCE -fPIC -march=native -mrtm -DALLOW_EXPERIMENTAL_API -DALLOW_INTERNAL_API -Wno-format-truncation -Wno-address-of-packed-member -DHW_CONVERT_ENDIAN -DRTE_COMPONENT_CLASS=pmd_net -DRTE_COMPONENT_NAME=hinic3 -DRTE_LOG_DEFAULT_LOGTYPE=pmd.net.hinic3 -DRTE_ANNOTATE_LOCKS -Wthread-safety -MD -MQ drivers/libtmp_rte_net_hinic3.a.p/net_hinic3_hinic3_nic_io.c.o -MF drivers/libtmp_rte_net_hinic3.a.p/net_hinic3_hinic3_nic_io.c.o.d -o drivers/libtmp_rte_net_hinic3.a.p/net_hinic3_hinic3_nic_io.c.o -c ../drivers/net/hinic3/hinic3_nic_io.c
In file included from ../drivers/net/hinic3/hinic3_nic_io.c:12:
../drivers/net/hinic3/hinic3_tx.h:412:9: error: 'IPV6_VERSION' macro redefined [-Werror,-Wmacro-redefined]
  412 | #define IPV6_VERSION 6
      |         ^
/usr/include/netinet/ip6.h:49:9: note: previous definition is here
   49 | #define IPV6_VERSION       0x60
      |         ^
1 error generated.
[1646/3656] Compiling C object drivers/libtmp_rte_net_hinic3.a.p/net_hinic3_hinic3_rx.c.o
FAILED: drivers/libtmp_rte_net_hinic3.a.p/net_hinic3_hinic3_rx.c.o 
clang -Idrivers/libtmp_rte_net_hinic3.a.p -Idrivers -I../drivers -Idrivers/net/hinic3 -I../drivers/net/hinic3 -Idrivers/net/hinic3/base -I../drivers/net/hinic3/base -Idrivers/net/hinic3/htn_adapt -I../drivers/net/hinic3/htn_adapt -Idrivers/net/hinic3/stn_adapt -I../drivers/net/hinic3/stn_adapt -Ilib/ethdev -I../lib/ethdev -Ilib/eal/common -I../lib/eal/common -I. -I.. -Iconfig -I../config -Ilib/eal/include -I../lib/eal/include -Ilib/eal/linux/include -I../lib/eal/linux/include -Ilib/eal/x86/include -I../lib/eal/x86/include -I../kernel/linux -Ilib/eal -I../lib/eal -Ilib/kvargs -I../lib/kvargs -Ilib/log -I../lib/log -Ilib/metrics -I../lib/metrics -Ilib/telemetry -I../lib/telemetry -Ilib/argparse -I../lib/argparse -Ilib/net -I../lib/net -Ilib/mbuf -I../lib/mbuf -Ilib/mempool -I../lib/mempool -Ilib/ring -I../lib/ring -Ilib/meter -I../lib/meter -Idrivers/bus/pci -I../drivers/bus/pci -I../drivers/bus/pci/linux -Ilib/pci -I../lib/pci -Idrivers/bus/vdev -I../drivers/bus/vdev -fdiagnostics-color=always -D_FILE_OFFSET_BITS=64 -Wall -Winvalid-pch -Wextra -Werror -std=c11 -O3 -include rte_config.h -Wvla -Wcast-qual -Wcomma -Wdeprecated -Wformat -Wformat-nonliteral -Wformat-security -Wmissing-declarations -Wmissing-prototypes -Wnested-externs -Wold-style-definition -Wpointer-arith -Wshadow -Wsign-compare -Wstrict-prototypes -Wundef -Wwrite-strings -Wno-missing-field-initializers -D_GNU_SOURCE -fPIC -march=native -mrtm -DALLOW_EXPERIMENTAL_API -DALLOW_INTERNAL_API -Wno-format-truncation -Wno-address-of-packed-member -DHW_CONVERT_ENDIAN -DRTE_COMPONENT_CLASS=pmd_net -DRTE_COMPONENT_NAME=hinic3 -DRTE_LOG_DEFAULT_LOGTYPE=pmd.net.hinic3 -DRTE_ANNOTATE_LOCKS -Wthread-safety -MD -MQ drivers/libtmp_rte_net_hinic3.a.p/net_hinic3_hinic3_rx.c.o -MF drivers/libtmp_rte_net_hinic3.a.p/net_hinic3_hinic3_rx.c.o.d -o drivers/libtmp_rte_net_hinic3.a.p/net_hinic3_hinic3_rx.c.o -c ../drivers/net/hinic3/hinic3_rx.c
In file included from ../drivers/net/hinic3/hinic3_rx.c:15:
../drivers/net/hinic3/hinic3_tx.h:412:9: error: 'IPV6_VERSION' macro redefined [-Werror,-Wmacro-redefined]
  412 | #define IPV6_VERSION 6
      |         ^
/usr/include/netinet/ip6.h:49:9: note: previous definition is here
   49 | #define IPV6_VERSION       0x60
      |         ^
1 error generated.
[1647/3656] Compiling C object drivers/libtmp_rte_net_hinic3.a.p/net_hinic3_hinic3_ethdev.c.o
FAILED: drivers/libtmp_rte_net_hinic3.a.p/net_hinic3_hinic3_ethdev.c.o 
clang -Idrivers/libtmp_rte_net_hinic3.a.p -Idrivers -I../drivers -Idrivers/net/hinic3 -I../drivers/net/hinic3 -Idrivers/net/hinic3/base -I../drivers/net/hinic3/base -Idrivers/net/hinic3/htn_adapt -I../drivers/net/hinic3/htn_adapt -Idrivers/net/hinic3/stn_adapt -I../drivers/net/hinic3/stn_adapt -Ilib/ethdev -I../lib/ethdev -Ilib/eal/common -I../lib/eal/common -I. -I.. -Iconfig -I../config -Ilib/eal/include -I../lib/eal/include -Ilib/eal/linux/include -I../lib/eal/linux/include -Ilib/eal/x86/include -I../lib/eal/x86/include -I../kernel/linux -Ilib/eal -I../lib/eal -Ilib/kvargs -I../lib/kvargs -Ilib/log -I../lib/log -Ilib/metrics -I../lib/metrics -Ilib/telemetry -I../lib/telemetry -Ilib/argparse -I../lib/argparse -Ilib/net -I../lib/net -Ilib/mbuf -I../lib/mbuf -Ilib/mempool -I../lib/mempool -Ilib/ring -I../lib/ring -Ilib/meter -I../lib/meter -Idrivers/bus/pci -I../drivers/bus/pci -I../drivers/bus/pci/linux -Ilib/pci -I../lib/pci -Idrivers/bus/vdev -I../drivers/bus/vdev -fdiagnostics-color=always -D_FILE_OFFSET_BITS=64 -Wall -Winvalid-pch -Wextra -Werror -std=c11 -O3 -include rte_config.h -Wvla -Wcast-qual -Wcomma -Wdeprecated -Wformat -Wformat-nonliteral -Wformat-security -Wmissing-declarations -Wmissing-prototypes -Wnested-externs -Wold-style-definition -Wpointer-arith -Wshadow -Wsign-compare -Wstrict-prototypes -Wundef -Wwrite-strings -Wno-missing-field-initializers -D_GNU_SOURCE -fPIC -march=native -mrtm -DALLOW_EXPERIMENTAL_API -DALLOW_INTERNAL_API -Wno-format-truncation -Wno-address-of-packed-member -DHW_CONVERT_ENDIAN -DRTE_COMPONENT_CLASS=pmd_net -DRTE_COMPONENT_NAME=hinic3 -DRTE_LOG_DEFAULT_LOGTYPE=pmd.net.hinic3 -DRTE_ANNOTATE_LOCKS -Wthread-safety -MD -MQ drivers/libtmp_rte_net_hinic3.a.p/net_hinic3_hinic3_ethdev.c.o -MF drivers/libtmp_rte_net_hinic3.a.p/net_hinic3_hinic3_ethdev.c.o.d -o drivers/libtmp_rte_net_hinic3.a.p/net_hinic3_hinic3_ethdev.c.o -c ../drivers/net/hinic3/hinic3_ethdev.c
In file included from ../drivers/net/hinic3/hinic3_ethdev.c:21:
../drivers/net/hinic3/hinic3_tx.h:412:9: error: 'IPV6_VERSION' macro redefined [-Werror,-Wmacro-redefined]
  412 | #define IPV6_VERSION 6
      |         ^
/usr/include/netinet/ip6.h:49:9: note: previous definition is here
   49 | #define IPV6_VERSION       0x60
      |         ^
1 error generated.
[1648/3656] Compiling C object drivers/libtmp_rte_net_hinic3.a.p/net_hinic3_stn_adapt_hinic3_stn_cmdq.c.o
ninja: build stopped


DPDK STV team


More information about the test-report mailing list