compilation|FAILURE| pw(171196) sid(39610) job(PER_PATCH_BUILD20564)[13/13] net/ena: upgrade driver version to 2.15.0

sys_stv at intel.com sys_stv at intel.com
Tue Oct 13 17:41:32 CEST 2026


Test-Label: Intel-compilation
Test-Status: FAILURE
http://dpdk.org/patch/171196

_Compilation issues_

Submitter: Shai Brandes <shaibran at amazon.com>
Date: 2026-10-13 15:12:22
Reply_mail: <20261013151222.9874-1-shaibran at amazon.com>

DPDK git baseline: Repo:dpdk-next-net, CommitID: d129414711aa7c4954f997acf4c54338574a7d92


Meson Build Summary: 23 Builds Done, 22 Successful, 1 Failures, 0 Blocked

+-------------------+------------+--------------+------------+------------+-----------+----------+------------+
| os                | gcc-static | clang-static | icc-static | gcc-shared | gcc-debug | document | gcc-16byte |
+-------------------+------------+--------------+------------+------------+-----------+----------+------------+
| OpenAnolis8.10-64 | pass       |              |            |            |           |          |            |
| FreeBSD15-64      | pass       | pass         |            | pass       | pass      |          |            |
| RHEL9.8-64        | pass       | pass         |            | pass       | pass      |          |            |
| SUSE16-64         | pass       | pass         |            |            |           |          |            |
| AzureLinux4.0-64  | pass       |              |            |            |           |          |            |
| UB2604-32         | pass       |              |            |            |           |          |            |
| RHEL10.2-64       | pass       |              |            |            |           |          |            |
| UB2604-64         | pass       | pass         |            |            |           | pass     | pass       |
| RHEL10.2-64RT     | pass       |              |            |            |           |          |            |
| UB2404-64         | pass       |              |            |            |           |          |            |
| Fedora44-64       | fail       | pass         |            |            |           |          |            |
| OpenEuler2404-64  | pass       |              |            |            |           |          |            |
+-------------------+------------+--------------+------------+------------+-----------+----------+------------+

Comments: 
Because of DPDK bug (https://bugs.dpdk.org/show_bug.cgi?id=928),
All the dpdk-next-* branch add `Ddisable_drivers=event/cnxk` option when build with ICC complier. 
 
Test environment and configuration as below:


OS: OpenAnolis8.10-64
	Kernel Version: 5.10.134-18.an8.x86_64
	GCC Version: gcc (GCC) 8.5.0 20210514 (Anolis 8.5.0-24.0.1)
	Clang Version: 18.1.8 (Red Hat 18.1.8-1.0.1.module+an8.9.0+11287+9d0292d3)
	x86_64-native-linuxapp-gcc

OS: FreeBSD15-64
	Kernel Version: 15.1-RELEASE-p3
	GCC Version: gcc (FreeBSD Ports Collection) 14.2.0
	Clang Version: 19.1.7 (https://github.com/llvm/llvm-project.git llvmorg-19.1.7-0-gcd708029e0b2)
	x86_64-native-bsdapp-gcc
	x86_64-native-bsdapp-clang
	x86_64-native-bsdapp-gcc+shared
	x86_64-native-bsdapp-gcc+debug

OS: RHEL9.8-64
	Kernel Version: 5.14.0-687.5.3.el9_8.x86_64
	GCC Version: gcc (GCC) 11.5.0 20240719 (Red Hat 11.5.0-14)
	Clang Version: 21.1.8 (Red Hat, Inc. 21.1.8-2.el9)
	x86_64-native-linuxapp-gcc
	x86_64-native-linuxapp-clang
	x86_64-native-linuxapp-gcc+shared
	x86_64-native-linuxapp-gcc+debug

OS: SUSE16-64
	Kernel Version: 6.12.0-160000.26-default
	GCC Version: gcc (SUSE Linux) 15.2.0
	Clang Version: 19.1.7
	x86_64-native-linuxapp-clang
	x86_64-native-linuxapp-gcc

OS: AzureLinux4.0-64
	Kernel Version: 6.18.31-1.3.azl4.x86_64
	GCC Version: gcc (GCC) 15.2.1 20260123 (Red Hat 15.2.1-7)
	Clang Version: 21.1.8 (Microsoft Corporation 21.1.8-8.azl4)
	x86_64-native-linuxapp-gcc

OS: UB2604-32
	Kernel Version: 7.0.0-31-generic
	GCC Version: gcc (Ubuntu 15.2.0-16ubuntu1) 15.2.0
	Clang Version: 21.1.8 (6ubuntu1)
	i686-native-linuxapp-gcc

OS: RHEL10.2-64
	Kernel Version: 6.12.0-211.7.3.el10_2.x86_64
	GCC Version: gcc (GCC) 14.3.1 20251022 (Red Hat 14.3.1-4)
	Clang Version: 21.1.8 (Red Hat, Inc. 21.1.8-1.el10)
	x86_64-native-linuxapp-gcc

OS: UB2604-64
	Kernel Version: 7.0.0-31-generic
	GCC Version: gcc (Ubuntu 15.2.0-16ubuntu1) 15.2.0
	Clang Version: 21.1.8 (6ubuntu1)
	x86_64-native-linuxapp-gcc+16byte
	x86_64-native-linuxapp-gcc
	x86_64-native-linuxapp-clang
	x86_64-native-linuxapp-doc

OS: RHEL10.2-64RT
	Kernel Version: 6.12.0-211.7.3.el10_2.x86_64+rt
	GCC Version: gcc (GCC) 14.3.1 20251022 (Red Hat 14.3.1-4)
	Clang Version: 21.1.8 (Red Hat, Inc. 21.1.8-1.el10)
	x86_64-native-linuxapp-gcc

OS: UB2404-64
	Kernel Version: 6.8.0-139-generic
	GCC Version: gcc (Ubuntu 13.3.0-6ubuntu2~24.04.1) 13.3.0
	Clang Version: 18.1.3 (1ubuntu1)
	x86_64-native-linuxapp-gcc

OS: Fedora44-64
	Kernel Version: 6.19.10-300.fc44.x86_64
	GCC Version: gcc (GCC) 16.0.1 20260321 (Red Hat 16.0.1-0)
	Clang Version: 22.1.8 (Fedora 22.1.8-4.fc44)
	x86_64-native-linuxapp-gcc
	x86_64-native-linuxapp-clang

OS: OpenEuler2404-64
	Kernel Version: 6.6.0-159.4.13.167.oe2403sp4.x86_64
	GCC Version: gcc (GCC) 12.3.1 (openEuler 12.3.1-110.oe2403sp4)
	Clang Version: 17.0.6 ( 17.0.6-67.oe2403sp4)
	x86_64-native-linuxapp-gcc



*Build Failed #1:
OS: Fedora44-64
Target: x86_64-native-linuxapp-gcc
FAILED: drivers/libtmp_rte_net_ena.a.p/net_ena_base_ena_com.c.o 
gcc -Idrivers/libtmp_rte_net_ena.a.p -Idrivers -I../drivers -Idrivers/net/ena -I../drivers/net/ena -I../drivers/net/ena/base -I../drivers/net/ena/base/ena_defs -Ilib/ethdev -I../lib/ethdev -Ilib/eal/common -I../lib/eal/common -I. -I.. -Iconfig -I../config -Ilib/eal/include -I../lib/eal/include -Ilib/eal/linux/include -I../lib/eal/linux/include -Ilib/eal/x86/include -I../lib/eal/x86/include -I../kernel/linux -Ilib/eal -I../lib/eal -Ilib/kvargs -I../lib/kvargs -Ilib/log -I../lib/log -Ilib/metrics -I../lib/metrics -Ilib/telemetry -I../lib/telemetry -Ilib/argparse -I../lib/argparse -Ilib/net -I../lib/net -Ilib/mbuf -I../lib/mbuf -Ilib/mempool -I../lib/mempool -Ilib/ring -I../lib/ring -Ilib/meter -I../lib/meter -Idrivers/bus/pci -I../drivers/bus/pci -I../drivers/bus/pci/linux -Ilib/pci -I../lib/pci -Idrivers/bus/vdev -I../drivers/bus/vdev -Ilib/timer -I../lib/timer -fdiagnostics-color=always -D_FILE_OFFSET_BITS=64 -Wall -Winvalid-pch -Wextra -Werror -std=c11 -O3 -include rte_config.h -Wvla -Wcast-qual -Wdeprecated -Wformat -Wformat-nonliteral -Wformat-security -Wmissing-declarations -Wmissing-prototypes -Wnested-externs -Wold-style-definition -Wpointer-arith -Wshadow -Wsign-compare -Wstrict-prototypes -Wundef -Wwrite-strings -Wno-packed-not-aligned -Wno-missing-field-initializers -fzero-init-padding-bits=all -D_GNU_SOURCE -fPIC -march=native -mrtm -DALLOW_EXPERIMENTAL_API -DALLOW_INTERNAL_API -Wno-format-truncation -Wno-address-of-packed-member -Wno-shadow -DRTE_COMPONENT_CLASS=pmd_net -DRTE_COMPONENT_NAME=ena -DRTE_LOG_DEFAULT_LOGTYPE=pmd.net.ena -MD -MQ drivers/libtmp_rte_net_ena.a.p/net_ena_base_ena_com.c.o -MF drivers/libtmp_rte_net_ena.a.p/net_ena_base_ena_com.c.o.d -o drivers/libtmp_rte_net_ena.a.p/net_ena_base_ena_com.c.o -c ../drivers/net/ena/base/ena_com.c
In function ‘__ena_com_submit_admin_cmd’,
    inlined from ‘ena_com_submit_admin_cmd’ at ../drivers/net/ena/base/ena_com.c:320:13,
    inlined from ‘ena_com_execute_admin_command’ at ../drivers/net/ena/base/ena_com.c:718:13,
    inlined from ‘ena_com_execute_admin_command_no_resp’ at ../drivers/net/ena/base/ena_com.c:754:9,
    inlined from ‘ena_com_destroy_io_cq’ at ../drivers/net/ena/base/ena_com.c:1656:8:
../drivers/net/ena/base/ena_com.c:249:34: error: array subscript ‘struct ena_admin_aq_entry[0]’ is partly outside array bounds of ‘struct ena_admin_aq_destroy_cq_cmd[1]’ [-Werror=array-bounds=]
  249 |         cmd->aq_common_descriptor.flags |= admin_queue->sq.phase &
      |         ~~~~~~~~~~~~~~~~~~~~~~~~~^~~~~~
../drivers/net/ena/base/ena_com.c: In function ‘ena_com_destroy_io_cq’:
../drivers/net/ena/base/ena_com.c:1648:44: note: object ‘destroy_cmd’ of size 8
 1648 |         struct ena_admin_aq_destroy_cq_cmd destroy_cmd;
      |                                            ^~~~~~~~~~~
In function ‘__ena_com_submit_admin_cmd’,
    inlined from ‘ena_com_submit_admin_cmd’ at ../drivers/net/ena/base/ena_com.c:320:13,
    inlined from ‘ena_com_execute_admin_command’ at ../drivers/net/ena/base/ena_com.c:718:13,
    inlined from ‘ena_com_execute_admin_command_no_resp’ at ../drivers/net/ena/base/ena_com.c:754:9,
    inlined from ‘ena_com_destroy_io_cq’ at ../drivers/net/ena/base/ena_com.c:1656:8:
../drivers/net/ena/base/ena_com.c:249:41: error: array subscript ‘struct ena_admin_aq_entry[0]’ is partly outside array bounds of ‘struct ena_admin_aq_destroy_cq_cmd[1]’ [-Werror=array-bounds=]
  249 |         cmd->aq_common_descriptor.flags |= admin_queue->sq.phase &
../drivers/net/ena/base/ena_com.c: In function ‘ena_com_destroy_io_cq’:
../drivers/net/ena/base/ena_com.c:1648:44: note: object ‘destroy_cmd’ of size 8
 1648 |         struct ena_admin_aq_destroy_cq_cmd destroy_cmd;
      |                                            ^~~~~~~~~~~
In function ‘__ena_com_submit_admin_cmd’,
    inlined from ‘ena_com_submit_admin_cmd’ at ../drivers/net/ena/base/ena_com.c:320:13,
    inlined from ‘ena_com_execute_admin_command’ at ../drivers/net/ena/base/ena_com.c:718:13,
    inlined from ‘ena_com_execute_admin_command_no_resp’ at ../drivers/net/ena/base/ena_com.c:754:9,
    inlined from ‘ena_com_destroy_io_cq’ at ../drivers/net/ena/base/ena_com.c:1656:8:
../drivers/net/ena/base/ena_com.c:252:34: error: array subscript ‘struct ena_admin_aq_entry[0]’ is partly outside array bounds of ‘struct ena_admin_aq_destroy_cq_cmd[1]’ [-Werror=array-bounds=]
  252 |         cmd->aq_common_descriptor.command_id |= cmd_id &
      |         ~~~~~~~~~~~~~~~~~~~~~~~~~^~~~~~~~~~~
../drivers/net/ena/base/ena_com.c: In function ‘ena_com_destroy_io_cq’:
../drivers/net/ena/base/ena_com.c:1648:44: note: object ‘destroy_cmd’ of size 8
 1648 |         struct ena_admin_aq_destroy_cq_cmd destroy_cmd;
      |                                            ^~~~~~~~~~~
In function ‘__ena_com_submit_admin_cmd’,
    inlined from ‘ena_com_submit_admin_cmd’ at ../drivers/net/ena/base/ena_com.c:320:13,
    inlined from ‘ena_com_execute_admin_command’ at ../drivers/net/ena/base/ena_com.c:718:13,
    inlined from ‘ena_com_execute_admin_command_no_resp’ at ../drivers/net/ena/base/ena_com.c:754:9,
    inlined from ‘ena_com_destroy_io_cq’ at ../drivers/net/ena/base/ena_com.c:1656:8:
../drivers/net/ena/base/ena_com.c:252:46: error: array subscript ‘struct ena_admin_aq_entry[0]’ is partly outside array bounds of ‘struct ena_admin_aq_destroy_cq_cmd[1]’ [-Werror=array-bounds=]
  252 |         cmd->aq_common_descriptor.command_id |= cmd_id &
../drivers/net/ena/base/ena_com.c: In function ‘ena_com_destroy_io_cq’:
../drivers/net/ena/base/ena_com.c:1648:44: note: object ‘destroy_cmd’ of size 8
 1648 |         struct ena_admin_aq_destroy_cq_cmd destroy_cmd;
      |                                            ^~~~~~~~~~~
In function ‘__ena_com_submit_admin_cmd’,
    inlined from ‘ena_com_submit_admin_cmd’ at ../drivers/net/ena/base/ena_com.c:320:13,
    inlined from ‘ena_com_execute_admin_command’ at ../drivers/net/ena/base/ena_com.c:718:13,
    inlined from ‘ena_com_execute_admin_command_no_resp’ at ../drivers/net/ena/base/ena_com.c:754:9,
    inlined from ‘ena_com_destroy_io_cq’ at ../drivers/net/ena/base/ena_com.c:1656:8:
../drivers/net/ena/base/ena_com.c:262:57: error: array subscript ‘struct ena_admin_aq_entry[0]’ is partly outside array bounds of ‘struct ena_admin_aq_destroy_cq_cmd[1]’ [-Werror=array-bounds=]
  262 |         comp_ctx->cmd_opcode = cmd->aq_common_descriptor.opcode;
      |                                ~~~~~~~~~~~~~~~~~~~~~~~~~^~~~~~~
../drivers/net/ena/base/ena_com.c: In function ‘ena_com_destroy_io_cq’:
../drivers/net/ena/base/ena_com.c:1648:44: note: object ‘destroy_cmd’ of size 8
 1648 |         struct ena_admin_aq_destroy_cq_cmd destroy_cmd;
      |                                            ^~~~~~~~~~~
cc1: all warnings being treated as errors
[1524/3658] Compiling C object drivers/libtmp_rte_net_dpaa.a.p/net_dpaa_dpaa_rxtx.c.o
[1525/3658] Compiling C object drivers/libtmp_rte_net_enetc.a.p/net_enetc_enetc_ethdev.c.o
[1526/3658] Compiling C object drivers/libtmp_rte_net_enetfec.a.p/net_enetfec_enet_uio.c.o
[1527/3658] Compiling C object drivers/libtmp_rte_net_dpaa2.a.p/net_dpaa2_dpaa2_flow.c.o
[1528/3658] Compiling C object drivers/libtmp_rte_net_enetc.a.p/net_enetc_enetc4_ethdev.c.o
[1529/3658] Compiling C object drivers/libtmp_rte_net_enetc.a.p/net_enetc_enetc_rxtx.c.o
[1530/3658] Compiling C object drivers/libtmp_rte_net_enetc.a.p/net_enetc_enetc4_vf.c.o
[1531/3658] Compiling C object drivers/libtmp_rte_net_dpaa2.a.p/net_dpaa2_dpaa2_rxtx.c.o
[1532/3658] Compiling C object drivers/libtmp_rte_net_ena.a.p/net_ena_ena_ethdev.c.o
ninja: build stopped


DPDK STV team


More information about the test-report mailing list