compilation|FAILURE| pw(171285) sid(39632) job(PER_PATCH_BUILD20586)[v4, 4/4] test/crypto: add asym test suite for AESNI_MB

sys_stv at intel.com sys_stv at intel.com
Wed Oct 14 16:45:15 CEST 2026


Test-Label: Intel-compilation
Test-Status: FAILURE
http://dpdk.org/patch/171285

_Compilation issues_

Submitter: Radu Nicolau <radu.nicolau at intel.com>
Date: 2026-10-14 14:21:37
Reply_mail: <20261014142217.2117229-5-radu.nicolau at intel.com>

DPDK git baseline: Repo:dpdk-next-crypto, CommitID: 3129bfd6060a2ee64f196a09855597ac8adc68e6


Meson Build Summary: 23 Builds Done, 1 Successful, 22 Failures, 0 Blocked

+-------------------+------------+--------------+------------+------------+-----------+----------+------------+
| os                | gcc-static | clang-static | icc-static | gcc-shared | gcc-debug | document | gcc-16byte |
+-------------------+------------+--------------+------------+------------+-----------+----------+------------+
| OpenAnolis8.10-64 | fail       |              |            |            |           |          |            |
| FreeBSD15-64      | fail       | fail         |            | fail       | fail      |          |            |
| RHEL9.8-64        | fail       | fail         |            | fail       | fail      |          |            |
| SUSE16-64         | fail       | fail         |            |            |           |          |            |
| AzureLinux4.0-64  | fail       |              |            |            |           |          |            |
| UB2604-32         | pass       |              |            |            |           |          |            |
| RHEL10.2-64       | fail       |              |            |            |           |          |            |
| UB2604-64         | fail       | fail         |            |            |           | fail     | fail       |
| RHEL10.2-64RT     | fail       |              |            |            |           |          |            |
| UB2404-64         | fail       |              |            |            |           |          |            |
| Fedora44-64       | fail       | fail         |            |            |           |          |            |
| OpenEuler2404-64  | fail       |              |            |            |           |          |            |
+-------------------+------------+--------------+------------+------------+-----------+----------+------------+

Comments: 
Because of DPDK bug (https://bugs.dpdk.org/show_bug.cgi?id=928),
All the dpdk-next-* branch add `Ddisable_drivers=event/cnxk` option when build with ICC complier. 
 
Test environment and configuration as below:


OS: OpenAnolis8.10-64
	Kernel Version: 5.10.134-18.an8.x86_64
	GCC Version: gcc (GCC) 8.5.0 20210514 (Anolis 8.5.0-24.0.1)
	Clang Version: 18.1.8 (Red Hat 18.1.8-1.0.1.module+an8.9.0+11287+9d0292d3)
	x86_64-native-linuxapp-gcc

OS: FreeBSD15-64
	Kernel Version: 15.1-RELEASE-p3
	GCC Version: gcc (FreeBSD Ports Collection) 14.2.0
	Clang Version: 19.1.7 (https://github.com/llvm/llvm-project.git llvmorg-19.1.7-0-gcd708029e0b2)
	x86_64-native-bsdapp-gcc
	x86_64-native-bsdapp-clang
	x86_64-native-bsdapp-gcc+shared
	x86_64-native-bsdapp-gcc+debug

OS: RHEL9.8-64
	Kernel Version: 5.14.0-687.5.3.el9_8.x86_64
	GCC Version: gcc (GCC) 11.5.0 20240719 (Red Hat 11.5.0-14)
	Clang Version: 21.1.8 (Red Hat, Inc. 21.1.8-2.el9)
	x86_64-native-linuxapp-gcc
	x86_64-native-linuxapp-clang
	x86_64-native-linuxapp-gcc+shared
	x86_64-native-linuxapp-gcc+debug

OS: SUSE16-64
	Kernel Version: 6.12.0-160000.26-default
	GCC Version: gcc (SUSE Linux) 15.2.0
	Clang Version: 19.1.7
	x86_64-native-linuxapp-clang
	x86_64-native-linuxapp-gcc

OS: AzureLinux4.0-64
	Kernel Version: 6.18.31-1.3.azl4.x86_64
	GCC Version: gcc (GCC) 15.2.1 20260123 (Red Hat 15.2.1-7)
	Clang Version: 21.1.8 (Microsoft Corporation 21.1.8-8.azl4)
	x86_64-native-linuxapp-gcc

OS: UB2604-32
	Kernel Version: 7.0.0-31-generic
	GCC Version: gcc (Ubuntu 15.2.0-16ubuntu1) 15.2.0
	Clang Version: 21.1.8 (6ubuntu1)
	i686-native-linuxapp-gcc

OS: RHEL10.2-64
	Kernel Version: 6.12.0-211.7.3.el10_2.x86_64
	GCC Version: gcc (GCC) 14.3.1 20251022 (Red Hat 14.3.1-4)
	Clang Version: 21.1.8 (Red Hat, Inc. 21.1.8-1.el10)
	x86_64-native-linuxapp-gcc

OS: UB2604-64
	Kernel Version: 7.0.0-31-generic
	GCC Version: gcc (Ubuntu 15.2.0-16ubuntu1) 15.2.0
	Clang Version: 21.1.8 (6ubuntu1)
	x86_64-native-linuxapp-gcc+16byte
	x86_64-native-linuxapp-gcc
	x86_64-native-linuxapp-clang
	x86_64-native-linuxapp-doc

OS: RHEL10.2-64RT
	Kernel Version: 6.12.0-211.7.3.el10_2.x86_64+rt
	GCC Version: gcc (GCC) 14.3.1 20251022 (Red Hat 14.3.1-4)
	Clang Version: 21.1.8 (Red Hat, Inc. 21.1.8-1.el10)
	x86_64-native-linuxapp-gcc

OS: UB2404-64
	Kernel Version: 6.8.0-139-generic
	GCC Version: gcc (Ubuntu 13.3.0-6ubuntu2~24.04.1) 13.3.0
	Clang Version: 18.1.3 (1ubuntu1)
	x86_64-native-linuxapp-gcc

OS: Fedora44-64
	Kernel Version: 6.19.10-300.fc44.x86_64
	GCC Version: gcc (GCC) 16.0.1 20260321 (Red Hat 16.0.1-0)
	Clang Version: 22.1.8 (Fedora 22.1.8-4.fc44)
	x86_64-native-linuxapp-gcc
	x86_64-native-linuxapp-clang

OS: OpenEuler2404-64
	Kernel Version: 6.6.0-159.4.13.167.oe2403sp4.x86_64
	GCC Version: gcc (GCC) 12.3.1 (openEuler 12.3.1-110.oe2403sp4)
	Clang Version: 17.0.6 ( 17.0.6-67.oe2403sp4)
	x86_64-native-linuxapp-gcc



*Build Failed #1:
OS: OpenAnolis8.10-64
Target: x86_64-native-linuxapp-gcc
FAILED: drivers/libtmp_rte_crypto_ipsec_mb.a.p/crypto_ipsec_mb_ipsec_mb_ops.c.o 
gcc -Idrivers/libtmp_rte_crypto_ipsec_mb.a.p -Idrivers -I../drivers -Idrivers/crypto/ipsec_mb -I../drivers/crypto/ipsec_mb -Ilib/cryptodev -I../lib/cryptodev -Ilib/eal/common -I../lib/eal/common -I. -I.. -Iconfig -I../config -Ilib/eal/include -I../lib/eal/include -Ilib/eal/linux/include -I../lib/eal/linux/include -Ilib/eal/x86/include -I../lib/eal/x86/include -I../kernel/linux -Ilib/eal -I../lib/eal -Ilib/kvargs -I../lib/kvargs -Ilib/log -I../lib/log -Ilib/metrics -I../lib/metrics -Ilib/telemetry -I../lib/telemetry -Ilib/argparse -I../lib/argparse -Ilib/mbuf -I../lib/mbuf -Ilib/mempool -I../lib/mempool -Ilib/ring -I../lib/ring -Ilib/rcu -I../lib/rcu -Idrivers/bus/vdev -I../drivers/bus/vdev -Ilib/net -I../lib/net -Ilib/security -I../lib/security -fdiagnostics-color=always -D_FILE_OFFSET_BITS=64 -Wall -Winvalid-pch -Wextra -Werror -std=c11 -O3 -include rte_config.h -Wvla -Wcast-qual -Wdeprecated -Wformat -Wformat-nonliteral -Wformat-security -Wmissing-declarations -Wmissing-prototypes -Wnested-externs -Wold-style-definition -Wpointer-arith -Wshadow -Wsign-compare -Wstrict-prototypes -Wundef -Wwrite-strings -Wno-packed-not-aligned -Wno-missing-field-initializers -D_GNU_SOURCE -fPIC -march=native -mrtm -DALLOW_EXPERIMENTAL_API -DALLOW_INTERNAL_API -Wno-format-truncation -Wno-vla -DRTE_COMPONENT_CLASS=pmd_crypto -DRTE_COMPONENT_NAME=ipsec_mb -DRTE_LOG_DEFAULT_LOGTYPE=pmd.crypto.ipsec_mb -MD -MQ drivers/libtmp_rte_crypto_ipsec_mb.a.p/crypto_ipsec_mb_ipsec_mb_ops.c.o -MF drivers/libtmp_rte_crypto_ipsec_mb.a.p/crypto_ipsec_mb_ipsec_mb_ops.c.o.d -o drivers/libtmp_rte_crypto_ipsec_mb.a.p/crypto_ipsec_mb_ipsec_mb_ops.c.o -c ../drivers/crypto/ipsec_mb/ipsec_mb_ops.c
../drivers/crypto/ipsec_mb/ipsec_mb_ops.c: In function ‘ipsec_mb_asym_session_configure’:
../drivers/crypto/ipsec_mb/ipsec_mb_ops.c:479:4: error: ‘mb_mgr’ may be used uninitialized in this function [-Werror=maybe-uninitialized]
    free_mb_mgr(mb_mgr);
    ^~~~~~~~~~~~~~~~~~~
cc1: all warnings being treated as errors
[2757/3716] Generating drivers/rte_crypto_ionic.pmd.c with a custom command
[2758/3716] Compiling C object drivers/libtmp_rte_crypto_ipsec_mb.a.p/crypto_ipsec_mb_ipsec_mb_private.c.o
[2759/3716] Compiling C object drivers/libtmp_rte_crypto_ipsec_mb.a.p/crypto_ipsec_mb_pmd_aesni_gcm.c.o
[2760/3716] Compiling C object drivers/libtmp_rte_crypto_ipsec_mb.a.p/crypto_ipsec_mb_pmd_aesni_mb.c.o
[2761/3716] Compiling C object drivers/libtmp_rte_crypto_dpaa_sec.a.p/crypto_dpaa_sec_dpaa_sec.c.o
[2762/3716] Compiling C object drivers/libtmp_rte_crypto_dpaa2_sec.a.p/crypto_dpaa2_sec_dpaa2_sec_dpseci.c.o
[2763/3716] Compiling C object drivers/libtmp_rte_crypto_cnxk.a.p/crypto_cnxk_cn9k_cryptodev_ops.c.o
[2764/3716] Compiling C object drivers/libtmp_rte_crypto_cnxk.a.p/crypto_cnxk_cn20k_cryptodev_ops.c.o
[2765/3716] Compiling C object drivers/libtmp_rte_crypto_cnxk.a.p/crypto_cnxk_cn10k_cryptodev_ops.c.o
ninja: build stopped




*Build Failed #2:
OS: FreeBSD15-64
Target: x86_64-native-bsdapp-gcc
FAILED: [code=1] drivers/libtmp_rte_crypto_ipsec_mb.a.p/crypto_ipsec_mb_ipsec_mb_ops.c.o 
gcc -Idrivers/libtmp_rte_crypto_ipsec_mb.a.p -Idrivers -I../drivers -Idrivers/crypto/ipsec_mb -I../drivers/crypto/ipsec_mb -Ilib/cryptodev -I../lib/cryptodev -Ilib/eal/common -I../lib/eal/common -I. -I.. -Iconfig -I../config -Ilib/eal/include -I../lib/eal/include -Ilib/eal/freebsd/include -I../lib/eal/freebsd/include -Ilib/eal/x86/include -I../lib/eal/x86/include -Ilib/eal -I../lib/eal -Ilib/kvargs -I../lib/kvargs -Ilib/log -I../lib/log -Ilib/metrics -I../lib/metrics -Ilib/telemetry -I../lib/telemetry -Ilib/argparse -I../lib/argparse -Ilib/mbuf -I../lib/mbuf -Ilib/mempool -I../lib/mempool -Ilib/ring -I../lib/ring -Ilib/rcu -I../lib/rcu -Idrivers/bus/vdev -I../drivers/bus/vdev -Ilib/net -I../lib/net -Ilib/security -I../lib/security -fdiagnostics-color=always -D_FILE_OFFSET_BITS=64 -Wall -Winvalid-pch -Wextra -Werror -std=c11 -O3 -include rte_config.h -Wvla -Wcast-qual -Wdeprecated -Wformat -Wformat-nonliteral -Wformat-security -Wmissing-declarations -Wmissing-prototypes -Wnested-externs -Wold-style-definition -Wpointer-arith -Wshadow -Wsign-compare -Wstrict-prototypes -Wundef -Wwrite-strings -Wno-packed-not-aligned -Wno-missing-field-initializers -D_GNU_SOURCE -D__BSD_VISIBLE -fPIC -march=native -mno-avx512f -mrtm -DALLOW_EXPERIMENTAL_API -DALLOW_INTERNAL_API -Wno-format-truncation -Wno-address-of-packed-member -Wno-vla -DRTE_COMPONENT_CLASS=pmd_crypto -DRTE_COMPONENT_NAME=ipsec_mb -DRTE_LOG_DEFAULT_LOGTYPE=pmd.crypto.ipsec_mb -MD -MQ drivers/libtmp_rte_crypto_ipsec_mb.a.p/crypto_ipsec_mb_ipsec_mb_ops.c.o -MF drivers/libtmp_rte_crypto_ipsec_mb.a.p/crypto_ipsec_mb_ipsec_mb_ops.c.o.d -o drivers/libtmp_rte_crypto_ipsec_mb.a.p/crypto_ipsec_mb_ipsec_mb_ops.c.o -c ../drivers/crypto/ipsec_mb/ipsec_mb_ops.c
../drivers/crypto/ipsec_mb/ipsec_mb_ops.c: In function 'ipsec_mb_asym_session_configure':
../drivers/crypto/ipsec_mb/ipsec_mb_ops.c:473:12: error: 'mb_mgr' may be used uninitialized [-Werror=maybe-uninitialized]
  473 |         if (!mb_mgr)
      |            ^
../drivers/crypto/ipsec_mb/ipsec_mb_ops.c:467:18: note: 'mb_mgr' was declared here
  467 |         IMB_MGR *mb_mgr;
      |                  ^~~~~~
cc1: all warnings being treated as errors
[802/2245] Compiling C object drivers/libtmp_rte_crypto_ipsec_mb.a.p/crypto_ipsec_mb_pmd_aesni_mb.c.o
FAILED: [code=1] drivers/libtmp_rte_crypto_ipsec_mb.a.p/crypto_ipsec_mb_pmd_aesni_mb.c.o 
gcc -Idrivers/libtmp_rte_crypto_ipsec_mb.a.p -Idrivers -I../drivers -Idrivers/crypto/ipsec_mb -I../drivers/crypto/ipsec_mb -Ilib/cryptodev -I../lib/cryptodev -Ilib/eal/common -I../lib/eal/common -I. -I.. -Iconfig -I../config -Ilib/eal/include -I../lib/eal/include -Ilib/eal/freebsd/include -I../lib/eal/freebsd/include -Ilib/eal/x86/include -I../lib/eal/x86/include -Ilib/eal -I../lib/eal -Ilib/kvargs -I../lib/kvargs -Ilib/log -I../lib/log -Ilib/metrics -I../lib/metrics -Ilib/telemetry -I../lib/telemetry -Ilib/argparse -I../lib/argparse -Ilib/mbuf -I../lib/mbuf -Ilib/mempool -I../lib/mempool -Ilib/ring -I../lib/ring -Ilib/rcu -I../lib/rcu -Idrivers/bus/vdev -I../drivers/bus/vdev -Ilib/net -I../lib/net -Ilib/security -I../lib/security -fdiagnostics-color=always -D_FILE_OFFSET_BITS=64 -Wall -Winvalid-pch -Wextra -Werror -std=c11 -O3 -include rte_config.h -Wvla -Wcast-qual -Wdeprecated -Wformat -Wformat-nonliteral -Wformat-security -Wmissing-declarations -Wmissing-prototypes -Wnested-externs -Wold-style-definition -Wpointer-arith -Wshadow -Wsign-compare -Wstrict-prototypes -Wundef -Wwrite-strings -Wno-packed-not-aligned -Wno-missing-field-initializers -D_GNU_SOURCE -D__BSD_VISIBLE -fPIC -march=native -mno-avx512f -mrtm -DALLOW_EXPERIMENTAL_API -DALLOW_INTERNAL_API -Wno-format-truncation -Wno-address-of-packed-member -Wno-vla -DRTE_COMPONENT_CLASS=pmd_crypto -DRTE_COMPONENT_NAME=ipsec_mb -DRTE_LOG_DEFAULT_LOGTYPE=pmd.crypto.ipsec_mb -MD -MQ drivers/libtmp_rte_crypto_ipsec_mb.a.p/crypto_ipsec_mb_pmd_aesni_mb.c.o -MF drivers/libtmp_rte_crypto_ipsec_mb.a.p/crypto_ipsec_mb_pmd_aesni_mb.c.o.d -o drivers/libtmp_rte_crypto_ipsec_mb.a.p/crypto_ipsec_mb_pmd_aesni_mb.c.o -c ../drivers/crypto/ipsec_mb/pmd_aesni_mb.c
In file included from ../drivers/crypto/ipsec_mb/pmd_aesni_mb.c:7:
../drivers/crypto/ipsec_mb/pmd_aesni_mb_priv.h:1271:18: error: 'IMB_AUTH_SM3' undeclared here (not in a function); did you mean 'IMB_AUTH_NUM'?
 1271 |                 [IMB_AUTH_SM3]                  = 32,
      |                  ^~~~~~~~~~~~
      |                  IMB_AUTH_NUM
../drivers/crypto/ipsec_mb/pmd_aesni_mb_priv.h:1271:18: error: array index in initializer not of integer type
../drivers/crypto/ipsec_mb/pmd_aesni_mb_priv.h:1271:18: note: (near initialization for 'auth_digest_byte_lengths')
../drivers/crypto/ipsec_mb/pmd_aesni_mb_priv.h:1272:18: error: 'IMB_AUTH_HMAC_SM3' undeclared here (not in a function); did you mean 'IMB_AUTH_HMAC_SHA_1'?
 1272 |                 [IMB_AUTH_HMAC_SM3]             = 32,
      |                  ^~~~~~~~~~~~~~~~~
      |                  IMB_AUTH_HMAC_SHA_1
../drivers/crypto/ipsec_mb/pmd_aesni_mb_priv.h:1272:18: error: array index in initializer not of integer type
../drivers/crypto/ipsec_mb/pmd_aesni_mb_priv.h:1272:18: note: (near initialization for 'auth_digest_byte_lengths')
[803/2245] Compiling C object drivers/libtmp_rte_net_virtio.a.p/net_virtio_virtio_rxtx.c.o
[804/2245] Compiling C object drivers/libtmp_rte_crypto_null.a.p/crypto_null_null_crypto_pmd_ops.c.o
[805/2245] Compiling C object drivers/libtmp_rte_crypto_ipsec_mb.a.p/crypto_ipsec_mb_ipsec_mb_private.c.o
[806/2245] Compiling C object drivers/libtmp_rte_crypto_scheduler.a.p/crypto_scheduler_rte_cryptodev_scheduler.c.o
[807/2245] Compiling C object drivers/libtmp_rte_crypto_scheduler.a.p/crypto_scheduler_scheduler_failover.c.o
[808/2245] Compiling C object drivers/libtmp_rte_crypto_ipsec_mb.a.p/crypto_ipsec_mb_pmd_aesni_gcm.c.o
[809/2245] Compiling C object drivers/libtmp_rte_crypto_null.a.p/crypto_null_null_crypto_pmd.c.o
[810/2245] Compiling C object drivers/libtmp_rte_crypto_scheduler.a.p/crypto_scheduler_scheduler_multicore.c.o
ninja: build stopped




*Build Failed #3:
OS: FreeBSD15-64
Target: x86_64-native-bsdapp-clang
FAILED: [code=1] drivers/libtmp_rte_crypto_ipsec_mb.a.p/crypto_ipsec_mb_ipsec_mb_ops.c.o 
clang -Idrivers/libtmp_rte_crypto_ipsec_mb.a.p -Idrivers -I../drivers -Idrivers/crypto/ipsec_mb -I../drivers/crypto/ipsec_mb -Ilib/cryptodev -I../lib/cryptodev -Ilib/eal/common -I../lib/eal/common -I. -I.. -Iconfig -I../config -Ilib/eal/include -I../lib/eal/include -Ilib/eal/freebsd/include -I../lib/eal/freebsd/include -Ilib/eal/x86/include -I../lib/eal/x86/include -Ilib/eal -I../lib/eal -Ilib/kvargs -I../lib/kvargs -Ilib/log -I../lib/log -Ilib/metrics -I../lib/metrics -Ilib/telemetry -I../lib/telemetry -Ilib/argparse -I../lib/argparse -Ilib/mbuf -I../lib/mbuf -Ilib/mempool -I../lib/mempool -Ilib/ring -I../lib/ring -Ilib/rcu -I../lib/rcu -Idrivers/bus/vdev -I../drivers/bus/vdev -Ilib/net -I../lib/net -Ilib/security -I../lib/security -fdiagnostics-color=always -D_FILE_OFFSET_BITS=64 -Wall -Winvalid-pch -Wextra -Werror -std=c11 -O3 -include rte_config.h -Wvla -Wcast-qual -Wcomma -Wdeprecated -Wformat -Wformat-nonliteral -Wformat-security -Wmissing-declarations -Wmissing-prototypes -Wnested-externs -Wold-style-definition -Wpointer-arith -Wshadow -Wsign-compare -Wstrict-prototypes -Wundef -Wwrite-strings -Wno-missing-field-initializers -D_GNU_SOURCE -D__BSD_VISIBLE -fPIC -march=native -mrtm -DALLOW_EXPERIMENTAL_API -DALLOW_INTERNAL_API -Wno-format-truncation -Wno-address-of-packed-member -Wno-vla -DRTE_COMPONENT_CLASS=pmd_crypto -DRTE_COMPONENT_NAME=ipsec_mb -DRTE_LOG_DEFAULT_LOGTYPE=pmd.crypto.ipsec_mb -DRTE_ANNOTATE_LOCKS -Wthread-safety -MD -MQ drivers/libtmp_rte_crypto_ipsec_mb.a.p/crypto_ipsec_mb_ipsec_mb_ops.c.o -MF drivers/libtmp_rte_crypto_ipsec_mb.a.p/crypto_ipsec_mb_ipsec_mb_ops.c.o.d -o drivers/libtmp_rte_crypto_ipsec_mb.a.p/crypto_ipsec_mb_ipsec_mb_ops.c.o -c ../drivers/crypto/ipsec_mb/ipsec_mb_ops.c
../drivers/crypto/ipsec_mb/ipsec_mb_ops.c:470:6: error: variable 'mb_mgr' is used uninitialized whenever 'if' condition is false [-Werror,-Wsometimes-uninitialized]
  470 |         if (qp != NULL)
      |             ^~~~~~~~~~
../drivers/crypto/ipsec_mb/ipsec_mb_ops.c:473:7: note: uninitialized use occurs here
  473 |         if (!mb_mgr)
      |              ^~~~~~
../drivers/crypto/ipsec_mb/ipsec_mb_ops.c:470:2: note: remove the 'if' if its condition is always true
  470 |         if (qp != NULL)
      |         ^~~~~~~~~~~~~~~
  471 |                 mb_mgr = qp->mb_mgr;
../drivers/crypto/ipsec_mb/ipsec_mb_ops.c:467:17: note: initialize the variable 'mb_mgr' to silence this warning
  467 |         IMB_MGR *mb_mgr;
      |                        ^
      |                         = NULL
1 error generated.
[805/2266] Compiling C object drivers/libtmp_rte_crypto_ipsec_mb.a.p/crypto_ipsec_mb_pmd_aesni_mb.c.o
FAILED: [code=1] drivers/libtmp_rte_crypto_ipsec_mb.a.p/crypto_ipsec_mb_pmd_aesni_mb.c.o 
clang -Idrivers/libtmp_rte_crypto_ipsec_mb.a.p -Idrivers -I../drivers -Idrivers/crypto/ipsec_mb -I../drivers/crypto/ipsec_mb -Ilib/cryptodev -I../lib/cryptodev -Ilib/eal/common -I../lib/eal/common -I. -I.. -Iconfig -I../config -Ilib/eal/include -I../lib/eal/include -Ilib/eal/freebsd/include -I../lib/eal/freebsd/include -Ilib/eal/x86/include -I../lib/eal/x86/include -Ilib/eal -I../lib/eal -Ilib/kvargs -I../lib/kvargs -Ilib/log -I../lib/log -Ilib/metrics -I../lib/metrics -Ilib/telemetry -I../lib/telemetry -Ilib/argparse -I../lib/argparse -Ilib/mbuf -I../lib/mbuf -Ilib/mempool -I../lib/mempool -Ilib/ring -I../lib/ring -Ilib/rcu -I../lib/rcu -Idrivers/bus/vdev -I../drivers/bus/vdev -Ilib/net -I../lib/net -Ilib/security -I../lib/security -fdiagnostics-color=always -D_FILE_OFFSET_BITS=64 -Wall -Winvalid-pch -Wextra -Werror -std=c11 -O3 -include rte_config.h -Wvla -Wcast-qual -Wcomma -Wdeprecated -Wformat -Wformat-nonliteral -Wformat-security -Wmissing-declarations -Wmissing-prototypes -Wnested-externs -Wold-style-definition -Wpointer-arith -Wshadow -Wsign-compare -Wstrict-prototypes -Wundef -Wwrite-strings -Wno-missing-field-initializers -D_GNU_SOURCE -D__BSD_VISIBLE -fPIC -march=native -mrtm -DALLOW_EXPERIMENTAL_API -DALLOW_INTERNAL_API -Wno-format-truncation -Wno-address-of-packed-member -Wno-vla -DRTE_COMPONENT_CLASS=pmd_crypto -DRTE_COMPONENT_NAME=ipsec_mb -DRTE_LOG_DEFAULT_LOGTYPE=pmd.crypto.ipsec_mb -DRTE_ANNOTATE_LOCKS -Wthread-safety -MD -MQ drivers/libtmp_rte_crypto_ipsec_mb.a.p/crypto_ipsec_mb_pmd_aesni_mb.c.o -MF drivers/libtmp_rte_crypto_ipsec_mb.a.p/crypto_ipsec_mb_pmd_aesni_mb.c.o.d -o drivers/libtmp_rte_crypto_ipsec_mb.a.p/crypto_ipsec_mb_pmd_aesni_mb.c.o -c ../drivers/crypto/ipsec_mb/pmd_aesni_mb.c
In file included from ../drivers/crypto/ipsec_mb/pmd_aesni_mb.c:7:
../drivers/crypto/ipsec_mb/pmd_aesni_mb_priv.h:1271:4: error: use of undeclared identifier 'IMB_AUTH_SM3'
 1271 |                 [IMB_AUTH_SM3]                  = 32,
      |                  ^
../drivers/crypto/ipsec_mb/pmd_aesni_mb_priv.h:1272:4: error: use of undeclared identifier 'IMB_AUTH_HMAC_SM3'; did you mean 'IMB_AUTH_HMAC_SHA_1'?
 1272 |                 [IMB_AUTH_HMAC_SM3]             = 32,
      |                  ^~~~~~~~~~~~~~~~~
      |                  IMB_AUTH_HMAC_SHA_1
/usr/include/intel-ipsec-mb.h:294:9: note: 'IMB_AUTH_HMAC_SHA_1' declared here
  294 |         IMB_AUTH_HMAC_SHA_1 = 1,    /**< HMAC-SHA1 */
      |         ^
2 errors generated.
[806/2266] Compiling C object drivers/libtmp_rte_crypto_ipsec_mb.a.p/crypto_ipsec_mb_ipsec_mb_private.c.o
[807/2266] Compiling C object drivers/libtmp_rte_crypto_null.a.p/crypto_null_null_crypto_pmd_ops.c.o
[808/2266] Compiling C object drivers/libtmp_rte_crypto_null.a.p/crypto_null_null_crypto_pmd.c.o
[809/2266] Compiling C object drivers/libtmp_rte_crypto_ipsec_mb.a.p/crypto_ipsec_mb_pmd_aesni_gcm.c.o
[810/2266] Compiling C object drivers/libtmp_rte_crypto_scheduler.a.p/crypto_scheduler_scheduler_failover.c.o
[811/2266] Compiling C object drivers/libtmp_rte_crypto_scheduler.a.p/crypto_scheduler_rte_cryptodev_scheduler.c.o
[812/2266] Compiling C object drivers/libtmp_rte_crypto_scheduler.a.p/crypto_scheduler_scheduler_pkt_size_distr.c.o
[813/2266] Compiling C object drivers/libtmp_rte_crypto_scheduler.a.p/crypto_scheduler_scheduler_multicore.c.o
ninja: build stopped




*Build Failed #4:
OS: FreeBSD15-64
Target: x86_64-native-bsdapp-gcc+shared
FAILED: [code=1] drivers/libtmp_rte_crypto_ipsec_mb.a.p/crypto_ipsec_mb_pmd_aesni_mb.c.o 
gcc -Idrivers/libtmp_rte_crypto_ipsec_mb.a.p -Idrivers -I../drivers -Idrivers/crypto/ipsec_mb -I../drivers/crypto/ipsec_mb -Ilib/cryptodev -I../lib/cryptodev -Ilib/eal/common -I../lib/eal/common -I. -I.. -Iconfig -I../config -Ilib/eal/include -I../lib/eal/include -Ilib/eal/freebsd/include -I../lib/eal/freebsd/include -Ilib/eal/x86/include -I../lib/eal/x86/include -Ilib/eal -I../lib/eal -Ilib/kvargs -I../lib/kvargs -Ilib/log -I../lib/log -Ilib/metrics -I../lib/metrics -Ilib/telemetry -I../lib/telemetry -Ilib/argparse -I../lib/argparse -Ilib/mbuf -I../lib/mbuf -Ilib/mempool -I../lib/mempool -Ilib/ring -I../lib/ring -Ilib/rcu -I../lib/rcu -Idrivers/bus/vdev -I../drivers/bus/vdev -Ilib/net -I../lib/net -Ilib/security -I../lib/security -fdiagnostics-color=always -D_FILE_OFFSET_BITS=64 -Wall -Winvalid-pch -Wextra -Werror -std=c11 -O3 -include rte_config.h -Wvla -Wcast-qual -Wdeprecated -Wformat -Wformat-nonliteral -Wformat-security -Wmissing-declarations -Wmissing-prototypes -Wnested-externs -Wold-style-definition -Wpointer-arith -Wshadow -Wsign-compare -Wstrict-prototypes -Wundef -Wwrite-strings -Wno-packed-not-aligned -Wno-missing-field-initializers -D_GNU_SOURCE -D__BSD_VISIBLE -fPIC -march=native -mno-avx512f -mrtm -DALLOW_EXPERIMENTAL_API -DALLOW_INTERNAL_API -Wno-format-truncation -Wno-address-of-packed-member -Wno-vla -DRTE_COMPONENT_CLASS=pmd_crypto -DRTE_COMPONENT_NAME=ipsec_mb -DRTE_LOG_DEFAULT_LOGTYPE=pmd.crypto.ipsec_mb -MD -MQ drivers/libtmp_rte_crypto_ipsec_mb.a.p/crypto_ipsec_mb_pmd_aesni_mb.c.o -MF drivers/libtmp_rte_crypto_ipsec_mb.a.p/crypto_ipsec_mb_pmd_aesni_mb.c.o.d -o drivers/libtmp_rte_crypto_ipsec_mb.a.p/crypto_ipsec_mb_pmd_aesni_mb.c.o -c ../drivers/crypto/ipsec_mb/pmd_aesni_mb.c
In file included from ../drivers/crypto/ipsec_mb/pmd_aesni_mb.c:7:
../drivers/crypto/ipsec_mb/pmd_aesni_mb_priv.h:1271:18: error: 'IMB_AUTH_SM3' undeclared here (not in a function); did you mean 'IMB_AUTH_NUM'?
 1271 |                 [IMB_AUTH_SM3]                  = 32,
      |                  ^~~~~~~~~~~~
      |                  IMB_AUTH_NUM
../drivers/crypto/ipsec_mb/pmd_aesni_mb_priv.h:1271:18: error: array index in initializer not of integer type
../drivers/crypto/ipsec_mb/pmd_aesni_mb_priv.h:1271:18: note: (near initialization for 'auth_digest_byte_lengths')
../drivers/crypto/ipsec_mb/pmd_aesni_mb_priv.h:1272:18: error: 'IMB_AUTH_HMAC_SM3' undeclared here (not in a function); did you mean 'IMB_AUTH_HMAC_SHA_1'?
 1272 |                 [IMB_AUTH_HMAC_SM3]             = 32,
      |                  ^~~~~~~~~~~~~~~~~
      |                  IMB_AUTH_HMAC_SHA_1
../drivers/crypto/ipsec_mb/pmd_aesni_mb_priv.h:1272:18: error: array index in initializer not of integer type
../drivers/crypto/ipsec_mb/pmd_aesni_mb_priv.h:1272:18: note: (near initialization for 'auth_digest_byte_lengths')
[908/2122] Compiling C object drivers/libtmp_rte_net_vmxnet3.a.p/net_vmxnet3_vmxnet3_rxtx.c.o
[909/2122] Generating drivers/rte_crypto_scheduler.pmd.c with a custom command
[910/2122] Compiling C object drivers/libtmp_rte_crypto_ipsec_mb.a.p/crypto_ipsec_mb_ipsec_mb_private.c.o
[911/2122] Compiling C object drivers/libtmp_rte_crypto_ipsec_mb.a.p/crypto_ipsec_mb_ipsec_mb_ops.c.o
FAILED: [code=1] drivers/libtmp_rte_crypto_ipsec_mb.a.p/crypto_ipsec_mb_ipsec_mb_ops.c.o 
gcc -Idrivers/libtmp_rte_crypto_ipsec_mb.a.p -Idrivers -I../drivers -Idrivers/crypto/ipsec_mb -I../drivers/crypto/ipsec_mb -Ilib/cryptodev -I../lib/cryptodev -Ilib/eal/common -I../lib/eal/common -I. -I.. -Iconfig -I../config -Ilib/eal/include -I../lib/eal/include -Ilib/eal/freebsd/include -I../lib/eal/freebsd/include -Ilib/eal/x86/include -I../lib/eal/x86/include -Ilib/eal -I../lib/eal -Ilib/kvargs -I../lib/kvargs -Ilib/log -I../lib/log -Ilib/metrics -I../lib/metrics -Ilib/telemetry -I../lib/telemetry -Ilib/argparse -I../lib/argparse -Ilib/mbuf -I../lib/mbuf -Ilib/mempool -I../lib/mempool -Ilib/ring -I../lib/ring -Ilib/rcu -I../lib/rcu -Idrivers/bus/vdev -I../drivers/bus/vdev -Ilib/net -I../lib/net -Ilib/security -I../lib/security -fdiagnostics-color=always -D_FILE_OFFSET_BITS=64 -Wall -Winvalid-pch -Wextra -Werror -std=c11 -O3 -include rte_config.h -Wvla -Wcast-qual -Wdeprecated -Wformat -Wformat-nonliteral -Wformat-security -Wmissing-declarations -Wmissing-prototypes -Wnested-externs -Wold-style-definition -Wpointer-arith -Wshadow -Wsign-compare -Wstrict-prototypes -Wundef -Wwrite-strings -Wno-packed-not-aligned -Wno-missing-field-initializers -D_GNU_SOURCE -D__BSD_VISIBLE -fPIC -march=native -mno-avx512f -mrtm -DALLOW_EXPERIMENTAL_API -DALLOW_INTERNAL_API -Wno-format-truncation -Wno-address-of-packed-member -Wno-vla -DRTE_COMPONENT_CLASS=pmd_crypto -DRTE_COMPONENT_NAME=ipsec_mb -DRTE_LOG_DEFAULT_LOGTYPE=pmd.crypto.ipsec_mb -MD -MQ drivers/libtmp_rte_crypto_ipsec_mb.a.p/crypto_ipsec_mb_ipsec_mb_ops.c.o -MF drivers/libtmp_rte_crypto_ipsec_mb.a.p/crypto_ipsec_mb_ipsec_mb_ops.c.o.d -o drivers/libtmp_rte_crypto_ipsec_mb.a.p/crypto_ipsec_mb_ipsec_mb_ops.c.o -c ../drivers/crypto/ipsec_mb/ipsec_mb_ops.c
../drivers/crypto/ipsec_mb/ipsec_mb_ops.c: In function 'ipsec_mb_asym_session_configure':
../drivers/crypto/ipsec_mb/ipsec_mb_ops.c:473:12: error: 'mb_mgr' may be used uninitialized [-Werror=maybe-uninitialized]
  473 |         if (!mb_mgr)
      |            ^
../drivers/crypto/ipsec_mb/ipsec_mb_ops.c:467:18: note: 'mb_mgr' was declared here
  467 |         IMB_MGR *mb_mgr;
      |                  ^~~~~~
cc1: all warnings being treated as errors
[912/2122] Compiling C object drivers/libtmp_rte_raw_ntb.a.p/raw_ntb_ntb.c.o
[913/2122] Compiling C object drivers/libtmp_rte_crypto_null.a.p/crypto_null_null_crypto_pmd_ops.c.o
[914/2122] Compiling C object drivers/libtmp_rte_net_virtio.a.p/net_virtio_virtio_rxtx.c.o
[915/2122] Compiling C object drivers/libtmp_rte_crypto_ipsec_mb.a.p/crypto_ipsec_mb_pmd_aesni_gcm.c.o
[916/2122] Compiling C object drivers/libtmp_rte_crypto_null.a.p/crypto_null_null_crypto_pmd.c.o
ninja: build stopped




*Build Failed #5:
OS: FreeBSD15-64
Target: x86_64-native-bsdapp-gcc+debug
FAILED: [code=1] drivers/libtmp_rte_crypto_ipsec_mb.a.p/crypto_ipsec_mb_pmd_aesni_mb.c.o 
gcc -Idrivers/libtmp_rte_crypto_ipsec_mb.a.p -Idrivers -I../drivers -Idrivers/crypto/ipsec_mb -I../drivers/crypto/ipsec_mb -Ilib/cryptodev -I../lib/cryptodev -Ilib/eal/common -I../lib/eal/common -I. -I.. -Iconfig -I../config -Ilib/eal/include -I../lib/eal/include -Ilib/eal/freebsd/include -I../lib/eal/freebsd/include -Ilib/eal/x86/include -I../lib/eal/x86/include -Ilib/eal -I../lib/eal -Ilib/kvargs -I../lib/kvargs -Ilib/log -I../lib/log -Ilib/metrics -I../lib/metrics -Ilib/telemetry -I../lib/telemetry -Ilib/argparse -I../lib/argparse -Ilib/mbuf -I../lib/mbuf -Ilib/mempool -I../lib/mempool -Ilib/ring -I../lib/ring -Ilib/rcu -I../lib/rcu -Idrivers/bus/vdev -I../drivers/bus/vdev -Ilib/net -I../lib/net -Ilib/security -I../lib/security -fdiagnostics-color=always -D_FILE_OFFSET_BITS=64 -Wall -Winvalid-pch -Wextra -Werror -std=c11 -O2 -g -include rte_config.h -Wvla -Wcast-qual -Wdeprecated -Wformat -Wformat-nonliteral -Wformat-security -Wmissing-declarations -Wmissing-prototypes -Wnested-externs -Wold-style-definition -Wpointer-arith -Wshadow -Wsign-compare -Wstrict-prototypes -Wundef -Wwrite-strings -Wno-packed-not-aligned -Wno-missing-field-initializers -D_GNU_SOURCE -D__BSD_VISIBLE -fPIC -march=native -mno-avx512f -mrtm -DALLOW_EXPERIMENTAL_API -DALLOW_INTERNAL_API -Wno-format-truncation -Wno-address-of-packed-member -Wno-vla -DRTE_COMPONENT_CLASS=pmd_crypto -DRTE_COMPONENT_NAME=ipsec_mb -DRTE_LOG_DEFAULT_LOGTYPE=pmd.crypto.ipsec_mb -MD -MQ drivers/libtmp_rte_crypto_ipsec_mb.a.p/crypto_ipsec_mb_pmd_aesni_mb.c.o -MF drivers/libtmp_rte_crypto_ipsec_mb.a.p/crypto_ipsec_mb_pmd_aesni_mb.c.o.d -o drivers/libtmp_rte_crypto_ipsec_mb.a.p/crypto_ipsec_mb_pmd_aesni_mb.c.o -c ../drivers/crypto/ipsec_mb/pmd_aesni_mb.c
In file included from ../drivers/crypto/ipsec_mb/pmd_aesni_mb.c:7:
../drivers/crypto/ipsec_mb/pmd_aesni_mb_priv.h:1271:18: error: 'IMB_AUTH_SM3' undeclared here (not in a function); did you mean 'IMB_AUTH_NUM'?
 1271 |                 [IMB_AUTH_SM3]                  = 32,
      |                  ^~~~~~~~~~~~
      |                  IMB_AUTH_NUM
../drivers/crypto/ipsec_mb/pmd_aesni_mb_priv.h:1271:18: error: array index in initializer not of integer type
../drivers/crypto/ipsec_mb/pmd_aesni_mb_priv.h:1271:18: note: (near initialization for 'auth_digest_byte_lengths')
../drivers/crypto/ipsec_mb/pmd_aesni_mb_priv.h:1272:18: error: 'IMB_AUTH_HMAC_SM3' undeclared here (not in a function); did you mean 'IMB_AUTH_HMAC_SHA_1'?
 1272 |                 [IMB_AUTH_HMAC_SM3]             = 32,
      |                  ^~~~~~~~~~~~~~~~~
      |                  IMB_AUTH_HMAC_SHA_1
../drivers/crypto/ipsec_mb/pmd_aesni_mb_priv.h:1272:18: error: array index in initializer not of integer type
../drivers/crypto/ipsec_mb/pmd_aesni_mb_priv.h:1272:18: note: (near initialization for 'auth_digest_byte_lengths')
[803/2245] Compiling C object drivers/libtmp_rte_crypto_ipsec_mb.a.p/crypto_ipsec_mb_ipsec_mb_ops.c.o
FAILED: [code=1] drivers/libtmp_rte_crypto_ipsec_mb.a.p/crypto_ipsec_mb_ipsec_mb_ops.c.o 
gcc -Idrivers/libtmp_rte_crypto_ipsec_mb.a.p -Idrivers -I../drivers -Idrivers/crypto/ipsec_mb -I../drivers/crypto/ipsec_mb -Ilib/cryptodev -I../lib/cryptodev -Ilib/eal/common -I../lib/eal/common -I. -I.. -Iconfig -I../config -Ilib/eal/include -I../lib/eal/include -Ilib/eal/freebsd/include -I../lib/eal/freebsd/include -Ilib/eal/x86/include -I../lib/eal/x86/include -Ilib/eal -I../lib/eal -Ilib/kvargs -I../lib/kvargs -Ilib/log -I../lib/log -Ilib/metrics -I../lib/metrics -Ilib/telemetry -I../lib/telemetry -Ilib/argparse -I../lib/argparse -Ilib/mbuf -I../lib/mbuf -Ilib/mempool -I../lib/mempool -Ilib/ring -I../lib/ring -Ilib/rcu -I../lib/rcu -Idrivers/bus/vdev -I../drivers/bus/vdev -Ilib/net -I../lib/net -Ilib/security -I../lib/security -fdiagnostics-color=always -D_FILE_OFFSET_BITS=64 -Wall -Winvalid-pch -Wextra -Werror -std=c11 -O2 -g -include rte_config.h -Wvla -Wcast-qual -Wdeprecated -Wformat -Wformat-nonliteral -Wformat-security -Wmissing-declarations -Wmissing-prototypes -Wnested-externs -Wold-style-definition -Wpointer-arith -Wshadow -Wsign-compare -Wstrict-prototypes -Wundef -Wwrite-strings -Wno-packed-not-aligned -Wno-missing-field-initializers -D_GNU_SOURCE -D__BSD_VISIBLE -fPIC -march=native -mno-avx512f -mrtm -DALLOW_EXPERIMENTAL_API -DALLOW_INTERNAL_API -Wno-format-truncation -Wno-address-of-packed-member -Wno-vla -DRTE_COMPONENT_CLASS=pmd_crypto -DRTE_COMPONENT_NAME=ipsec_mb -DRTE_LOG_DEFAULT_LOGTYPE=pmd.crypto.ipsec_mb -MD -MQ drivers/libtmp_rte_crypto_ipsec_mb.a.p/crypto_ipsec_mb_ipsec_mb_ops.c.o -MF drivers/libtmp_rte_crypto_ipsec_mb.a.p/crypto_ipsec_mb_ipsec_mb_ops.c.o.d -o drivers/libtmp_rte_crypto_ipsec_mb.a.p/crypto_ipsec_mb_ipsec_mb_ops.c.o -c ../drivers/crypto/ipsec_mb/ipsec_mb_ops.c
../drivers/crypto/ipsec_mb/ipsec_mb_ops.c: In function 'ipsec_mb_asym_session_configure':
../drivers/crypto/ipsec_mb/ipsec_mb_ops.c:473:12: error: 'mb_mgr' may be used uninitialized [-Werror=maybe-uninitialized]
  473 |         if (!mb_mgr)
      |            ^
../drivers/crypto/ipsec_mb/ipsec_mb_ops.c:467:18: note: 'mb_mgr' was declared here
  467 |         IMB_MGR *mb_mgr;
      |                  ^~~~~~
cc1: all warnings being treated as errors
[804/2245] Compiling C object drivers/libtmp_rte_crypto_null.a.p/crypto_null_null_crypto_pmd_ops.c.o
[805/2245] Compiling C object drivers/libtmp_rte_crypto_ipsec_mb.a.p/crypto_ipsec_mb_ipsec_mb_private.c.o
[806/2245] Compiling C object drivers/libtmp_rte_crypto_scheduler.a.p/crypto_scheduler_rte_cryptodev_scheduler.c.o
[807/2245] Compiling C object drivers/libtmp_rte_crypto_scheduler.a.p/crypto_scheduler_scheduler_failover.c.o
[808/2245] Compiling C object drivers/libtmp_rte_crypto_ipsec_mb.a.p/crypto_ipsec_mb_pmd_aesni_gcm.c.o
[809/2245] Compiling C object drivers/libtmp_rte_crypto_scheduler.a.p/crypto_scheduler_scheduler_pkt_size_distr.c.o
[810/2245] Compiling C object drivers/libtmp_rte_crypto_null.a.p/crypto_null_null_crypto_pmd.c.o
[811/2245] Compiling C object drivers/libtmp_rte_crypto_scheduler.a.p/crypto_scheduler_scheduler_multicore.c.o
ninja: build stopped




*Build Failed #6:
OS: RHEL9.8-64
Target: x86_64-native-linuxapp-gcc
FAILED: drivers/libtmp_rte_crypto_ipsec_mb.a.p/crypto_ipsec_mb_ipsec_mb_ops.c.o 
gcc -Idrivers/libtmp_rte_crypto_ipsec_mb.a.p -Idrivers -I../drivers -Idrivers/crypto/ipsec_mb -I../drivers/crypto/ipsec_mb -Ilib/cryptodev -I../lib/cryptodev -Ilib/eal/common -I../lib/eal/common -I. -I.. -Iconfig -I../config -Ilib/eal/include -I../lib/eal/include -Ilib/eal/linux/include -I../lib/eal/linux/include -Ilib/eal/x86/include -I../lib/eal/x86/include -I../kernel/linux -Ilib/eal -I../lib/eal -Ilib/kvargs -I../lib/kvargs -Ilib/log -I../lib/log -Ilib/metrics -I../lib/metrics -Ilib/telemetry -I../lib/telemetry -Ilib/argparse -I../lib/argparse -Ilib/mbuf -I../lib/mbuf -Ilib/mempool -I../lib/mempool -Ilib/ring -I../lib/ring -Ilib/rcu -I../lib/rcu -Idrivers/bus/vdev -I../drivers/bus/vdev -Ilib/net -I../lib/net -Ilib/security -I../lib/security -fdiagnostics-color=always -D_FILE_OFFSET_BITS=64 -Wall -Winvalid-pch -Wextra -Werror -std=c11 -O3 -include rte_config.h -Wvla -Wcast-qual -Wdeprecated -Wformat -Wformat-nonliteral -Wformat-security -Wmissing-declarations -Wmissing-prototypes -Wnested-externs -Wold-style-definition -Wpointer-arith -Wshadow -Wsign-compare -Wstrict-prototypes -Wundef -Wwrite-strings -Wno-packed-not-aligned -Wno-missing-field-initializers -D_GNU_SOURCE -fPIC -march=native -mrtm -DALLOW_EXPERIMENTAL_API -DALLOW_INTERNAL_API -Wno-format-truncation -Wno-address-of-packed-member -Wno-vla -DRTE_COMPONENT_CLASS=pmd_crypto -DRTE_COMPONENT_NAME=ipsec_mb -DRTE_LOG_DEFAULT_LOGTYPE=pmd.crypto.ipsec_mb -MD -MQ drivers/libtmp_rte_crypto_ipsec_mb.a.p/crypto_ipsec_mb_ipsec_mb_ops.c.o -MF drivers/libtmp_rte_crypto_ipsec_mb.a.p/crypto_ipsec_mb_ipsec_mb_ops.c.o.d -o drivers/libtmp_rte_crypto_ipsec_mb.a.p/crypto_ipsec_mb_ipsec_mb_ops.c.o -c ../drivers/crypto/ipsec_mb/ipsec_mb_ops.c
../drivers/crypto/ipsec_mb/ipsec_mb_ops.c: In function ‘ipsec_mb_asym_session_configure’:
../drivers/crypto/ipsec_mb/ipsec_mb_ops.c:483:16: error: ‘mb_mgr’ may be used uninitialized in this function [-Werror=maybe-uninitialized]
  483 |         ret = (*pmd_data->asym_session_configure)(mb_mgr,
      |               ~^~~~~~~~~~~~~~~~~~~~~~~~~~~~~~~~~~~~~~~~~~
  484 |                         CRYPTODEV_GET_ASYM_SESS_PRIV(sess), xform);
      |                         ~~~~~~~~~~~~~~~~~~~~~~~~~~~~~~~~~~~~~~~~~~
cc1: all warnings being treated as errors
[2697/3657] Generating drivers/rte_crypto_ionic.pmd.c with a custom command
[2698/3657] Compiling C object drivers/libtmp_rte_crypto_ipsec_mb.a.p/crypto_ipsec_mb_ipsec_mb_private.c.o
[2699/3657] Compiling C object drivers/libtmp_rte_crypto_ipsec_mb.a.p/crypto_ipsec_mb_pmd_aesni_gcm.c.o
[2700/3657] Compiling C object drivers/libtmp_rte_crypto_ipsec_mb.a.p/crypto_ipsec_mb_pmd_aesni_mb.c.o
[2701/3657] Compiling C object drivers/libtmp_rte_crypto_dpaa_sec.a.p/crypto_dpaa_sec_dpaa_sec.c.o
[2702/3657] Compiling C object drivers/libtmp_rte_crypto_dpaa2_sec.a.p/crypto_dpaa2_sec_dpaa2_sec_dpseci.c.o
[2703/3657] Compiling C object drivers/libtmp_rte_crypto_cnxk.a.p/crypto_cnxk_cn9k_cryptodev_ops.c.o
[2704/3657] Compiling C object drivers/libtmp_rte_crypto_cnxk.a.p/crypto_cnxk_cn20k_cryptodev_ops.c.o
[2705/3657] Compiling C object drivers/libtmp_rte_crypto_cnxk.a.p/crypto_cnxk_cn10k_cryptodev_ops.c.o
ninja: build stopped




*Build Failed #7:
OS: RHEL9.8-64
Target: x86_64-native-linuxapp-clang
FAILED: drivers/libtmp_rte_crypto_ipsec_mb.a.p/crypto_ipsec_mb_ipsec_mb_ops.c.o 
clang -Idrivers/libtmp_rte_crypto_ipsec_mb.a.p -Idrivers -I../drivers -Idrivers/crypto/ipsec_mb -I../drivers/crypto/ipsec_mb -Ilib/cryptodev -I../lib/cryptodev -Ilib/eal/common -I../lib/eal/common -I. -I.. -Iconfig -I../config -Ilib/eal/include -I../lib/eal/include -Ilib/eal/linux/include -I../lib/eal/linux/include -Ilib/eal/x86/include -I../lib/eal/x86/include -I../kernel/linux -Ilib/eal -I../lib/eal -Ilib/kvargs -I../lib/kvargs -Ilib/log -I../lib/log -Ilib/metrics -I../lib/metrics -Ilib/telemetry -I../lib/telemetry -Ilib/argparse -I../lib/argparse -Ilib/mbuf -I../lib/mbuf -Ilib/mempool -I../lib/mempool -Ilib/ring -I../lib/ring -Ilib/rcu -I../lib/rcu -Idrivers/bus/vdev -I../drivers/bus/vdev -Ilib/net -I../lib/net -Ilib/security -I../lib/security -fdiagnostics-color=always -D_FILE_OFFSET_BITS=64 -Wall -Winvalid-pch -Wextra -Werror -std=c11 -O3 -include rte_config.h -Wvla -Wcast-qual -Wcomma -Wdeprecated -Wformat -Wformat-nonliteral -Wformat-security -Wmissing-declarations -Wmissing-prototypes -Wnested-externs -Wold-style-definition -Wpointer-arith -Wshadow -Wsign-compare -Wstrict-prototypes -Wundef -Wwrite-strings -Wno-missing-field-initializers -D_GNU_SOURCE -fPIC -march=native -mrtm -DALLOW_EXPERIMENTAL_API -DALLOW_INTERNAL_API -Wno-format-truncation -Wno-address-of-packed-member -Wno-vla -DRTE_COMPONENT_CLASS=pmd_crypto -DRTE_COMPONENT_NAME=ipsec_mb -DRTE_LOG_DEFAULT_LOGTYPE=pmd.crypto.ipsec_mb -DRTE_ANNOTATE_LOCKS -Wthread-safety -MD -MQ drivers/libtmp_rte_crypto_ipsec_mb.a.p/crypto_ipsec_mb_ipsec_mb_ops.c.o -MF drivers/libtmp_rte_crypto_ipsec_mb.a.p/crypto_ipsec_mb_ipsec_mb_ops.c.o.d -o drivers/libtmp_rte_crypto_ipsec_mb.a.p/crypto_ipsec_mb_ipsec_mb_ops.c.o -c ../drivers/crypto/ipsec_mb/ipsec_mb_ops.c
../drivers/crypto/ipsec_mb/ipsec_mb_ops.c:470:6: error: variable 'mb_mgr' is used uninitialized whenever 'if' condition is false [-Werror,-Wsometimes-uninitialized]
  470 |         if (qp != NULL)
      |             ^~~~~~~~~~
../drivers/crypto/ipsec_mb/ipsec_mb_ops.c:473:7: note: uninitialized use occurs here
  473 |         if (!mb_mgr)
      |              ^~~~~~
../drivers/crypto/ipsec_mb/ipsec_mb_ops.c:470:2: note: remove the 'if' if its condition is always true
  470 |         if (qp != NULL)
      |         ^~~~~~~~~~~~~~~
  471 |                 mb_mgr = qp->mb_mgr;
../drivers/crypto/ipsec_mb/ipsec_mb_ops.c:467:17: note: initialize the variable 'mb_mgr' to silence this warning
  467 |         IMB_MGR *mb_mgr;
      |                        ^
      |                         = NULL
1 error generated.
[2693/3657] Linking static target drivers/libtmp_rte_crypto_ionic.a
[2694/3657] Compiling C object drivers/libtmp_rte_crypto_dpaa2_sec.a.p/crypto_dpaa2_sec_dpaa2_sec_raw_dp.c.o
[2695/3657] Compiling C object drivers/libtmp_rte_crypto_ipsec_mb.a.p/crypto_ipsec_mb_ipsec_mb_private.c.o
[2696/3657] Compiling C object drivers/libtmp_rte_crypto_ipsec_mb.a.p/crypto_ipsec_mb_pmd_aesni_mb.c.o
[2697/3657] Compiling C object drivers/libtmp_rte_crypto_dpaa_sec.a.p/crypto_dpaa_sec_dpaa_sec.c.o
[2698/3657] Compiling C object drivers/libtmp_rte_crypto_dpaa2_sec.a.p/crypto_dpaa2_sec_dpaa2_sec_dpseci.c.o
[2699/3657] Compiling C object drivers/libtmp_rte_crypto_cnxk.a.p/crypto_cnxk_cn20k_cryptodev_ops.c.o
[2700/3657] Compiling C object drivers/libtmp_rte_crypto_cnxk.a.p/crypto_cnxk_cn9k_cryptodev_ops.c.o
[2701/3657] Compiling C object drivers/libtmp_rte_crypto_cnxk.a.p/crypto_cnxk_cn10k_cryptodev_ops.c.o
ninja: build stopped




*Build Failed #8:
OS: RHEL9.8-64
Target: x86_64-native-linuxapp-gcc+shared
FAILED: drivers/libtmp_rte_crypto_ipsec_mb.a.p/crypto_ipsec_mb_ipsec_mb_ops.c.o 
gcc -Idrivers/libtmp_rte_crypto_ipsec_mb.a.p -Idrivers -I../drivers -Idrivers/crypto/ipsec_mb -I../drivers/crypto/ipsec_mb -Ilib/cryptodev -I../lib/cryptodev -Ilib/eal/common -I../lib/eal/common -I. -I.. -Iconfig -I../config -Ilib/eal/include -I../lib/eal/include -Ilib/eal/linux/include -I../lib/eal/linux/include -Ilib/eal/x86/include -I../lib/eal/x86/include -I../kernel/linux -Ilib/eal -I../lib/eal -Ilib/kvargs -I../lib/kvargs -Ilib/log -I../lib/log -Ilib/metrics -I../lib/metrics -Ilib/telemetry -I../lib/telemetry -Ilib/argparse -I../lib/argparse -Ilib/mbuf -I../lib/mbuf -Ilib/mempool -I../lib/mempool -Ilib/ring -I../lib/ring -Ilib/rcu -I../lib/rcu -Idrivers/bus/vdev -I../drivers/bus/vdev -Ilib/net -I../lib/net -Ilib/security -I../lib/security -fdiagnostics-color=always -D_FILE_OFFSET_BITS=64 -Wall -Winvalid-pch -Wextra -Werror -std=c11 -O3 -include rte_config.h -Wvla -Wcast-qual -Wdeprecated -Wformat -Wformat-nonliteral -Wformat-security -Wmissing-declarations -Wmissing-prototypes -Wnested-externs -Wold-style-definition -Wpointer-arith -Wshadow -Wsign-compare -Wstrict-prototypes -Wundef -Wwrite-strings -Wno-packed-not-aligned -Wno-missing-field-initializers -D_GNU_SOURCE -fPIC -march=native -mrtm -DALLOW_EXPERIMENTAL_API -DALLOW_INTERNAL_API -Wno-format-truncation -Wno-address-of-packed-member -Wno-vla -DRTE_COMPONENT_CLASS=pmd_crypto -DRTE_COMPONENT_NAME=ipsec_mb -DRTE_LOG_DEFAULT_LOGTYPE=pmd.crypto.ipsec_mb -MD -MQ drivers/libtmp_rte_crypto_ipsec_mb.a.p/crypto_ipsec_mb_ipsec_mb_ops.c.o -MF drivers/libtmp_rte_crypto_ipsec_mb.a.p/crypto_ipsec_mb_ipsec_mb_ops.c.o.d -o drivers/libtmp_rte_crypto_ipsec_mb.a.p/crypto_ipsec_mb_ipsec_mb_ops.c.o -c ../drivers/crypto/ipsec_mb/ipsec_mb_ops.c
../drivers/crypto/ipsec_mb/ipsec_mb_ops.c: In function ‘ipsec_mb_asym_session_configure’:
../drivers/crypto/ipsec_mb/ipsec_mb_ops.c:483:16: error: ‘mb_mgr’ may be used uninitialized in this function [-Werror=maybe-uninitialized]
  483 |         ret = (*pmd_data->asym_session_configure)(mb_mgr,
      |               ~^~~~~~~~~~~~~~~~~~~~~~~~~~~~~~~~~~~~~~~~~~
  484 |                         CRYPTODEV_GET_ASYM_SESS_PRIV(sess), xform);
      |                         ~~~~~~~~~~~~~~~~~~~~~~~~~~~~~~~~~~~~~~~~~~
cc1: all warnings being treated as errors
[2723/3510] Generating drivers/rte_crypto_ionic.sym_chk with a custom command (wrapped by meson to capture output)
[2724/3510] Compiling C object drivers/libtmp_rte_crypto_ipsec_mb.a.p/crypto_ipsec_mb_ipsec_mb_private.c.o
[2725/3510] Compiling C object drivers/libtmp_rte_crypto_ipsec_mb.a.p/crypto_ipsec_mb_pmd_aesni_gcm.c.o
[2726/3510] Compiling C object drivers/libtmp_rte_crypto_ipsec_mb.a.p/crypto_ipsec_mb_pmd_aesni_mb.c.o
[2727/3510] Compiling C object drivers/libtmp_rte_crypto_dpaa_sec.a.p/crypto_dpaa_sec_dpaa_sec.c.o
[2728/3510] Compiling C object drivers/libtmp_rte_crypto_dpaa2_sec.a.p/crypto_dpaa2_sec_dpaa2_sec_dpseci.c.o
[2729/3510] Compiling C object drivers/libtmp_rte_crypto_cnxk.a.p/crypto_cnxk_cn9k_cryptodev_ops.c.o
[2730/3510] Compiling C object drivers/libtmp_rte_crypto_cnxk.a.p/crypto_cnxk_cn20k_cryptodev_ops.c.o
[2731/3510] Compiling C object drivers/libtmp_rte_crypto_cnxk.a.p/crypto_cnxk_cn10k_cryptodev_ops.c.o
ninja: build stopped




*Build Failed #9:
OS: RHEL9.8-64
Target: x86_64-native-linuxapp-gcc+debug
FAILED: drivers/libtmp_rte_crypto_ipsec_mb.a.p/crypto_ipsec_mb_ipsec_mb_ops.c.o 
gcc -Idrivers/libtmp_rte_crypto_ipsec_mb.a.p -Idrivers -I../drivers -Idrivers/crypto/ipsec_mb -I../drivers/crypto/ipsec_mb -Ilib/cryptodev -I../lib/cryptodev -Ilib/eal/common -I../lib/eal/common -I. -I.. -Iconfig -I../config -Ilib/eal/include -I../lib/eal/include -Ilib/eal/linux/include -I../lib/eal/linux/include -Ilib/eal/x86/include -I../lib/eal/x86/include -I../kernel/linux -Ilib/eal -I../lib/eal -Ilib/kvargs -I../lib/kvargs -Ilib/log -I../lib/log -Ilib/metrics -I../lib/metrics -Ilib/telemetry -I../lib/telemetry -Ilib/argparse -I../lib/argparse -Ilib/mbuf -I../lib/mbuf -Ilib/mempool -I../lib/mempool -Ilib/ring -I../lib/ring -Ilib/rcu -I../lib/rcu -Idrivers/bus/vdev -I../drivers/bus/vdev -Ilib/net -I../lib/net -Ilib/security -I../lib/security -fdiagnostics-color=always -D_FILE_OFFSET_BITS=64 -Wall -Winvalid-pch -Wextra -Werror -std=c11 -O2 -g -include rte_config.h -Wvla -Wcast-qual -Wdeprecated -Wformat -Wformat-nonliteral -Wformat-security -Wmissing-declarations -Wmissing-prototypes -Wnested-externs -Wold-style-definition -Wpointer-arith -Wshadow -Wsign-compare -Wstrict-prototypes -Wundef -Wwrite-strings -Wno-packed-not-aligned -Wno-missing-field-initializers -D_GNU_SOURCE -fPIC -march=native -mrtm -DALLOW_EXPERIMENTAL_API -DALLOW_INTERNAL_API -Wno-format-truncation -Wno-address-of-packed-member -Wno-vla -DRTE_COMPONENT_CLASS=pmd_crypto -DRTE_COMPONENT_NAME=ipsec_mb -DRTE_LOG_DEFAULT_LOGTYPE=pmd.crypto.ipsec_mb -MD -MQ drivers/libtmp_rte_crypto_ipsec_mb.a.p/crypto_ipsec_mb_ipsec_mb_ops.c.o -MF drivers/libtmp_rte_crypto_ipsec_mb.a.p/crypto_ipsec_mb_ipsec_mb_ops.c.o.d -o drivers/libtmp_rte_crypto_ipsec_mb.a.p/crypto_ipsec_mb_ipsec_mb_ops.c.o -c ../drivers/crypto/ipsec_mb/ipsec_mb_ops.c
../drivers/crypto/ipsec_mb/ipsec_mb_ops.c: In function ‘ipsec_mb_asym_session_configure’:
../drivers/crypto/ipsec_mb/ipsec_mb_ops.c:483:16: error: ‘mb_mgr’ may be used uninitialized in this function [-Werror=maybe-uninitialized]
  483 |         ret = (*pmd_data->asym_session_configure)(mb_mgr,
      |               ~^~~~~~~~~~~~~~~~~~~~~~~~~~~~~~~~~~~~~~~~~~
  484 |                         CRYPTODEV_GET_ASYM_SESS_PRIV(sess), xform);
      |                         ~~~~~~~~~~~~~~~~~~~~~~~~~~~~~~~~~~~~~~~~~~
cc1: all warnings being treated as errors
[2695/3657] Generating drivers/rte_crypto_ionic.pmd.c with a custom command
[2696/3657] Compiling C object drivers/libtmp_rte_crypto_ipsec_mb.a.p/crypto_ipsec_mb_ipsec_mb_private.c.o
[2697/3657] Compiling C object drivers/libtmp_rte_crypto_ipsec_mb.a.p/crypto_ipsec_mb_pmd_aesni_gcm.c.o
[2698/3657] Compiling C object drivers/libtmp_rte_crypto_ipsec_mb.a.p/crypto_ipsec_mb_pmd_aesni_mb.c.o
[2699/3657] Compiling C object drivers/libtmp_rte_crypto_dpaa_sec.a.p/crypto_dpaa_sec_dpaa_sec.c.o
[2700/3657] Compiling C object drivers/libtmp_rte_crypto_dpaa2_sec.a.p/crypto_dpaa2_sec_dpaa2_sec_dpseci.c.o
[2701/3657] Compiling C object drivers/libtmp_rte_crypto_cnxk.a.p/crypto_cnxk_cn9k_cryptodev_ops.c.o
[2702/3657] Compiling C object drivers/libtmp_rte_crypto_cnxk.a.p/crypto_cnxk_cn20k_cryptodev_ops.c.o
[2703/3657] Compiling C object drivers/libtmp_rte_crypto_cnxk.a.p/crypto_cnxk_cn10k_cryptodev_ops.c.o
ninja: build stopped




*Build Failed #10:
OS: SUSE16-64
Target: x86_64-native-linuxapp-clang
FAILED: drivers/libtmp_rte_crypto_ipsec_mb.a.p/crypto_ipsec_mb_ipsec_mb_ops.c.o 
clang -Idrivers/libtmp_rte_crypto_ipsec_mb.a.p -Idrivers -I../drivers -Idrivers/crypto/ipsec_mb -I../drivers/crypto/ipsec_mb -Ilib/cryptodev -I../lib/cryptodev -Ilib/eal/common -I../lib/eal/common -I. -I.. -Iconfig -I../config -Ilib/eal/include -I../lib/eal/include -Ilib/eal/linux/include -I../lib/eal/linux/include -Ilib/eal/x86/include -I../lib/eal/x86/include -I../kernel/linux -Ilib/eal -I../lib/eal -Ilib/kvargs -I../lib/kvargs -Ilib/log -I../lib/log -Ilib/metrics -I../lib/metrics -Ilib/telemetry -I../lib/telemetry -Ilib/argparse -I../lib/argparse -Ilib/mbuf -I../lib/mbuf -Ilib/mempool -I../lib/mempool -Ilib/ring -I../lib/ring -Ilib/rcu -I../lib/rcu -Idrivers/bus/vdev -I../drivers/bus/vdev -Ilib/net -I../lib/net -Ilib/security -I../lib/security -fdiagnostics-color=always -D_FILE_OFFSET_BITS=64 -Wall -Winvalid-pch -Wextra -Werror -std=c11 -O3 -include rte_config.h -Wvla -Wcast-qual -Wcomma -Wdeprecated -Wformat -Wformat-nonliteral -Wformat-security -Wmissing-declarations -Wmissing-prototypes -Wnested-externs -Wold-style-definition -Wpointer-arith -Wshadow -Wsign-compare -Wstrict-prototypes -Wundef -Wwrite-strings -Wno-missing-field-initializers -D_GNU_SOURCE -fPIC -march=native -mrtm -DALLOW_EXPERIMENTAL_API -DALLOW_INTERNAL_API -Wno-format-truncation -Wno-address-of-packed-member -Wno-vla -DRTE_COMPONENT_CLASS=pmd_crypto -DRTE_COMPONENT_NAME=ipsec_mb -DRTE_LOG_DEFAULT_LOGTYPE=pmd.crypto.ipsec_mb -DRTE_ANNOTATE_LOCKS -Wthread-safety -MD -MQ drivers/libtmp_rte_crypto_ipsec_mb.a.p/crypto_ipsec_mb_ipsec_mb_ops.c.o -MF drivers/libtmp_rte_crypto_ipsec_mb.a.p/crypto_ipsec_mb_ipsec_mb_ops.c.o.d -o drivers/libtmp_rte_crypto_ipsec_mb.a.p/crypto_ipsec_mb_ipsec_mb_ops.c.o -c ../drivers/crypto/ipsec_mb/ipsec_mb_ops.c
../drivers/crypto/ipsec_mb/ipsec_mb_ops.c:470:6: error: variable 'mb_mgr' is used uninitialized whenever 'if' condition is false [-Werror,-Wsometimes-uninitialized]
  470 |         if (qp != NULL)
      |             ^~~~~~~~~~
../drivers/crypto/ipsec_mb/ipsec_mb_ops.c:473:7: note: uninitialized use occurs here
  473 |         if (!mb_mgr)
      |              ^~~~~~
../drivers/crypto/ipsec_mb/ipsec_mb_ops.c:470:2: note: remove the 'if' if its condition is always true
  470 |         if (qp != NULL)
      |         ^~~~~~~~~~~~~~~
  471 |                 mb_mgr = qp->mb_mgr;
../drivers/crypto/ipsec_mb/ipsec_mb_ops.c:467:17: note: initialize the variable 'mb_mgr' to silence this warning
  467 |         IMB_MGR *mb_mgr;
      |                        ^
      |                         = NULL
1 error generated.
[2684/3639] Compiling C object drivers/libtmp_rte_crypto_ipsec_mb.a.p/crypto_ipsec_mb_ipsec_mb_private.c.o
[2685/3639] Generating drivers/rte_crypto_ionic.pmd.c with a custom command
[2686/3639] Compiling C object drivers/libtmp_rte_crypto_ipsec_mb.a.p/crypto_ipsec_mb_pmd_aesni_mb.c.o
FAILED: drivers/libtmp_rte_crypto_ipsec_mb.a.p/crypto_ipsec_mb_pmd_aesni_mb.c.o 
clang -Idrivers/libtmp_rte_crypto_ipsec_mb.a.p -Idrivers -I../drivers -Idrivers/crypto/ipsec_mb -I../drivers/crypto/ipsec_mb -Ilib/cryptodev -I../lib/cryptodev -Ilib/eal/common -I../lib/eal/common -I. -I.. -Iconfig -I../config -Ilib/eal/include -I../lib/eal/include -Ilib/eal/linux/include -I../lib/eal/linux/include -Ilib/eal/x86/include -I../lib/eal/x86/include -I../kernel/linux -Ilib/eal -I../lib/eal -Ilib/kvargs -I../lib/kvargs -Ilib/log -I../lib/log -Ilib/metrics -I../lib/metrics -Ilib/telemetry -I../lib/telemetry -Ilib/argparse -I../lib/argparse -Ilib/mbuf -I../lib/mbuf -Ilib/mempool -I../lib/mempool -Ilib/ring -I../lib/ring -Ilib/rcu -I../lib/rcu -Idrivers/bus/vdev -I../drivers/bus/vdev -Ilib/net -I../lib/net -Ilib/security -I../lib/security -fdiagnostics-color=always -D_FILE_OFFSET_BITS=64 -Wall -Winvalid-pch -Wextra -Werror -std=c11 -O3 -include rte_config.h -Wvla -Wcast-qual -Wcomma -Wdeprecated -Wformat -Wformat-nonliteral -Wformat-security -Wmissing-declarations -Wmissing-prototypes -Wnested-externs -Wold-style-definition -Wpointer-arith -Wshadow -Wsign-compare -Wstrict-prototypes -Wundef -Wwrite-strings -Wno-missing-field-initializers -D_GNU_SOURCE -fPIC -march=native -mrtm -DALLOW_EXPERIMENTAL_API -DALLOW_INTERNAL_API -Wno-format-truncation -Wno-address-of-packed-member -Wno-vla -DRTE_COMPONENT_CLASS=pmd_crypto -DRTE_COMPONENT_NAME=ipsec_mb -DRTE_LOG_DEFAULT_LOGTYPE=pmd.crypto.ipsec_mb -DRTE_ANNOTATE_LOCKS -Wthread-safety -MD -MQ drivers/libtmp_rte_crypto_ipsec_mb.a.p/crypto_ipsec_mb_pmd_aesni_mb.c.o -MF drivers/libtmp_rte_crypto_ipsec_mb.a.p/crypto_ipsec_mb_pmd_aesni_mb.c.o.d -o drivers/libtmp_rte_crypto_ipsec_mb.a.p/crypto_ipsec_mb_pmd_aesni_mb.c.o -c ../drivers/crypto/ipsec_mb/pmd_aesni_mb.c
In file included from ../drivers/crypto/ipsec_mb/pmd_aesni_mb.c:7:
../drivers/crypto/ipsec_mb/pmd_aesni_mb_priv.h:1271:4: error: use of undeclared identifier 'IMB_AUTH_SM3'
 1271 |                 [IMB_AUTH_SM3]                  = 32,
      |                  ^
../drivers/crypto/ipsec_mb/pmd_aesni_mb_priv.h:1272:4: error: use of undeclared identifier 'IMB_AUTH_HMAC_SM3'; did you mean 'IMB_AUTH_HMAC_SHA_1'?
 1272 |                 [IMB_AUTH_HMAC_SM3]             = 32,
      |                  ^~~~~~~~~~~~~~~~~
      |                  IMB_AUTH_HMAC_SHA_1
/usr/include/intel-ipsec-mb.h:294:9: note: 'IMB_AUTH_HMAC_SHA_1' declared here
  294 |         IMB_AUTH_HMAC_SHA_1 = 1,    /**< HMAC-SHA1 */
      |         ^
2 errors generated.
[2687/3639] Compiling C object drivers/libtmp_rte_crypto_ipsec_mb.a.p/crypto_ipsec_mb_pmd_aesni_gcm.c.o
[2688/3639] Compiling C object drivers/libtmp_rte_crypto_cnxk.a.p/crypto_cnxk_cn9k_cryptodev_ops.c.o
[2689/3639] Compiling C object drivers/libtmp_rte_crypto_cnxk.a.p/crypto_cnxk_cn20k_cryptodev_ops.c.o
[2690/3639] Compiling C object drivers/libtmp_rte_crypto_dpaa2_sec.a.p/crypto_dpaa2_sec_dpaa2_sec_dpseci.c.o
[2691/3639] Compiling C object drivers/libtmp_rte_crypto_dpaa_sec.a.p/crypto_dpaa_sec_dpaa_sec.c.o
[2692/3639] Compiling C object drivers/libtmp_rte_crypto_cnxk.a.p/crypto_cnxk_cn10k_cryptodev_ops.c.o
ninja: build stopped




*Build Failed #11:
OS: SUSE16-64
Target: x86_64-native-linuxapp-gcc
FAILED: drivers/libtmp_rte_crypto_ipsec_mb.a.p/crypto_ipsec_mb_ipsec_mb_ops.c.o 
gcc -Idrivers/libtmp_rte_crypto_ipsec_mb.a.p -Idrivers -I../drivers -Idrivers/crypto/ipsec_mb -I../drivers/crypto/ipsec_mb -Ilib/cryptodev -I../lib/cryptodev -Ilib/eal/common -I../lib/eal/common -I. -I.. -Iconfig -I../config -Ilib/eal/include -I../lib/eal/include -Ilib/eal/linux/include -I../lib/eal/linux/include -Ilib/eal/x86/include -I../lib/eal/x86/include -I../kernel/linux -Ilib/eal -I../lib/eal -Ilib/kvargs -I../lib/kvargs -Ilib/log -I../lib/log -Ilib/metrics -I../lib/metrics -Ilib/telemetry -I../lib/telemetry -Ilib/argparse -I../lib/argparse -Ilib/mbuf -I../lib/mbuf -Ilib/mempool -I../lib/mempool -Ilib/ring -I../lib/ring -Ilib/rcu -I../lib/rcu -Idrivers/bus/vdev -I../drivers/bus/vdev -Ilib/net -I../lib/net -Ilib/security -I../lib/security -fdiagnostics-color=always -D_FILE_OFFSET_BITS=64 -Wall -Winvalid-pch -Wextra -Werror -std=c11 -O3 -include rte_config.h -Wvla -Wcast-qual -Wdeprecated -Wformat -Wformat-nonliteral -Wformat-security -Wmissing-declarations -Wmissing-prototypes -Wnested-externs -Wold-style-definition -Wpointer-arith -Wshadow -Wsign-compare -Wstrict-prototypes -Wundef -Wwrite-strings -Wno-packed-not-aligned -Wno-missing-field-initializers -fzero-init-padding-bits=all -D_GNU_SOURCE -fPIC -march=native -mrtm -DALLOW_EXPERIMENTAL_API -DALLOW_INTERNAL_API -Wno-format-truncation -Wno-address-of-packed-member -Wno-vla -DRTE_COMPONENT_CLASS=pmd_crypto -DRTE_COMPONENT_NAME=ipsec_mb -DRTE_LOG_DEFAULT_LOGTYPE=pmd.crypto.ipsec_mb -MD -MQ drivers/libtmp_rte_crypto_ipsec_mb.a.p/crypto_ipsec_mb_ipsec_mb_ops.c.o -MF drivers/libtmp_rte_crypto_ipsec_mb.a.p/crypto_ipsec_mb_ipsec_mb_ops.c.o.d -o drivers/libtmp_rte_crypto_ipsec_mb.a.p/crypto_ipsec_mb_ipsec_mb_ops.c.o -c ../drivers/crypto/ipsec_mb/ipsec_mb_ops.c
../drivers/crypto/ipsec_mb/ipsec_mb_ops.c: In function ‘ipsec_mb_asym_session_configure’:
../drivers/crypto/ipsec_mb/ipsec_mb_ops.c:473:12: error: ‘mb_mgr’ may be used uninitialized [-Werror=maybe-uninitialized]
  473 |         if (!mb_mgr)
      |            ^
../drivers/crypto/ipsec_mb/ipsec_mb_ops.c:467:18: note: ‘mb_mgr’ was declared here
  467 |         IMB_MGR *mb_mgr;
      |                  ^~~~~~
cc1: all warnings being treated as errors
[2683/3639] Generating drivers/rte_crypto_ionic.pmd.c with a custom command
[2684/3639] Compiling C object drivers/libtmp_rte_crypto_ipsec_mb.a.p/crypto_ipsec_mb_pmd_aesni_mb.c.o
FAILED: drivers/libtmp_rte_crypto_ipsec_mb.a.p/crypto_ipsec_mb_pmd_aesni_mb.c.o 
gcc -Idrivers/libtmp_rte_crypto_ipsec_mb.a.p -Idrivers -I../drivers -Idrivers/crypto/ipsec_mb -I../drivers/crypto/ipsec_mb -Ilib/cryptodev -I../lib/cryptodev -Ilib/eal/common -I../lib/eal/common -I. -I.. -Iconfig -I../config -Ilib/eal/include -I../lib/eal/include -Ilib/eal/linux/include -I../lib/eal/linux/include -Ilib/eal/x86/include -I../lib/eal/x86/include -I../kernel/linux -Ilib/eal -I../lib/eal -Ilib/kvargs -I../lib/kvargs -Ilib/log -I../lib/log -Ilib/metrics -I../lib/metrics -Ilib/telemetry -I../lib/telemetry -Ilib/argparse -I../lib/argparse -Ilib/mbuf -I../lib/mbuf -Ilib/mempool -I../lib/mempool -Ilib/ring -I../lib/ring -Ilib/rcu -I../lib/rcu -Idrivers/bus/vdev -I../drivers/bus/vdev -Ilib/net -I../lib/net -Ilib/security -I../lib/security -fdiagnostics-color=always -D_FILE_OFFSET_BITS=64 -Wall -Winvalid-pch -Wextra -Werror -std=c11 -O3 -include rte_config.h -Wvla -Wcast-qual -Wdeprecated -Wformat -Wformat-nonliteral -Wformat-security -Wmissing-declarations -Wmissing-prototypes -Wnested-externs -Wold-style-definition -Wpointer-arith -Wshadow -Wsign-compare -Wstrict-prototypes -Wundef -Wwrite-strings -Wno-packed-not-aligned -Wno-missing-field-initializers -fzero-init-padding-bits=all -D_GNU_SOURCE -fPIC -march=native -mrtm -DALLOW_EXPERIMENTAL_API -DALLOW_INTERNAL_API -Wno-format-truncation -Wno-address-of-packed-member -Wno-vla -DRTE_COMPONENT_CLASS=pmd_crypto -DRTE_COMPONENT_NAME=ipsec_mb -DRTE_LOG_DEFAULT_LOGTYPE=pmd.crypto.ipsec_mb -MD -MQ drivers/libtmp_rte_crypto_ipsec_mb.a.p/crypto_ipsec_mb_pmd_aesni_mb.c.o -MF drivers/libtmp_rte_crypto_ipsec_mb.a.p/crypto_ipsec_mb_pmd_aesni_mb.c.o.d -o drivers/libtmp_rte_crypto_ipsec_mb.a.p/crypto_ipsec_mb_pmd_aesni_mb.c.o -c ../drivers/crypto/ipsec_mb/pmd_aesni_mb.c
In file included from ../drivers/crypto/ipsec_mb/pmd_aesni_mb.c:7:
../drivers/crypto/ipsec_mb/pmd_aesni_mb_priv.h:1271:18: error: ‘IMB_AUTH_SM3’ undeclared here (not in a function); did you mean ‘IMB_AUTH_NUM’?
 1271 |                 [IMB_AUTH_SM3]                  = 32,
      |                  ^~~~~~~~~~~~
      |                  IMB_AUTH_NUM
../drivers/crypto/ipsec_mb/pmd_aesni_mb_priv.h:1271:18: error: array index in initializer not of integer type
../drivers/crypto/ipsec_mb/pmd_aesni_mb_priv.h:1271:18: note: (near initialization for ‘auth_digest_byte_lengths’)
../drivers/crypto/ipsec_mb/pmd_aesni_mb_priv.h:1272:18: error: ‘IMB_AUTH_HMAC_SM3’ undeclared here (not in a function); did you mean ‘IMB_AUTH_HMAC_SHA_1’?
 1272 |                 [IMB_AUTH_HMAC_SM3]             = 32,
      |                  ^~~~~~~~~~~~~~~~~
      |                  IMB_AUTH_HMAC_SHA_1
../drivers/crypto/ipsec_mb/pmd_aesni_mb_priv.h:1272:18: error: array index in initializer not of integer type
../drivers/crypto/ipsec_mb/pmd_aesni_mb_priv.h:1272:18: note: (near initialization for ‘auth_digest_byte_lengths’)
[2685/3639] Compiling C object drivers/libtmp_rte_crypto_ipsec_mb.a.p/crypto_ipsec_mb_ipsec_mb_private.c.o
[2686/3639] Compiling C object drivers/libtmp_rte_crypto_ipsec_mb.a.p/crypto_ipsec_mb_pmd_aesni_gcm.c.o
[2687/3639] Compiling C object drivers/libtmp_rte_crypto_dpaa_sec.a.p/crypto_dpaa_sec_dpaa_sec.c.o
[2688/3639] Compiling C object drivers/libtmp_rte_crypto_dpaa2_sec.a.p/crypto_dpaa2_sec_dpaa2_sec_dpseci.c.o
[2689/3639] Compiling C object drivers/libtmp_rte_crypto_cnxk.a.p/crypto_cnxk_cn9k_cryptodev_ops.c.o
[2690/3639] Compiling C object drivers/libtmp_rte_crypto_cnxk.a.p/crypto_cnxk_cn20k_cryptodev_ops.c.o
[2691/3639] Compiling C object drivers/libtmp_rte_crypto_cnxk.a.p/crypto_cnxk_cn10k_cryptodev_ops.c.o
ninja: build stopped




*Build Failed #12:
OS: AzureLinux4.0-64
Target: x86_64-native-linuxapp-gcc
FAILED: drivers/libtmp_rte_crypto_ipsec_mb.a.p/crypto_ipsec_mb_ipsec_mb_ops.c.o 
gcc -Idrivers/libtmp_rte_crypto_ipsec_mb.a.p -Idrivers -I../drivers -Idrivers/crypto/ipsec_mb -I../drivers/crypto/ipsec_mb -Ilib/cryptodev -I../lib/cryptodev -Ilib/eal/common -I../lib/eal/common -I. -I.. -Iconfig -I../config -Ilib/eal/include -I../lib/eal/include -Ilib/eal/linux/include -I../lib/eal/linux/include -Ilib/eal/x86/include -I../lib/eal/x86/include -I../kernel/linux -Ilib/eal -I../lib/eal -Ilib/kvargs -I../lib/kvargs -Ilib/log -I../lib/log -Ilib/metrics -I../lib/metrics -Ilib/telemetry -I../lib/telemetry -Ilib/argparse -I../lib/argparse -Ilib/mbuf -I../lib/mbuf -Ilib/mempool -I../lib/mempool -Ilib/ring -I../lib/ring -Ilib/rcu -I../lib/rcu -Idrivers/bus/vdev -I../drivers/bus/vdev -Ilib/net -I../lib/net -Ilib/security -I../lib/security -fdiagnostics-color=always -D_FILE_OFFSET_BITS=64 -Wall -Winvalid-pch -Wextra -Werror -std=c11 -O3 -include rte_config.h -Wvla -Wcast-qual -Wdeprecated -Wformat -Wformat-nonliteral -Wformat-security -Wmissing-declarations -Wmissing-prototypes -Wnested-externs -Wold-style-definition -Wpointer-arith -Wshadow -Wsign-compare -Wstrict-prototypes -Wundef -Wwrite-strings -Wno-packed-not-aligned -Wno-missing-field-initializers -fzero-init-padding-bits=all -D_GNU_SOURCE -fPIC -march=native -mrtm -DALLOW_EXPERIMENTAL_API -DALLOW_INTERNAL_API -Wno-format-truncation -Wno-address-of-packed-member -Wno-vla -DRTE_COMPONENT_CLASS=pmd_crypto -DRTE_COMPONENT_NAME=ipsec_mb -DRTE_LOG_DEFAULT_LOGTYPE=pmd.crypto.ipsec_mb -MD -MQ drivers/libtmp_rte_crypto_ipsec_mb.a.p/crypto_ipsec_mb_ipsec_mb_ops.c.o -MF drivers/libtmp_rte_crypto_ipsec_mb.a.p/crypto_ipsec_mb_ipsec_mb_ops.c.o.d -o drivers/libtmp_rte_crypto_ipsec_mb.a.p/crypto_ipsec_mb_ipsec_mb_ops.c.o -c ../drivers/crypto/ipsec_mb/ipsec_mb_ops.c
../drivers/crypto/ipsec_mb/ipsec_mb_ops.c: In function ‘ipsec_mb_asym_session_configure’:
../drivers/crypto/ipsec_mb/ipsec_mb_ops.c:473:12: error: ‘mb_mgr’ may be used uninitialized [-Werror=maybe-uninitialized]
  473 |         if (!mb_mgr)
      |            ^
../drivers/crypto/ipsec_mb/ipsec_mb_ops.c:467:18: note: ‘mb_mgr’ was declared here
  467 |         IMB_MGR *mb_mgr;
      |                  ^~~~~~
cc1: all warnings being treated as errors
[2696/3657] Generating drivers/rte_crypto_ionic.pmd.c with a custom command
[2697/3657] Compiling C object drivers/libtmp_rte_crypto_ipsec_mb.a.p/crypto_ipsec_mb_pmd_aesni_mb.c.o
FAILED: drivers/libtmp_rte_crypto_ipsec_mb.a.p/crypto_ipsec_mb_pmd_aesni_mb.c.o 
gcc -Idrivers/libtmp_rte_crypto_ipsec_mb.a.p -Idrivers -I../drivers -Idrivers/crypto/ipsec_mb -I../drivers/crypto/ipsec_mb -Ilib/cryptodev -I../lib/cryptodev -Ilib/eal/common -I../lib/eal/common -I. -I.. -Iconfig -I../config -Ilib/eal/include -I../lib/eal/include -Ilib/eal/linux/include -I../lib/eal/linux/include -Ilib/eal/x86/include -I../lib/eal/x86/include -I../kernel/linux -Ilib/eal -I../lib/eal -Ilib/kvargs -I../lib/kvargs -Ilib/log -I../lib/log -Ilib/metrics -I../lib/metrics -Ilib/telemetry -I../lib/telemetry -Ilib/argparse -I../lib/argparse -Ilib/mbuf -I../lib/mbuf -Ilib/mempool -I../lib/mempool -Ilib/ring -I../lib/ring -Ilib/rcu -I../lib/rcu -Idrivers/bus/vdev -I../drivers/bus/vdev -Ilib/net -I../lib/net -Ilib/security -I../lib/security -fdiagnostics-color=always -D_FILE_OFFSET_BITS=64 -Wall -Winvalid-pch -Wextra -Werror -std=c11 -O3 -include rte_config.h -Wvla -Wcast-qual -Wdeprecated -Wformat -Wformat-nonliteral -Wformat-security -Wmissing-declarations -Wmissing-prototypes -Wnested-externs -Wold-style-definition -Wpointer-arith -Wshadow -Wsign-compare -Wstrict-prototypes -Wundef -Wwrite-strings -Wno-packed-not-aligned -Wno-missing-field-initializers -fzero-init-padding-bits=all -D_GNU_SOURCE -fPIC -march=native -mrtm -DALLOW_EXPERIMENTAL_API -DALLOW_INTERNAL_API -Wno-format-truncation -Wno-address-of-packed-member -Wno-vla -DRTE_COMPONENT_CLASS=pmd_crypto -DRTE_COMPONENT_NAME=ipsec_mb -DRTE_LOG_DEFAULT_LOGTYPE=pmd.crypto.ipsec_mb -MD -MQ drivers/libtmp_rte_crypto_ipsec_mb.a.p/crypto_ipsec_mb_pmd_aesni_mb.c.o -MF drivers/libtmp_rte_crypto_ipsec_mb.a.p/crypto_ipsec_mb_pmd_aesni_mb.c.o.d -o drivers/libtmp_rte_crypto_ipsec_mb.a.p/crypto_ipsec_mb_pmd_aesni_mb.c.o -c ../drivers/crypto/ipsec_mb/pmd_aesni_mb.c
In file included from ../drivers/crypto/ipsec_mb/pmd_aesni_mb.c:7:
../drivers/crypto/ipsec_mb/pmd_aesni_mb_priv.h:1271:18: error: ‘IMB_AUTH_SM3’ undeclared here (not in a function); did you mean ‘IMB_AUTH_NUM’?
 1271 |                 [IMB_AUTH_SM3]                  = 32,
      |                  ^~~~~~~~~~~~
      |                  IMB_AUTH_NUM
../drivers/crypto/ipsec_mb/pmd_aesni_mb_priv.h:1271:18: error: array index in initializer not of integer type
../drivers/crypto/ipsec_mb/pmd_aesni_mb_priv.h:1271:18: note: (near initialization for ‘auth_digest_byte_lengths’)
../drivers/crypto/ipsec_mb/pmd_aesni_mb_priv.h:1272:18: error: ‘IMB_AUTH_HMAC_SM3’ undeclared here (not in a function); did you mean ‘IMB_AUTH_HMAC_SHA_1’?
 1272 |                 [IMB_AUTH_HMAC_SM3]             = 32,
      |                  ^~~~~~~~~~~~~~~~~
      |                  IMB_AUTH_HMAC_SHA_1
../drivers/crypto/ipsec_mb/pmd_aesni_mb_priv.h:1272:18: error: array index in initializer not of integer type
../drivers/crypto/ipsec_mb/pmd_aesni_mb_priv.h:1272:18: note: (near initialization for ‘auth_digest_byte_lengths’)
[2698/3657] Compiling C object drivers/libtmp_rte_crypto_ipsec_mb.a.p/crypto_ipsec_mb_ipsec_mb_private.c.o
[2699/3657] Compiling C object drivers/libtmp_rte_crypto_ipsec_mb.a.p/crypto_ipsec_mb_pmd_aesni_gcm.c.o
[2700/3657] Compiling C object drivers/libtmp_rte_crypto_dpaa_sec.a.p/crypto_dpaa_sec_dpaa_sec.c.o
[2701/3657] Compiling C object drivers/libtmp_rte_crypto_dpaa2_sec.a.p/crypto_dpaa2_sec_dpaa2_sec_dpseci.c.o
[2702/3657] Compiling C object drivers/libtmp_rte_crypto_cnxk.a.p/crypto_cnxk_cn9k_cryptodev_ops.c.o
[2703/3657] Compiling C object drivers/libtmp_rte_crypto_cnxk.a.p/crypto_cnxk_cn20k_cryptodev_ops.c.o
[2704/3657] Compiling C object drivers/libtmp_rte_crypto_cnxk.a.p/crypto_cnxk_cn10k_cryptodev_ops.c.o
ninja: build stopped




*Build Failed #13:
OS: RHEL10.2-64
Target: x86_64-native-linuxapp-gcc
FAILED: drivers/libtmp_rte_crypto_ipsec_mb.a.p/crypto_ipsec_mb_ipsec_mb_ops.c.o 
gcc -Idrivers/libtmp_rte_crypto_ipsec_mb.a.p -Idrivers -I../drivers -Idrivers/crypto/ipsec_mb -I../drivers/crypto/ipsec_mb -Ilib/cryptodev -I../lib/cryptodev -Ilib/eal/common -I../lib/eal/common -I. -I.. -Iconfig -I../config -Ilib/eal/include -I../lib/eal/include -Ilib/eal/linux/include -I../lib/eal/linux/include -Ilib/eal/x86/include -I../lib/eal/x86/include -I../kernel/linux -Ilib/eal -I../lib/eal -Ilib/kvargs -I../lib/kvargs -Ilib/log -I../lib/log -Ilib/metrics -I../lib/metrics -Ilib/telemetry -I../lib/telemetry -Ilib/argparse -I../lib/argparse -Ilib/mbuf -I../lib/mbuf -Ilib/mempool -I../lib/mempool -Ilib/ring -I../lib/ring -Ilib/rcu -I../lib/rcu -Idrivers/bus/vdev -I../drivers/bus/vdev -Ilib/net -I../lib/net -Ilib/security -I../lib/security -fdiagnostics-color=always -D_FILE_OFFSET_BITS=64 -Wall -Winvalid-pch -Wextra -Werror -std=c11 -O3 -include rte_config.h -Wvla -Wcast-qual -Wdeprecated -Wformat -Wformat-nonliteral -Wformat-security -Wmissing-declarations -Wmissing-prototypes -Wnested-externs -Wold-style-definition -Wpointer-arith -Wshadow -Wsign-compare -Wstrict-prototypes -Wundef -Wwrite-strings -Wno-packed-not-aligned -Wno-missing-field-initializers -D_GNU_SOURCE -fPIC -march=native -mrtm -DALLOW_EXPERIMENTAL_API -DALLOW_INTERNAL_API -Wno-format-truncation -Wno-address-of-packed-member -Wno-vla -DRTE_COMPONENT_CLASS=pmd_crypto -DRTE_COMPONENT_NAME=ipsec_mb -DRTE_LOG_DEFAULT_LOGTYPE=pmd.crypto.ipsec_mb -MD -MQ drivers/libtmp_rte_crypto_ipsec_mb.a.p/crypto_ipsec_mb_ipsec_mb_ops.c.o -MF drivers/libtmp_rte_crypto_ipsec_mb.a.p/crypto_ipsec_mb_ipsec_mb_ops.c.o.d -o drivers/libtmp_rte_crypto_ipsec_mb.a.p/crypto_ipsec_mb_ipsec_mb_ops.c.o -c ../drivers/crypto/ipsec_mb/ipsec_mb_ops.c
../drivers/crypto/ipsec_mb/ipsec_mb_ops.c: In function ‘ipsec_mb_asym_session_configure’:
../drivers/crypto/ipsec_mb/ipsec_mb_ops.c:473:12: error: ‘mb_mgr’ may be used uninitialized [-Werror=maybe-uninitialized]
  473 |         if (!mb_mgr)
      |            ^
../drivers/crypto/ipsec_mb/ipsec_mb_ops.c:467:18: note: ‘mb_mgr’ was declared here
  467 |         IMB_MGR *mb_mgr;
      |                  ^~~~~~
cc1: all warnings being treated as errors
[2695/3657] Compiling C object drivers/libtmp_rte_crypto_ipsec_mb.a.p/crypto_ipsec_mb_pmd_aesni_mb.c.o
FAILED: drivers/libtmp_rte_crypto_ipsec_mb.a.p/crypto_ipsec_mb_pmd_aesni_mb.c.o 
gcc -Idrivers/libtmp_rte_crypto_ipsec_mb.a.p -Idrivers -I../drivers -Idrivers/crypto/ipsec_mb -I../drivers/crypto/ipsec_mb -Ilib/cryptodev -I../lib/cryptodev -Ilib/eal/common -I../lib/eal/common -I. -I.. -Iconfig -I../config -Ilib/eal/include -I../lib/eal/include -Ilib/eal/linux/include -I../lib/eal/linux/include -Ilib/eal/x86/include -I../lib/eal/x86/include -I../kernel/linux -Ilib/eal -I../lib/eal -Ilib/kvargs -I../lib/kvargs -Ilib/log -I../lib/log -Ilib/metrics -I../lib/metrics -Ilib/telemetry -I../lib/telemetry -Ilib/argparse -I../lib/argparse -Ilib/mbuf -I../lib/mbuf -Ilib/mempool -I../lib/mempool -Ilib/ring -I../lib/ring -Ilib/rcu -I../lib/rcu -Idrivers/bus/vdev -I../drivers/bus/vdev -Ilib/net -I../lib/net -Ilib/security -I../lib/security -fdiagnostics-color=always -D_FILE_OFFSET_BITS=64 -Wall -Winvalid-pch -Wextra -Werror -std=c11 -O3 -include rte_config.h -Wvla -Wcast-qual -Wdeprecated -Wformat -Wformat-nonliteral -Wformat-security -Wmissing-declarations -Wmissing-prototypes -Wnested-externs -Wold-style-definition -Wpointer-arith -Wshadow -Wsign-compare -Wstrict-prototypes -Wundef -Wwrite-strings -Wno-packed-not-aligned -Wno-missing-field-initializers -D_GNU_SOURCE -fPIC -march=native -mrtm -DALLOW_EXPERIMENTAL_API -DALLOW_INTERNAL_API -Wno-format-truncation -Wno-address-of-packed-member -Wno-vla -DRTE_COMPONENT_CLASS=pmd_crypto -DRTE_COMPONENT_NAME=ipsec_mb -DRTE_LOG_DEFAULT_LOGTYPE=pmd.crypto.ipsec_mb -MD -MQ drivers/libtmp_rte_crypto_ipsec_mb.a.p/crypto_ipsec_mb_pmd_aesni_mb.c.o -MF drivers/libtmp_rte_crypto_ipsec_mb.a.p/crypto_ipsec_mb_pmd_aesni_mb.c.o.d -o drivers/libtmp_rte_crypto_ipsec_mb.a.p/crypto_ipsec_mb_pmd_aesni_mb.c.o -c ../drivers/crypto/ipsec_mb/pmd_aesni_mb.c
In file included from ../drivers/crypto/ipsec_mb/pmd_aesni_mb.c:7:
../drivers/crypto/ipsec_mb/pmd_aesni_mb_priv.h:1271:18: error: ‘IMB_AUTH_SM3’ undeclared here (not in a function); did you mean ‘IMB_AUTH_NUM’?
 1271 |                 [IMB_AUTH_SM3]                  = 32,
      |                  ^~~~~~~~~~~~
      |                  IMB_AUTH_NUM
../drivers/crypto/ipsec_mb/pmd_aesni_mb_priv.h:1271:18: error: array index in initializer not of integer type
../drivers/crypto/ipsec_mb/pmd_aesni_mb_priv.h:1271:18: note: (near initialization for ‘auth_digest_byte_lengths’)
../drivers/crypto/ipsec_mb/pmd_aesni_mb_priv.h:1272:18: error: ‘IMB_AUTH_HMAC_SM3’ undeclared here (not in a function); did you mean ‘IMB_AUTH_HMAC_SHA_1’?
 1272 |                 [IMB_AUTH_HMAC_SM3]             = 32,
      |                  ^~~~~~~~~~~~~~~~~
      |                  IMB_AUTH_HMAC_SHA_1
../drivers/crypto/ipsec_mb/pmd_aesni_mb_priv.h:1272:18: error: array index in initializer not of integer type
../drivers/crypto/ipsec_mb/pmd_aesni_mb_priv.h:1272:18: note: (near initialization for ‘auth_digest_byte_lengths’)
[2696/3657] Generating drivers/rte_crypto_ionic.pmd.c with a custom command
[2697/3657] Compiling C object drivers/libtmp_rte_crypto_ipsec_mb.a.p/crypto_ipsec_mb_ipsec_mb_private.c.o
[2698/3657] Compiling C object drivers/libtmp_rte_crypto_ipsec_mb.a.p/crypto_ipsec_mb_pmd_aesni_gcm.c.o
[2699/3657] Compiling C object drivers/libtmp_rte_crypto_dpaa_sec.a.p/crypto_dpaa_sec_dpaa_sec.c.o
[2700/3657] Compiling C object drivers/libtmp_rte_crypto_dpaa2_sec.a.p/crypto_dpaa2_sec_dpaa2_sec_dpseci.c.o
[2701/3657] Compiling C object drivers/libtmp_rte_crypto_cnxk.a.p/crypto_cnxk_cn9k_cryptodev_ops.c.o
[2702/3657] Compiling C object drivers/libtmp_rte_crypto_cnxk.a.p/crypto_cnxk_cn20k_cryptodev_ops.c.o
[2703/3657] Compiling C object drivers/libtmp_rte_crypto_cnxk.a.p/crypto_cnxk_cn10k_cryptodev_ops.c.o
ninja: build stopped




*Build Failed #14:
OS: UB2604-64
Target: x86_64-native-linuxapp-gcc+16byte
FAILED: drivers/libtmp_rte_crypto_ipsec_mb.a.p/crypto_ipsec_mb_ipsec_mb_ops.c.o 
gcc -Idrivers/libtmp_rte_crypto_ipsec_mb.a.p -Idrivers -I../drivers -Idrivers/crypto/ipsec_mb -I../drivers/crypto/ipsec_mb -Ilib/cryptodev -I../lib/cryptodev -Ilib/eal/common -I../lib/eal/common -I. -I.. -Iconfig -I../config -Ilib/eal/include -I../lib/eal/include -Ilib/eal/linux/include -I../lib/eal/linux/include -Ilib/eal/x86/include -I../lib/eal/x86/include -I../kernel/linux -Ilib/eal -I../lib/eal -Ilib/kvargs -I../lib/kvargs -Ilib/log -I../lib/log -Ilib/metrics -I../lib/metrics -Ilib/telemetry -I../lib/telemetry -Ilib/argparse -I../lib/argparse -Ilib/mbuf -I../lib/mbuf -Ilib/mempool -I../lib/mempool -Ilib/ring -I../lib/ring -Ilib/rcu -I../lib/rcu -Idrivers/bus/vdev -I../drivers/bus/vdev -Ilib/net -I../lib/net -Ilib/security -I../lib/security -fdiagnostics-color=always -D_FILE_OFFSET_BITS=64 -Wall -Winvalid-pch -Wextra -Werror -std=c11 -O3 -include rte_config.h -Wvla -Wcast-qual -Wdeprecated -Wformat -Wformat-nonliteral -Wformat-security -Wmissing-declarations -Wmissing-prototypes -Wnested-externs -Wold-style-definition -Wpointer-arith -Wshadow -Wsign-compare -Wstrict-prototypes -Wundef -Wwrite-strings -Wno-packed-not-aligned -Wno-missing-field-initializers -fzero-init-padding-bits=all -D_GNU_SOURCE -DRTE_LIBRTE_I40E_16BYTE_RX_DESC -DRTE_LIBRTE_ICE_16BYTE_RX_DESC -fPIC -march=native -mrtm -DALLOW_EXPERIMENTAL_API -DALLOW_INTERNAL_API -Wno-format-truncation -Wno-address-of-packed-member -Wno-vla -DRTE_COMPONENT_CLASS=pmd_crypto -DRTE_COMPONENT_NAME=ipsec_mb -DRTE_LOG_DEFAULT_LOGTYPE=pmd.crypto.ipsec_mb -MD -MQ drivers/libtmp_rte_crypto_ipsec_mb.a.p/crypto_ipsec_mb_ipsec_mb_ops.c.o -MF drivers/libtmp_rte_crypto_ipsec_mb.a.p/crypto_ipsec_mb_ipsec_mb_ops.c.o.d -o drivers/libtmp_rte_crypto_ipsec_mb.a.p/crypto_ipsec_mb_ipsec_mb_ops.c.o -c ../drivers/crypto/ipsec_mb/ipsec_mb_ops.c
../drivers/crypto/ipsec_mb/ipsec_mb_ops.c: In function ‘ipsec_mb_asym_session_configure’:
../drivers/crypto/ipsec_mb/ipsec_mb_ops.c:473:12: error: ‘mb_mgr’ may be used uninitialized [-Werror=maybe-uninitialized]
  473 |         if (!mb_mgr)
      |            ^
../drivers/crypto/ipsec_mb/ipsec_mb_ops.c:467:18: note: ‘mb_mgr’ was declared here
  467 |         IMB_MGR *mb_mgr;
      |                  ^~~~~~
cc1: all warnings being treated as errors
[2891/3898] Generating drivers/rte_crypto_ionic.sym_chk with a custom command (wrapped by meson to capture output)
[2892/3898] Compiling C object drivers/libtmp_rte_crypto_ipsec_mb.a.p/crypto_ipsec_mb_pmd_aesni_mb.c.o
FAILED: drivers/libtmp_rte_crypto_ipsec_mb.a.p/crypto_ipsec_mb_pmd_aesni_mb.c.o 
gcc -Idrivers/libtmp_rte_crypto_ipsec_mb.a.p -Idrivers -I../drivers -Idrivers/crypto/ipsec_mb -I../drivers/crypto/ipsec_mb -Ilib/cryptodev -I../lib/cryptodev -Ilib/eal/common -I../lib/eal/common -I. -I.. -Iconfig -I../config -Ilib/eal/include -I../lib/eal/include -Ilib/eal/linux/include -I../lib/eal/linux/include -Ilib/eal/x86/include -I../lib/eal/x86/include -I../kernel/linux -Ilib/eal -I../lib/eal -Ilib/kvargs -I../lib/kvargs -Ilib/log -I../lib/log -Ilib/metrics -I../lib/metrics -Ilib/telemetry -I../lib/telemetry -Ilib/argparse -I../lib/argparse -Ilib/mbuf -I../lib/mbuf -Ilib/mempool -I../lib/mempool -Ilib/ring -I../lib/ring -Ilib/rcu -I../lib/rcu -Idrivers/bus/vdev -I../drivers/bus/vdev -Ilib/net -I../lib/net -Ilib/security -I../lib/security -fdiagnostics-color=always -D_FILE_OFFSET_BITS=64 -Wall -Winvalid-pch -Wextra -Werror -std=c11 -O3 -include rte_config.h -Wvla -Wcast-qual -Wdeprecated -Wformat -Wformat-nonliteral -Wformat-security -Wmissing-declarations -Wmissing-prototypes -Wnested-externs -Wold-style-definition -Wpointer-arith -Wshadow -Wsign-compare -Wstrict-prototypes -Wundef -Wwrite-strings -Wno-packed-not-aligned -Wno-missing-field-initializers -fzero-init-padding-bits=all -D_GNU_SOURCE -DRTE_LIBRTE_I40E_16BYTE_RX_DESC -DRTE_LIBRTE_ICE_16BYTE_RX_DESC -fPIC -march=native -mrtm -DALLOW_EXPERIMENTAL_API -DALLOW_INTERNAL_API -Wno-format-truncation -Wno-address-of-packed-member -Wno-vla -DRTE_COMPONENT_CLASS=pmd_crypto -DRTE_COMPONENT_NAME=ipsec_mb -DRTE_LOG_DEFAULT_LOGTYPE=pmd.crypto.ipsec_mb -MD -MQ drivers/libtmp_rte_crypto_ipsec_mb.a.p/crypto_ipsec_mb_pmd_aesni_mb.c.o -MF drivers/libtmp_rte_crypto_ipsec_mb.a.p/crypto_ipsec_mb_pmd_aesni_mb.c.o.d -o drivers/libtmp_rte_crypto_ipsec_mb.a.p/crypto_ipsec_mb_pmd_aesni_mb.c.o -c ../drivers/crypto/ipsec_mb/pmd_aesni_mb.c
In file included from ../drivers/crypto/ipsec_mb/pmd_aesni_mb.c:7:
../drivers/crypto/ipsec_mb/pmd_aesni_mb_priv.h:1271:18: error: ‘IMB_AUTH_SM3’ undeclared here (not in a function); did you mean ‘IMB_AUTH_NUM’?
 1271 |                 [IMB_AUTH_SM3]                  = 32,
      |                  ^~~~~~~~~~~~
      |                  IMB_AUTH_NUM
../drivers/crypto/ipsec_mb/pmd_aesni_mb_priv.h:1271:18: error: array index in initializer not of integer type
../drivers/crypto/ipsec_mb/pmd_aesni_mb_priv.h:1271:18: note: (near initialization for ‘auth_digest_byte_lengths’)
../drivers/crypto/ipsec_mb/pmd_aesni_mb_priv.h:1272:18: error: ‘IMB_AUTH_HMAC_SM3’ undeclared here (not in a function); did you mean ‘IMB_AUTH_HMAC_SHA_1’?
 1272 |                 [IMB_AUTH_HMAC_SM3]             = 32,
      |                  ^~~~~~~~~~~~~~~~~
      |                  IMB_AUTH_HMAC_SHA_1
../drivers/crypto/ipsec_mb/pmd_aesni_mb_priv.h:1272:18: error: array index in initializer not of integer type
../drivers/crypto/ipsec_mb/pmd_aesni_mb_priv.h:1272:18: note: (near initialization for ‘auth_digest_byte_lengths’)
[2893/3898] Compiling C object drivers/libtmp_rte_crypto_ipsec_mb.a.p/crypto_ipsec_mb_ipsec_mb_private.c.o
[2894/3898] Compiling C object drivers/libtmp_rte_crypto_ipsec_mb.a.p/crypto_ipsec_mb_pmd_aesni_gcm.c.o
[2895/3898] Compiling C object drivers/libtmp_rte_crypto_dpaa_sec.a.p/crypto_dpaa_sec_dpaa_sec.c.o
[2896/3898] Compiling C object drivers/libtmp_rte_crypto_dpaa2_sec.a.p/crypto_dpaa2_sec_dpaa2_sec_dpseci.c.o
[2897/3898] Compiling C object drivers/libtmp_rte_crypto_cnxk.a.p/crypto_cnxk_cn9k_cryptodev_ops.c.o
[2898/3898] Compiling C object drivers/libtmp_rte_crypto_cnxk.a.p/crypto_cnxk_cn20k_cryptodev_ops.c.o
[2899/3898] Compiling C object drivers/libtmp_rte_crypto_cnxk.a.p/crypto_cnxk_cn10k_cryptodev_ops.c.o
ninja: build stopped




*Build Failed #15:
OS: UB2604-64
Target: x86_64-native-linuxapp-gcc
FAILED: drivers/libtmp_rte_crypto_ipsec_mb.a.p/crypto_ipsec_mb_ipsec_mb_ops.c.o 
gcc -Idrivers/libtmp_rte_crypto_ipsec_mb.a.p -Idrivers -I../drivers -Idrivers/crypto/ipsec_mb -I../drivers/crypto/ipsec_mb -Ilib/cryptodev -I../lib/cryptodev -Ilib/eal/common -I../lib/eal/common -I. -I.. -Iconfig -I../config -Ilib/eal/include -I../lib/eal/include -Ilib/eal/linux/include -I../lib/eal/linux/include -Ilib/eal/x86/include -I../lib/eal/x86/include -I../kernel/linux -Ilib/eal -I../lib/eal -Ilib/kvargs -I../lib/kvargs -Ilib/log -I../lib/log -Ilib/metrics -I../lib/metrics -Ilib/telemetry -I../lib/telemetry -Ilib/argparse -I../lib/argparse -Ilib/mbuf -I../lib/mbuf -Ilib/mempool -I../lib/mempool -Ilib/ring -I../lib/ring -Ilib/rcu -I../lib/rcu -Idrivers/bus/vdev -I../drivers/bus/vdev -Ilib/net -I../lib/net -Ilib/security -I../lib/security -fdiagnostics-color=always -D_FILE_OFFSET_BITS=64 -Wall -Winvalid-pch -Wextra -Werror -std=c11 -O3 -include rte_config.h -Wvla -Wcast-qual -Wdeprecated -Wformat -Wformat-nonliteral -Wformat-security -Wmissing-declarations -Wmissing-prototypes -Wnested-externs -Wold-style-definition -Wpointer-arith -Wshadow -Wsign-compare -Wstrict-prototypes -Wundef -Wwrite-strings -Wno-packed-not-aligned -Wno-missing-field-initializers -fzero-init-padding-bits=all -D_GNU_SOURCE -fPIC -march=native -mrtm -DALLOW_EXPERIMENTAL_API -DALLOW_INTERNAL_API -Wno-format-truncation -Wno-address-of-packed-member -Wno-vla -DRTE_COMPONENT_CLASS=pmd_crypto -DRTE_COMPONENT_NAME=ipsec_mb -DRTE_LOG_DEFAULT_LOGTYPE=pmd.crypto.ipsec_mb -MD -MQ drivers/libtmp_rte_crypto_ipsec_mb.a.p/crypto_ipsec_mb_ipsec_mb_ops.c.o -MF drivers/libtmp_rte_crypto_ipsec_mb.a.p/crypto_ipsec_mb_ipsec_mb_ops.c.o.d -o drivers/libtmp_rte_crypto_ipsec_mb.a.p/crypto_ipsec_mb_ipsec_mb_ops.c.o -c ../drivers/crypto/ipsec_mb/ipsec_mb_ops.c
../drivers/crypto/ipsec_mb/ipsec_mb_ops.c: In function ‘ipsec_mb_asym_session_configure’:
../drivers/crypto/ipsec_mb/ipsec_mb_ops.c:473:12: error: ‘mb_mgr’ may be used uninitialized [-Werror=maybe-uninitialized]
  473 |         if (!mb_mgr)
      |            ^
../drivers/crypto/ipsec_mb/ipsec_mb_ops.c:467:18: note: ‘mb_mgr’ was declared here
  467 |         IMB_MGR *mb_mgr;
      |                  ^~~~~~
cc1: all warnings being treated as errors
[2892/3898] Generating drivers/rte_crypto_ionic.sym_chk with a custom command (wrapped by meson to capture output)
[2893/3898] Compiling C object drivers/libtmp_rte_crypto_ipsec_mb.a.p/crypto_ipsec_mb_pmd_aesni_mb.c.o
FAILED: drivers/libtmp_rte_crypto_ipsec_mb.a.p/crypto_ipsec_mb_pmd_aesni_mb.c.o 
gcc -Idrivers/libtmp_rte_crypto_ipsec_mb.a.p -Idrivers -I../drivers -Idrivers/crypto/ipsec_mb -I../drivers/crypto/ipsec_mb -Ilib/cryptodev -I../lib/cryptodev -Ilib/eal/common -I../lib/eal/common -I. -I.. -Iconfig -I../config -Ilib/eal/include -I../lib/eal/include -Ilib/eal/linux/include -I../lib/eal/linux/include -Ilib/eal/x86/include -I../lib/eal/x86/include -I../kernel/linux -Ilib/eal -I../lib/eal -Ilib/kvargs -I../lib/kvargs -Ilib/log -I../lib/log -Ilib/metrics -I../lib/metrics -Ilib/telemetry -I../lib/telemetry -Ilib/argparse -I../lib/argparse -Ilib/mbuf -I../lib/mbuf -Ilib/mempool -I../lib/mempool -Ilib/ring -I../lib/ring -Ilib/rcu -I../lib/rcu -Idrivers/bus/vdev -I../drivers/bus/vdev -Ilib/net -I../lib/net -Ilib/security -I../lib/security -fdiagnostics-color=always -D_FILE_OFFSET_BITS=64 -Wall -Winvalid-pch -Wextra -Werror -std=c11 -O3 -include rte_config.h -Wvla -Wcast-qual -Wdeprecated -Wformat -Wformat-nonliteral -Wformat-security -Wmissing-declarations -Wmissing-prototypes -Wnested-externs -Wold-style-definition -Wpointer-arith -Wshadow -Wsign-compare -Wstrict-prototypes -Wundef -Wwrite-strings -Wno-packed-not-aligned -Wno-missing-field-initializers -fzero-init-padding-bits=all -D_GNU_SOURCE -fPIC -march=native -mrtm -DALLOW_EXPERIMENTAL_API -DALLOW_INTERNAL_API -Wno-format-truncation -Wno-address-of-packed-member -Wno-vla -DRTE_COMPONENT_CLASS=pmd_crypto -DRTE_COMPONENT_NAME=ipsec_mb -DRTE_LOG_DEFAULT_LOGTYPE=pmd.crypto.ipsec_mb -MD -MQ drivers/libtmp_rte_crypto_ipsec_mb.a.p/crypto_ipsec_mb_pmd_aesni_mb.c.o -MF drivers/libtmp_rte_crypto_ipsec_mb.a.p/crypto_ipsec_mb_pmd_aesni_mb.c.o.d -o drivers/libtmp_rte_crypto_ipsec_mb.a.p/crypto_ipsec_mb_pmd_aesni_mb.c.o -c ../drivers/crypto/ipsec_mb/pmd_aesni_mb.c
In file included from ../drivers/crypto/ipsec_mb/pmd_aesni_mb.c:7:
../drivers/crypto/ipsec_mb/pmd_aesni_mb_priv.h:1271:18: error: ‘IMB_AUTH_SM3’ undeclared here (not in a function); did you mean ‘IMB_AUTH_NUM’?
 1271 |                 [IMB_AUTH_SM3]                  = 32,
      |                  ^~~~~~~~~~~~
      |                  IMB_AUTH_NUM
../drivers/crypto/ipsec_mb/pmd_aesni_mb_priv.h:1271:18: error: array index in initializer not of integer type
../drivers/crypto/ipsec_mb/pmd_aesni_mb_priv.h:1271:18: note: (near initialization for ‘auth_digest_byte_lengths’)
../drivers/crypto/ipsec_mb/pmd_aesni_mb_priv.h:1272:18: error: ‘IMB_AUTH_HMAC_SM3’ undeclared here (not in a function); did you mean ‘IMB_AUTH_HMAC_SHA_1’?
 1272 |                 [IMB_AUTH_HMAC_SM3]             = 32,
      |                  ^~~~~~~~~~~~~~~~~
      |                  IMB_AUTH_HMAC_SHA_1
../drivers/crypto/ipsec_mb/pmd_aesni_mb_priv.h:1272:18: error: array index in initializer not of integer type
../drivers/crypto/ipsec_mb/pmd_aesni_mb_priv.h:1272:18: note: (near initialization for ‘auth_digest_byte_lengths’)
[2894/3898] Compiling C object drivers/libtmp_rte_crypto_ipsec_mb.a.p/crypto_ipsec_mb_ipsec_mb_private.c.o
[2895/3898] Compiling C object drivers/libtmp_rte_crypto_ipsec_mb.a.p/crypto_ipsec_mb_pmd_aesni_gcm.c.o
[2896/3898] Compiling C object drivers/libtmp_rte_crypto_dpaa_sec.a.p/crypto_dpaa_sec_dpaa_sec.c.o
[2897/3898] Compiling C object drivers/libtmp_rte_crypto_dpaa2_sec.a.p/crypto_dpaa2_sec_dpaa2_sec_dpseci.c.o
[2898/3898] Compiling C object drivers/libtmp_rte_crypto_cnxk.a.p/crypto_cnxk_cn9k_cryptodev_ops.c.o
[2899/3898] Compiling C object drivers/libtmp_rte_crypto_cnxk.a.p/crypto_cnxk_cn20k_cryptodev_ops.c.o
[2900/3898] Compiling C object drivers/libtmp_rte_crypto_cnxk.a.p/crypto_cnxk_cn10k_cryptodev_ops.c.o
ninja: build stopped




*Build Failed #16:
OS: UB2604-64
Target: x86_64-native-linuxapp-clang
FAILED: drivers/libtmp_rte_crypto_ipsec_mb.a.p/crypto_ipsec_mb_ipsec_mb_ops.c.o 
clang -Idrivers/libtmp_rte_crypto_ipsec_mb.a.p -Idrivers -I../drivers -Idrivers/crypto/ipsec_mb -I../drivers/crypto/ipsec_mb -Ilib/cryptodev -I../lib/cryptodev -Ilib/eal/common -I../lib/eal/common -I. -I.. -Iconfig -I../config -Ilib/eal/include -I../lib/eal/include -Ilib/eal/linux/include -I../lib/eal/linux/include -Ilib/eal/x86/include -I../lib/eal/x86/include -I../kernel/linux -Ilib/eal -I../lib/eal -Ilib/kvargs -I../lib/kvargs -Ilib/log -I../lib/log -Ilib/metrics -I../lib/metrics -Ilib/telemetry -I../lib/telemetry -Ilib/argparse -I../lib/argparse -Ilib/mbuf -I../lib/mbuf -Ilib/mempool -I../lib/mempool -Ilib/ring -I../lib/ring -Ilib/rcu -I../lib/rcu -Idrivers/bus/vdev -I../drivers/bus/vdev -Ilib/net -I../lib/net -Ilib/security -I../lib/security -fdiagnostics-color=always -D_FILE_OFFSET_BITS=64 -Wall -Winvalid-pch -Wextra -Werror -std=c11 -O3 -include rte_config.h -Wvla -Wcast-qual -Wcomma -Wdeprecated -Wformat -Wformat-nonliteral -Wformat-security -Wmissing-declarations -Wmissing-prototypes -Wnested-externs -Wold-style-definition -Wpointer-arith -Wshadow -Wsign-compare -Wstrict-prototypes -Wundef -Wwrite-strings -Wno-missing-field-initializers -D_GNU_SOURCE -fPIC -march=native -mrtm -DALLOW_EXPERIMENTAL_API -DALLOW_INTERNAL_API -Wno-format-truncation -Wno-address-of-packed-member -Wno-vla -DRTE_COMPONENT_CLASS=pmd_crypto -DRTE_COMPONENT_NAME=ipsec_mb -DRTE_LOG_DEFAULT_LOGTYPE=pmd.crypto.ipsec_mb -DRTE_ANNOTATE_LOCKS -Wthread-safety -MD -MQ drivers/libtmp_rte_crypto_ipsec_mb.a.p/crypto_ipsec_mb_ipsec_mb_ops.c.o -MF drivers/libtmp_rte_crypto_ipsec_mb.a.p/crypto_ipsec_mb_ipsec_mb_ops.c.o.d -o drivers/libtmp_rte_crypto_ipsec_mb.a.p/crypto_ipsec_mb_ipsec_mb_ops.c.o -c ../drivers/crypto/ipsec_mb/ipsec_mb_ops.c
../drivers/crypto/ipsec_mb/ipsec_mb_ops.c:470:6: error: variable 'mb_mgr' is used uninitialized whenever 'if' condition is false [-Werror,-Wsometimes-uninitialized]
  470 |         if (qp != NULL)
      |             ^~~~~~~~~~
../drivers/crypto/ipsec_mb/ipsec_mb_ops.c:473:7: note: uninitialized use occurs here
  473 |         if (!mb_mgr)
      |              ^~~~~~
../drivers/crypto/ipsec_mb/ipsec_mb_ops.c:470:2: note: remove the 'if' if its condition is always true
  470 |         if (qp != NULL)
      |         ^~~~~~~~~~~~~~~
  471 |                 mb_mgr = qp->mb_mgr;
../drivers/crypto/ipsec_mb/ipsec_mb_ops.c:467:17: note: initialize the variable 'mb_mgr' to silence this warning
  467 |         IMB_MGR *mb_mgr;
      |                        ^
      |                         = NULL
1 error generated.
[2893/3899] Compiling C object drivers/libtmp_rte_crypto_ipsec_mb.a.p/crypto_ipsec_mb_ipsec_mb_private.c.o
[2894/3899] Generating drivers/rte_crypto_ionic.pmd.c with a custom command
[2895/3899] Compiling C object drivers/libtmp_rte_crypto_ipsec_mb.a.p/crypto_ipsec_mb_pmd_aesni_mb.c.o
FAILED: drivers/libtmp_rte_crypto_ipsec_mb.a.p/crypto_ipsec_mb_pmd_aesni_mb.c.o 
clang -Idrivers/libtmp_rte_crypto_ipsec_mb.a.p -Idrivers -I../drivers -Idrivers/crypto/ipsec_mb -I../drivers/crypto/ipsec_mb -Ilib/cryptodev -I../lib/cryptodev -Ilib/eal/common -I../lib/eal/common -I. -I.. -Iconfig -I../config -Ilib/eal/include -I../lib/eal/include -Ilib/eal/linux/include -I../lib/eal/linux/include -Ilib/eal/x86/include -I../lib/eal/x86/include -I../kernel/linux -Ilib/eal -I../lib/eal -Ilib/kvargs -I../lib/kvargs -Ilib/log -I../lib/log -Ilib/metrics -I../lib/metrics -Ilib/telemetry -I../lib/telemetry -Ilib/argparse -I../lib/argparse -Ilib/mbuf -I../lib/mbuf -Ilib/mempool -I../lib/mempool -Ilib/ring -I../lib/ring -Ilib/rcu -I../lib/rcu -Idrivers/bus/vdev -I../drivers/bus/vdev -Ilib/net -I../lib/net -Ilib/security -I../lib/security -fdiagnostics-color=always -D_FILE_OFFSET_BITS=64 -Wall -Winvalid-pch -Wextra -Werror -std=c11 -O3 -include rte_config.h -Wvla -Wcast-qual -Wcomma -Wdeprecated -Wformat -Wformat-nonliteral -Wformat-security -Wmissing-declarations -Wmissing-prototypes -Wnested-externs -Wold-style-definition -Wpointer-arith -Wshadow -Wsign-compare -Wstrict-prototypes -Wundef -Wwrite-strings -Wno-missing-field-initializers -D_GNU_SOURCE -fPIC -march=native -mrtm -DALLOW_EXPERIMENTAL_API -DALLOW_INTERNAL_API -Wno-format-truncation -Wno-address-of-packed-member -Wno-vla -DRTE_COMPONENT_CLASS=pmd_crypto -DRTE_COMPONENT_NAME=ipsec_mb -DRTE_LOG_DEFAULT_LOGTYPE=pmd.crypto.ipsec_mb -DRTE_ANNOTATE_LOCKS -Wthread-safety -MD -MQ drivers/libtmp_rte_crypto_ipsec_mb.a.p/crypto_ipsec_mb_pmd_aesni_mb.c.o -MF drivers/libtmp_rte_crypto_ipsec_mb.a.p/crypto_ipsec_mb_pmd_aesni_mb.c.o.d -o drivers/libtmp_rte_crypto_ipsec_mb.a.p/crypto_ipsec_mb_pmd_aesni_mb.c.o -c ../drivers/crypto/ipsec_mb/pmd_aesni_mb.c
In file included from ../drivers/crypto/ipsec_mb/pmd_aesni_mb.c:7:
../drivers/crypto/ipsec_mb/pmd_aesni_mb_priv.h:1271:4: error: use of undeclared identifier 'IMB_AUTH_SM3'
 1271 |                 [IMB_AUTH_SM3]                  = 32,
      |                  ^~~~~~~~~~~~
1 error generated.
[2896/3899] Compiling C object drivers/libtmp_rte_crypto_ipsec_mb.a.p/crypto_ipsec_mb_pmd_aesni_gcm.c.o
[2897/3899] Compiling C object drivers/libtmp_rte_crypto_cnxk.a.p/crypto_cnxk_cn9k_cryptodev_ops.c.o
[2898/3899] Compiling C object drivers/libtmp_rte_crypto_dpaa2_sec.a.p/crypto_dpaa2_sec_dpaa2_sec_dpseci.c.o
[2899/3899] Compiling C object drivers/libtmp_rte_crypto_dpaa_sec.a.p/crypto_dpaa_sec_dpaa_sec.c.o
[2900/3899] Compiling C object drivers/libtmp_rte_crypto_cnxk.a.p/crypto_cnxk_cn20k_cryptodev_ops.c.o
[2901/3899] Compiling C object drivers/libtmp_rte_crypto_cnxk.a.p/crypto_cnxk_cn10k_cryptodev_ops.c.o
ninja: build stopped




*Build Failed #17:
OS: UB2604-64
Target: x86_64-native-linuxapp-doc
FAILED: drivers/libtmp_rte_crypto_ipsec_mb.a.p/crypto_ipsec_mb_ipsec_mb_ops.c.o 
gcc -Idrivers/libtmp_rte_crypto_ipsec_mb.a.p -Idrivers -I../drivers -Idrivers/crypto/ipsec_mb -I../drivers/crypto/ipsec_mb -Ilib/cryptodev -I../lib/cryptodev -Ilib/eal/common -I../lib/eal/common -I. -I.. -Iconfig -I../config -Ilib/eal/include -I../lib/eal/include -Ilib/eal/linux/include -I../lib/eal/linux/include -Ilib/eal/x86/include -I../lib/eal/x86/include -I../kernel/linux -Ilib/eal -I../lib/eal -Ilib/kvargs -I../lib/kvargs -Ilib/log -I../lib/log -Ilib/metrics -I../lib/metrics -Ilib/telemetry -I../lib/telemetry -Ilib/argparse -I../lib/argparse -Ilib/mbuf -I../lib/mbuf -Ilib/mempool -I../lib/mempool -Ilib/ring -I../lib/ring -Ilib/rcu -I../lib/rcu -Idrivers/bus/vdev -I../drivers/bus/vdev -Ilib/net -I../lib/net -Ilib/security -I../lib/security -fdiagnostics-color=always -D_FILE_OFFSET_BITS=64 -Wall -Winvalid-pch -Wextra -Werror -std=c11 -O3 -include rte_config.h -Wvla -Wcast-qual -Wdeprecated -Wformat -Wformat-nonliteral -Wformat-security -Wmissing-declarations -Wmissing-prototypes -Wnested-externs -Wold-style-definition -Wpointer-arith -Wshadow -Wsign-compare -Wstrict-prototypes -Wundef -Wwrite-strings -Wno-packed-not-aligned -Wno-missing-field-initializers -fzero-init-padding-bits=all -D_GNU_SOURCE -fPIC -march=native -mrtm -DALLOW_EXPERIMENTAL_API -DALLOW_INTERNAL_API -Wno-format-truncation -Wno-address-of-packed-member -Wno-vla -DRTE_COMPONENT_CLASS=pmd_crypto -DRTE_COMPONENT_NAME=ipsec_mb -DRTE_LOG_DEFAULT_LOGTYPE=pmd.crypto.ipsec_mb -MD -MQ drivers/libtmp_rte_crypto_ipsec_mb.a.p/crypto_ipsec_mb_ipsec_mb_ops.c.o -MF drivers/libtmp_rte_crypto_ipsec_mb.a.p/crypto_ipsec_mb_ipsec_mb_ops.c.o.d -o drivers/libtmp_rte_crypto_ipsec_mb.a.p/crypto_ipsec_mb_ipsec_mb_ops.c.o -c ../drivers/crypto/ipsec_mb/ipsec_mb_ops.c
../drivers/crypto/ipsec_mb/ipsec_mb_ops.c: In function ‘ipsec_mb_asym_session_configure’:
../drivers/crypto/ipsec_mb/ipsec_mb_ops.c:473:12: error: ‘mb_mgr’ may be used uninitialized [-Werror=maybe-uninitialized]
  473 |         if (!mb_mgr)
      |            ^
../drivers/crypto/ipsec_mb/ipsec_mb_ops.c:467:18: note: ‘mb_mgr’ was declared here
  467 |         IMB_MGR *mb_mgr;
      |                  ^~~~~~
cc1: all warnings being treated as errors
[2882/3721] Generating drivers/rte_crypto_ionic.sym_chk with a custom command (wrapped by meson to capture output)
[2883/3721] Compiling C object drivers/libtmp_rte_crypto_ipsec_mb.a.p/crypto_ipsec_mb_pmd_aesni_mb.c.o
FAILED: drivers/libtmp_rte_crypto_ipsec_mb.a.p/crypto_ipsec_mb_pmd_aesni_mb.c.o 
gcc -Idrivers/libtmp_rte_crypto_ipsec_mb.a.p -Idrivers -I../drivers -Idrivers/crypto/ipsec_mb -I../drivers/crypto/ipsec_mb -Ilib/cryptodev -I../lib/cryptodev -Ilib/eal/common -I../lib/eal/common -I. -I.. -Iconfig -I../config -Ilib/eal/include -I../lib/eal/include -Ilib/eal/linux/include -I../lib/eal/linux/include -Ilib/eal/x86/include -I../lib/eal/x86/include -I../kernel/linux -Ilib/eal -I../lib/eal -Ilib/kvargs -I../lib/kvargs -Ilib/log -I../lib/log -Ilib/metrics -I../lib/metrics -Ilib/telemetry -I../lib/telemetry -Ilib/argparse -I../lib/argparse -Ilib/mbuf -I../lib/mbuf -Ilib/mempool -I../lib/mempool -Ilib/ring -I../lib/ring -Ilib/rcu -I../lib/rcu -Idrivers/bus/vdev -I../drivers/bus/vdev -Ilib/net -I../lib/net -Ilib/security -I../lib/security -fdiagnostics-color=always -D_FILE_OFFSET_BITS=64 -Wall -Winvalid-pch -Wextra -Werror -std=c11 -O3 -include rte_config.h -Wvla -Wcast-qual -Wdeprecated -Wformat -Wformat-nonliteral -Wformat-security -Wmissing-declarations -Wmissing-prototypes -Wnested-externs -Wold-style-definition -Wpointer-arith -Wshadow -Wsign-compare -Wstrict-prototypes -Wundef -Wwrite-strings -Wno-packed-not-aligned -Wno-missing-field-initializers -fzero-init-padding-bits=all -D_GNU_SOURCE -fPIC -march=native -mrtm -DALLOW_EXPERIMENTAL_API -DALLOW_INTERNAL_API -Wno-format-truncation -Wno-address-of-packed-member -Wno-vla -DRTE_COMPONENT_CLASS=pmd_crypto -DRTE_COMPONENT_NAME=ipsec_mb -DRTE_LOG_DEFAULT_LOGTYPE=pmd.crypto.ipsec_mb -MD -MQ drivers/libtmp_rte_crypto_ipsec_mb.a.p/crypto_ipsec_mb_pmd_aesni_mb.c.o -MF drivers/libtmp_rte_crypto_ipsec_mb.a.p/crypto_ipsec_mb_pmd_aesni_mb.c.o.d -o drivers/libtmp_rte_crypto_ipsec_mb.a.p/crypto_ipsec_mb_pmd_aesni_mb.c.o -c ../drivers/crypto/ipsec_mb/pmd_aesni_mb.c
In file included from ../drivers/crypto/ipsec_mb/pmd_aesni_mb.c:7:
../drivers/crypto/ipsec_mb/pmd_aesni_mb_priv.h:1271:18: error: ‘IMB_AUTH_SM3’ undeclared here (not in a function); did you mean ‘IMB_AUTH_NUM’?
 1271 |                 [IMB_AUTH_SM3]                  = 32,
      |                  ^~~~~~~~~~~~
      |                  IMB_AUTH_NUM
../drivers/crypto/ipsec_mb/pmd_aesni_mb_priv.h:1271:18: error: array index in initializer not of integer type
../drivers/crypto/ipsec_mb/pmd_aesni_mb_priv.h:1271:18: note: (near initialization for ‘auth_digest_byte_lengths’)
../drivers/crypto/ipsec_mb/pmd_aesni_mb_priv.h:1272:18: error: ‘IMB_AUTH_HMAC_SM3’ undeclared here (not in a function); did you mean ‘IMB_AUTH_HMAC_SHA_1’?
 1272 |                 [IMB_AUTH_HMAC_SM3]             = 32,
      |                  ^~~~~~~~~~~~~~~~~
      |                  IMB_AUTH_HMAC_SHA_1
../drivers/crypto/ipsec_mb/pmd_aesni_mb_priv.h:1272:18: error: array index in initializer not of integer type
../drivers/crypto/ipsec_mb/pmd_aesni_mb_priv.h:1272:18: note: (near initialization for ‘auth_digest_byte_lengths’)
[2884/3721] Compiling C object drivers/libtmp_rte_crypto_ipsec_mb.a.p/crypto_ipsec_mb_ipsec_mb_private.c.o
[2885/3721] Compiling C object drivers/libtmp_rte_crypto_ipsec_mb.a.p/crypto_ipsec_mb_pmd_aesni_gcm.c.o
[2886/3721] Compiling C object drivers/libtmp_rte_crypto_dpaa_sec.a.p/crypto_dpaa_sec_dpaa_sec.c.o
[2887/3721] Compiling C object drivers/libtmp_rte_crypto_dpaa2_sec.a.p/crypto_dpaa2_sec_dpaa2_sec_dpseci.c.o
[2888/3721] Compiling C object drivers/libtmp_rte_crypto_cnxk.a.p/crypto_cnxk_cn9k_cryptodev_ops.c.o
[2889/3721] Compiling C object drivers/libtmp_rte_crypto_cnxk.a.p/crypto_cnxk_cn20k_cryptodev_ops.c.o
[2890/3721] Compiling C object drivers/libtmp_rte_crypto_cnxk.a.p/crypto_cnxk_cn10k_cryptodev_ops.c.o
ninja: build stopped




*Build Failed #18:
OS: RHEL10.2-64RT
Target: x86_64-native-linuxapp-gcc
FAILED: drivers/libtmp_rte_crypto_ipsec_mb.a.p/crypto_ipsec_mb_ipsec_mb_ops.c.o 
gcc -Idrivers/libtmp_rte_crypto_ipsec_mb.a.p -Idrivers -I../drivers -Idrivers/crypto/ipsec_mb -I../drivers/crypto/ipsec_mb -Ilib/cryptodev -I../lib/cryptodev -Ilib/eal/common -I../lib/eal/common -I. -I.. -Iconfig -I../config -Ilib/eal/include -I../lib/eal/include -Ilib/eal/linux/include -I../lib/eal/linux/include -Ilib/eal/x86/include -I../lib/eal/x86/include -I../kernel/linux -Ilib/eal -I../lib/eal -Ilib/kvargs -I../lib/kvargs -Ilib/log -I../lib/log -Ilib/metrics -I../lib/metrics -Ilib/telemetry -I../lib/telemetry -Ilib/argparse -I../lib/argparse -Ilib/mbuf -I../lib/mbuf -Ilib/mempool -I../lib/mempool -Ilib/ring -I../lib/ring -Ilib/rcu -I../lib/rcu -Idrivers/bus/vdev -I../drivers/bus/vdev -Ilib/net -I../lib/net -Ilib/security -I../lib/security -fdiagnostics-color=always -D_FILE_OFFSET_BITS=64 -Wall -Winvalid-pch -Wextra -Werror -std=c11 -O3 -include rte_config.h -Wvla -Wcast-qual -Wdeprecated -Wformat -Wformat-nonliteral -Wformat-security -Wmissing-declarations -Wmissing-prototypes -Wnested-externs -Wold-style-definition -Wpointer-arith -Wshadow -Wsign-compare -Wstrict-prototypes -Wundef -Wwrite-strings -Wno-packed-not-aligned -Wno-missing-field-initializers -D_GNU_SOURCE -fPIC -march=native -mrtm -DALLOW_EXPERIMENTAL_API -DALLOW_INTERNAL_API -Wno-format-truncation -Wno-address-of-packed-member -Wno-vla -DRTE_COMPONENT_CLASS=pmd_crypto -DRTE_COMPONENT_NAME=ipsec_mb -DRTE_LOG_DEFAULT_LOGTYPE=pmd.crypto.ipsec_mb -MD -MQ drivers/libtmp_rte_crypto_ipsec_mb.a.p/crypto_ipsec_mb_ipsec_mb_ops.c.o -MF drivers/libtmp_rte_crypto_ipsec_mb.a.p/crypto_ipsec_mb_ipsec_mb_ops.c.o.d -o drivers/libtmp_rte_crypto_ipsec_mb.a.p/crypto_ipsec_mb_ipsec_mb_ops.c.o -c ../drivers/crypto/ipsec_mb/ipsec_mb_ops.c
../drivers/crypto/ipsec_mb/ipsec_mb_ops.c: In function ‘ipsec_mb_asym_session_configure’:
../drivers/crypto/ipsec_mb/ipsec_mb_ops.c:473:12: error: ‘mb_mgr’ may be used uninitialized [-Werror=maybe-uninitialized]
  473 |         if (!mb_mgr)
      |            ^
../drivers/crypto/ipsec_mb/ipsec_mb_ops.c:467:18: note: ‘mb_mgr’ was declared here
  467 |         IMB_MGR *mb_mgr;
      |                  ^~~~~~
cc1: all warnings being treated as errors
[2699/3657] Generating drivers/rte_crypto_ionic.sym_chk with a custom command (wrapped by meson to capture output)
[2700/3657] Compiling C object drivers/libtmp_rte_crypto_ipsec_mb.a.p/crypto_ipsec_mb_pmd_aesni_mb.c.o
FAILED: drivers/libtmp_rte_crypto_ipsec_mb.a.p/crypto_ipsec_mb_pmd_aesni_mb.c.o 
gcc -Idrivers/libtmp_rte_crypto_ipsec_mb.a.p -Idrivers -I../drivers -Idrivers/crypto/ipsec_mb -I../drivers/crypto/ipsec_mb -Ilib/cryptodev -I../lib/cryptodev -Ilib/eal/common -I../lib/eal/common -I. -I.. -Iconfig -I../config -Ilib/eal/include -I../lib/eal/include -Ilib/eal/linux/include -I../lib/eal/linux/include -Ilib/eal/x86/include -I../lib/eal/x86/include -I../kernel/linux -Ilib/eal -I../lib/eal -Ilib/kvargs -I../lib/kvargs -Ilib/log -I../lib/log -Ilib/metrics -I../lib/metrics -Ilib/telemetry -I../lib/telemetry -Ilib/argparse -I../lib/argparse -Ilib/mbuf -I../lib/mbuf -Ilib/mempool -I../lib/mempool -Ilib/ring -I../lib/ring -Ilib/rcu -I../lib/rcu -Idrivers/bus/vdev -I../drivers/bus/vdev -Ilib/net -I../lib/net -Ilib/security -I../lib/security -fdiagnostics-color=always -D_FILE_OFFSET_BITS=64 -Wall -Winvalid-pch -Wextra -Werror -std=c11 -O3 -include rte_config.h -Wvla -Wcast-qual -Wdeprecated -Wformat -Wformat-nonliteral -Wformat-security -Wmissing-declarations -Wmissing-prototypes -Wnested-externs -Wold-style-definition -Wpointer-arith -Wshadow -Wsign-compare -Wstrict-prototypes -Wundef -Wwrite-strings -Wno-packed-not-aligned -Wno-missing-field-initializers -D_GNU_SOURCE -fPIC -march=native -mrtm -DALLOW_EXPERIMENTAL_API -DALLOW_INTERNAL_API -Wno-format-truncation -Wno-address-of-packed-member -Wno-vla -DRTE_COMPONENT_CLASS=pmd_crypto -DRTE_COMPONENT_NAME=ipsec_mb -DRTE_LOG_DEFAULT_LOGTYPE=pmd.crypto.ipsec_mb -MD -MQ drivers/libtmp_rte_crypto_ipsec_mb.a.p/crypto_ipsec_mb_pmd_aesni_mb.c.o -MF drivers/libtmp_rte_crypto_ipsec_mb.a.p/crypto_ipsec_mb_pmd_aesni_mb.c.o.d -o drivers/libtmp_rte_crypto_ipsec_mb.a.p/crypto_ipsec_mb_pmd_aesni_mb.c.o -c ../drivers/crypto/ipsec_mb/pmd_aesni_mb.c
In file included from ../drivers/crypto/ipsec_mb/pmd_aesni_mb.c:7:
../drivers/crypto/ipsec_mb/pmd_aesni_mb_priv.h:1271:18: error: ‘IMB_AUTH_SM3’ undeclared here (not in a function); did you mean ‘IMB_AUTH_NUM’?
 1271 |                 [IMB_AUTH_SM3]                  = 32,
      |                  ^~~~~~~~~~~~
      |                  IMB_AUTH_NUM
../drivers/crypto/ipsec_mb/pmd_aesni_mb_priv.h:1271:18: error: array index in initializer not of integer type
../drivers/crypto/ipsec_mb/pmd_aesni_mb_priv.h:1271:18: note: (near initialization for ‘auth_digest_byte_lengths’)
../drivers/crypto/ipsec_mb/pmd_aesni_mb_priv.h:1272:18: error: ‘IMB_AUTH_HMAC_SM3’ undeclared here (not in a function); did you mean ‘IMB_AUTH_HMAC_SHA_1’?
 1272 |                 [IMB_AUTH_HMAC_SM3]             = 32,
      |                  ^~~~~~~~~~~~~~~~~
      |                  IMB_AUTH_HMAC_SHA_1
../drivers/crypto/ipsec_mb/pmd_aesni_mb_priv.h:1272:18: error: array index in initializer not of integer type
../drivers/crypto/ipsec_mb/pmd_aesni_mb_priv.h:1272:18: note: (near initialization for ‘auth_digest_byte_lengths’)
[2701/3657] Compiling C object drivers/libtmp_rte_crypto_ipsec_mb.a.p/crypto_ipsec_mb_ipsec_mb_private.c.o
[2702/3657] Compiling C object drivers/libtmp_rte_crypto_ipsec_mb.a.p/crypto_ipsec_mb_pmd_aesni_gcm.c.o
[2703/3657] Compiling C object drivers/libtmp_rte_crypto_dpaa_sec.a.p/crypto_dpaa_sec_dpaa_sec.c.o
[2704/3657] Compiling C object drivers/libtmp_rte_crypto_dpaa2_sec.a.p/crypto_dpaa2_sec_dpaa2_sec_dpseci.c.o
[2705/3657] Compiling C object drivers/libtmp_rte_crypto_cnxk.a.p/crypto_cnxk_cn9k_cryptodev_ops.c.o
[2706/3657] Compiling C object drivers/libtmp_rte_crypto_cnxk.a.p/crypto_cnxk_cn20k_cryptodev_ops.c.o
[2707/3657] Compiling C object drivers/libtmp_rte_crypto_cnxk.a.p/crypto_cnxk_cn10k_cryptodev_ops.c.o
ninja: build stopped




*Build Failed #19:
OS: UB2404-64
Target: x86_64-native-linuxapp-gcc
FAILED: drivers/libtmp_rte_crypto_ipsec_mb.a.p/crypto_ipsec_mb_ipsec_mb_ops.c.o 
gcc -Idrivers/libtmp_rte_crypto_ipsec_mb.a.p -Idrivers -I../drivers -Idrivers/crypto/ipsec_mb -I../drivers/crypto/ipsec_mb -Ilib/cryptodev -I../lib/cryptodev -Ilib/eal/common -I../lib/eal/common -I. -I.. -Iconfig -I../config -Ilib/eal/include -I../lib/eal/include -Ilib/eal/linux/include -I../lib/eal/linux/include -Ilib/eal/x86/include -I../lib/eal/x86/include -I../kernel/linux -Ilib/eal -I../lib/eal -Ilib/kvargs -I../lib/kvargs -Ilib/log -I../lib/log -Ilib/metrics -I../lib/metrics -Ilib/telemetry -I../lib/telemetry -Ilib/argparse -I../lib/argparse -Ilib/mbuf -I../lib/mbuf -Ilib/mempool -I../lib/mempool -Ilib/ring -I../lib/ring -Ilib/rcu -I../lib/rcu -Idrivers/bus/vdev -I../drivers/bus/vdev -Ilib/net -I../lib/net -Ilib/security -I../lib/security -fdiagnostics-color=always -D_FILE_OFFSET_BITS=64 -Wall -Winvalid-pch -Wextra -Werror -std=c11 -O3 -include rte_config.h -Wvla -Wcast-qual -Wdeprecated -Wformat -Wformat-nonliteral -Wformat-security -Wmissing-declarations -Wmissing-prototypes -Wnested-externs -Wold-style-definition -Wpointer-arith -Wshadow -Wsign-compare -Wstrict-prototypes -Wundef -Wwrite-strings -Wno-packed-not-aligned -Wno-missing-field-initializers -D_GNU_SOURCE -fPIC -march=native -mrtm -DALLOW_EXPERIMENTAL_API -DALLOW_INTERNAL_API -Wno-format-truncation -Wno-address-of-packed-member -Wno-vla -DRTE_COMPONENT_CLASS=pmd_crypto -DRTE_COMPONENT_NAME=ipsec_mb -DRTE_LOG_DEFAULT_LOGTYPE=pmd.crypto.ipsec_mb -MD -MQ drivers/libtmp_rte_crypto_ipsec_mb.a.p/crypto_ipsec_mb_ipsec_mb_ops.c.o -MF drivers/libtmp_rte_crypto_ipsec_mb.a.p/crypto_ipsec_mb_ipsec_mb_ops.c.o.d -o drivers/libtmp_rte_crypto_ipsec_mb.a.p/crypto_ipsec_mb_ipsec_mb_ops.c.o -c ../drivers/crypto/ipsec_mb/ipsec_mb_ops.c
../drivers/crypto/ipsec_mb/ipsec_mb_ops.c: In function ‘ipsec_mb_asym_session_configure’:
../drivers/crypto/ipsec_mb/ipsec_mb_ops.c:473:12: error: ‘mb_mgr’ may be used uninitialized [-Werror=maybe-uninitialized]
  473 |         if (!mb_mgr)
      |            ^
../drivers/crypto/ipsec_mb/ipsec_mb_ops.c:467:18: note: ‘mb_mgr’ was declared here
  467 |         IMB_MGR *mb_mgr;
      |                  ^~~~~~
cc1: all warnings being treated as errors
[2895/3898] Compiling C object drivers/librte_crypto_ionic.so.27.0.p/meson-generated_.._rte_crypto_ionic.pmd.c.o
[2896/3898] Compiling C object drivers/libtmp_rte_crypto_ipsec_mb.a.p/crypto_ipsec_mb_ipsec_mb_private.c.o
[2897/3898] Compiling C object drivers/libtmp_rte_crypto_ipsec_mb.a.p/crypto_ipsec_mb_pmd_aesni_gcm.c.o
[2898/3898] Compiling C object drivers/libtmp_rte_crypto_dpaa_sec.a.p/crypto_dpaa_sec_dpaa_sec.c.o
[2899/3898] Compiling C object drivers/libtmp_rte_crypto_ipsec_mb.a.p/crypto_ipsec_mb_pmd_aesni_mb.c.o
[2900/3898] Compiling C object drivers/libtmp_rte_crypto_dpaa2_sec.a.p/crypto_dpaa2_sec_dpaa2_sec_dpseci.c.o
[2901/3898] Compiling C object drivers/libtmp_rte_crypto_cnxk.a.p/crypto_cnxk_cn9k_cryptodev_ops.c.o
[2902/3898] Compiling C object drivers/libtmp_rte_crypto_cnxk.a.p/crypto_cnxk_cn20k_cryptodev_ops.c.o
[2903/3898] Compiling C object drivers/libtmp_rte_crypto_cnxk.a.p/crypto_cnxk_cn10k_cryptodev_ops.c.o
ninja: build stopped




*Build Failed #20:
OS: Fedora44-64
Target: x86_64-native-linuxapp-gcc
FAILED: drivers/libtmp_rte_crypto_ipsec_mb.a.p/crypto_ipsec_mb_ipsec_mb_ops.c.o 
gcc -Idrivers/libtmp_rte_crypto_ipsec_mb.a.p -Idrivers -I../drivers -Idrivers/crypto/ipsec_mb -I../drivers/crypto/ipsec_mb -Ilib/cryptodev -I../lib/cryptodev -Ilib/eal/common -I../lib/eal/common -I. -I.. -Iconfig -I../config -Ilib/eal/include -I../lib/eal/include -Ilib/eal/linux/include -I../lib/eal/linux/include -Ilib/eal/x86/include -I../lib/eal/x86/include -I../kernel/linux -Ilib/eal -I../lib/eal -Ilib/kvargs -I../lib/kvargs -Ilib/log -I../lib/log -Ilib/metrics -I../lib/metrics -Ilib/telemetry -I../lib/telemetry -Ilib/argparse -I../lib/argparse -Ilib/mbuf -I../lib/mbuf -Ilib/mempool -I../lib/mempool -Ilib/ring -I../lib/ring -Ilib/rcu -I../lib/rcu -Idrivers/bus/vdev -I../drivers/bus/vdev -Ilib/net -I../lib/net -Ilib/security -I../lib/security -fdiagnostics-color=always -D_FILE_OFFSET_BITS=64 -Wall -Winvalid-pch -Wextra -Werror -std=c11 -O3 -include rte_config.h -Wvla -Wcast-qual -Wdeprecated -Wformat -Wformat-nonliteral -Wformat-security -Wmissing-declarations -Wmissing-prototypes -Wnested-externs -Wold-style-definition -Wpointer-arith -Wshadow -Wsign-compare -Wstrict-prototypes -Wundef -Wwrite-strings -Wno-packed-not-aligned -Wno-missing-field-initializers -fzero-init-padding-bits=all -D_GNU_SOURCE -fPIC -march=native -mrtm -DALLOW_EXPERIMENTAL_API -DALLOW_INTERNAL_API -Wno-format-truncation -Wno-address-of-packed-member -Wno-vla -DRTE_COMPONENT_CLASS=pmd_crypto -DRTE_COMPONENT_NAME=ipsec_mb -DRTE_LOG_DEFAULT_LOGTYPE=pmd.crypto.ipsec_mb -MD -MQ drivers/libtmp_rte_crypto_ipsec_mb.a.p/crypto_ipsec_mb_ipsec_mb_ops.c.o -MF drivers/libtmp_rte_crypto_ipsec_mb.a.p/crypto_ipsec_mb_ipsec_mb_ops.c.o.d -o drivers/libtmp_rte_crypto_ipsec_mb.a.p/crypto_ipsec_mb_ipsec_mb_ops.c.o -c ../drivers/crypto/ipsec_mb/ipsec_mb_ops.c
../drivers/crypto/ipsec_mb/ipsec_mb_ops.c: In function ‘ipsec_mb_asym_session_configure’:
../drivers/crypto/ipsec_mb/ipsec_mb_ops.c:473:12: error: ‘mb_mgr’ may be used uninitialized [-Werror=maybe-uninitialized]
  473 |         if (!mb_mgr)
      |            ^
../drivers/crypto/ipsec_mb/ipsec_mb_ops.c:467:18: note: ‘mb_mgr’ was declared here
  467 |         IMB_MGR *mb_mgr;
      |                  ^~~~~~
cc1: all warnings being treated as errors
[2696/3657] Generating drivers/rte_crypto_ionic.pmd.c with a custom command
[2697/3657] Compiling C object drivers/libtmp_rte_crypto_ipsec_mb.a.p/crypto_ipsec_mb_pmd_aesni_mb.c.o
FAILED: drivers/libtmp_rte_crypto_ipsec_mb.a.p/crypto_ipsec_mb_pmd_aesni_mb.c.o 
gcc -Idrivers/libtmp_rte_crypto_ipsec_mb.a.p -Idrivers -I../drivers -Idrivers/crypto/ipsec_mb -I../drivers/crypto/ipsec_mb -Ilib/cryptodev -I../lib/cryptodev -Ilib/eal/common -I../lib/eal/common -I. -I.. -Iconfig -I../config -Ilib/eal/include -I../lib/eal/include -Ilib/eal/linux/include -I../lib/eal/linux/include -Ilib/eal/x86/include -I../lib/eal/x86/include -I../kernel/linux -Ilib/eal -I../lib/eal -Ilib/kvargs -I../lib/kvargs -Ilib/log -I../lib/log -Ilib/metrics -I../lib/metrics -Ilib/telemetry -I../lib/telemetry -Ilib/argparse -I../lib/argparse -Ilib/mbuf -I../lib/mbuf -Ilib/mempool -I../lib/mempool -Ilib/ring -I../lib/ring -Ilib/rcu -I../lib/rcu -Idrivers/bus/vdev -I../drivers/bus/vdev -Ilib/net -I../lib/net -Ilib/security -I../lib/security -fdiagnostics-color=always -D_FILE_OFFSET_BITS=64 -Wall -Winvalid-pch -Wextra -Werror -std=c11 -O3 -include rte_config.h -Wvla -Wcast-qual -Wdeprecated -Wformat -Wformat-nonliteral -Wformat-security -Wmissing-declarations -Wmissing-prototypes -Wnested-externs -Wold-style-definition -Wpointer-arith -Wshadow -Wsign-compare -Wstrict-prototypes -Wundef -Wwrite-strings -Wno-packed-not-aligned -Wno-missing-field-initializers -fzero-init-padding-bits=all -D_GNU_SOURCE -fPIC -march=native -mrtm -DALLOW_EXPERIMENTAL_API -DALLOW_INTERNAL_API -Wno-format-truncation -Wno-address-of-packed-member -Wno-vla -DRTE_COMPONENT_CLASS=pmd_crypto -DRTE_COMPONENT_NAME=ipsec_mb -DRTE_LOG_DEFAULT_LOGTYPE=pmd.crypto.ipsec_mb -MD -MQ drivers/libtmp_rte_crypto_ipsec_mb.a.p/crypto_ipsec_mb_pmd_aesni_mb.c.o -MF drivers/libtmp_rte_crypto_ipsec_mb.a.p/crypto_ipsec_mb_pmd_aesni_mb.c.o.d -o drivers/libtmp_rte_crypto_ipsec_mb.a.p/crypto_ipsec_mb_pmd_aesni_mb.c.o -c ../drivers/crypto/ipsec_mb/pmd_aesni_mb.c
In file included from ../drivers/crypto/ipsec_mb/pmd_aesni_mb.c:7:
../drivers/crypto/ipsec_mb/pmd_aesni_mb_priv.h:1271:18: error: ‘IMB_AUTH_SM3’ undeclared here (not in a function); did you mean ‘IMB_AUTH_NUM’?
 1271 |                 [IMB_AUTH_SM3]                  = 32,
      |                  ^~~~~~~~~~~~
      |                  IMB_AUTH_NUM
../drivers/crypto/ipsec_mb/pmd_aesni_mb_priv.h:1271:18: error: array index in initializer not of integer type
../drivers/crypto/ipsec_mb/pmd_aesni_mb_priv.h:1271:18: note: (near initialization for ‘auth_digest_byte_lengths’)
../drivers/crypto/ipsec_mb/pmd_aesni_mb_priv.h:1272:18: error: ‘IMB_AUTH_HMAC_SM3’ undeclared here (not in a function); did you mean ‘IMB_AUTH_HMAC_SHA_1’?
 1272 |                 [IMB_AUTH_HMAC_SM3]             = 32,
      |                  ^~~~~~~~~~~~~~~~~
      |                  IMB_AUTH_HMAC_SHA_1
../drivers/crypto/ipsec_mb/pmd_aesni_mb_priv.h:1272:18: error: array index in initializer not of integer type
../drivers/crypto/ipsec_mb/pmd_aesni_mb_priv.h:1272:18: note: (near initialization for ‘auth_digest_byte_lengths’)
[2698/3657] Compiling C object drivers/libtmp_rte_crypto_ipsec_mb.a.p/crypto_ipsec_mb_ipsec_mb_private.c.o
[2699/3657] Compiling C object drivers/libtmp_rte_crypto_ipsec_mb.a.p/crypto_ipsec_mb_pmd_aesni_gcm.c.o
[2700/3657] Compiling C object drivers/libtmp_rte_crypto_dpaa_sec.a.p/crypto_dpaa_sec_dpaa_sec.c.o
[2701/3657] Compiling C object drivers/libtmp_rte_crypto_dpaa2_sec.a.p/crypto_dpaa2_sec_dpaa2_sec_dpseci.c.o
[2702/3657] Compiling C object drivers/libtmp_rte_crypto_cnxk.a.p/crypto_cnxk_cn9k_cryptodev_ops.c.o
[2703/3657] Compiling C object drivers/libtmp_rte_crypto_cnxk.a.p/crypto_cnxk_cn20k_cryptodev_ops.c.o
[2704/3657] Compiling C object drivers/libtmp_rte_crypto_cnxk.a.p/crypto_cnxk_cn10k_cryptodev_ops.c.o
ninja: build stopped




*Build Failed #21:
OS: Fedora44-64
Target: x86_64-native-linuxapp-clang
FAILED: drivers/libtmp_rte_crypto_ipsec_mb.a.p/crypto_ipsec_mb_ipsec_mb_ops.c.o 
clang -Idrivers/libtmp_rte_crypto_ipsec_mb.a.p -Idrivers -I../drivers -Idrivers/crypto/ipsec_mb -I../drivers/crypto/ipsec_mb -Ilib/cryptodev -I../lib/cryptodev -Ilib/eal/common -I../lib/eal/common -I. -I.. -Iconfig -I../config -Ilib/eal/include -I../lib/eal/include -Ilib/eal/linux/include -I../lib/eal/linux/include -Ilib/eal/x86/include -I../lib/eal/x86/include -I../kernel/linux -Ilib/eal -I../lib/eal -Ilib/kvargs -I../lib/kvargs -Ilib/log -I../lib/log -Ilib/metrics -I../lib/metrics -Ilib/telemetry -I../lib/telemetry -Ilib/argparse -I../lib/argparse -Ilib/mbuf -I../lib/mbuf -Ilib/mempool -I../lib/mempool -Ilib/ring -I../lib/ring -Ilib/rcu -I../lib/rcu -Idrivers/bus/vdev -I../drivers/bus/vdev -Ilib/net -I../lib/net -Ilib/security -I../lib/security -fdiagnostics-color=always -D_FILE_OFFSET_BITS=64 -Wall -Winvalid-pch -Wextra -Werror -std=c11 -O3 -include rte_config.h -Wvla -Wcast-qual -Wcomma -Wdeprecated -Wformat -Wformat-nonliteral -Wformat-security -Wmissing-declarations -Wmissing-prototypes -Wnested-externs -Wold-style-definition -Wpointer-arith -Wshadow -Wsign-compare -Wstrict-prototypes -Wundef -Wwrite-strings -Wno-missing-field-initializers -D_GNU_SOURCE -fPIC -march=native -mrtm -DALLOW_EXPERIMENTAL_API -DALLOW_INTERNAL_API -Wno-format-truncation -Wno-address-of-packed-member -Wno-vla -DRTE_COMPONENT_CLASS=pmd_crypto -DRTE_COMPONENT_NAME=ipsec_mb -DRTE_LOG_DEFAULT_LOGTYPE=pmd.crypto.ipsec_mb -DRTE_ANNOTATE_LOCKS -Wthread-safety -MD -MQ drivers/libtmp_rte_crypto_ipsec_mb.a.p/crypto_ipsec_mb_ipsec_mb_ops.c.o -MF drivers/libtmp_rte_crypto_ipsec_mb.a.p/crypto_ipsec_mb_ipsec_mb_ops.c.o.d -o drivers/libtmp_rte_crypto_ipsec_mb.a.p/crypto_ipsec_mb_ipsec_mb_ops.c.o -c ../drivers/crypto/ipsec_mb/ipsec_mb_ops.c
../drivers/crypto/ipsec_mb/ipsec_mb_ops.c:470:6: error: variable 'mb_mgr' is used uninitialized whenever 'if' condition is false [-Werror,-Wsometimes-uninitialized]
  470 |         if (qp != NULL)
      |             ^~~~~~~~~~
../drivers/crypto/ipsec_mb/ipsec_mb_ops.c:473:7: note: uninitialized use occurs here
  473 |         if (!mb_mgr)
      |              ^~~~~~
../drivers/crypto/ipsec_mb/ipsec_mb_ops.c:470:2: note: remove the 'if' if its condition is always true
  470 |         if (qp != NULL)
      |         ^~~~~~~~~~~~~~~
  471 |                 mb_mgr = qp->mb_mgr;
../drivers/crypto/ipsec_mb/ipsec_mb_ops.c:467:17: note: initialize the variable 'mb_mgr' to silence this warning
  467 |         IMB_MGR *mb_mgr;
      |                        ^
      |                         = NULL
1 error generated.
[2698/3657] Compiling C object drivers/libtmp_rte_crypto_ipsec_mb.a.p/crypto_ipsec_mb_pmd_aesni_mb.c.o
FAILED: drivers/libtmp_rte_crypto_ipsec_mb.a.p/crypto_ipsec_mb_pmd_aesni_mb.c.o 
clang -Idrivers/libtmp_rte_crypto_ipsec_mb.a.p -Idrivers -I../drivers -Idrivers/crypto/ipsec_mb -I../drivers/crypto/ipsec_mb -Ilib/cryptodev -I../lib/cryptodev -Ilib/eal/common -I../lib/eal/common -I. -I.. -Iconfig -I../config -Ilib/eal/include -I../lib/eal/include -Ilib/eal/linux/include -I../lib/eal/linux/include -Ilib/eal/x86/include -I../lib/eal/x86/include -I../kernel/linux -Ilib/eal -I../lib/eal -Ilib/kvargs -I../lib/kvargs -Ilib/log -I../lib/log -Ilib/metrics -I../lib/metrics -Ilib/telemetry -I../lib/telemetry -Ilib/argparse -I../lib/argparse -Ilib/mbuf -I../lib/mbuf -Ilib/mempool -I../lib/mempool -Ilib/ring -I../lib/ring -Ilib/rcu -I../lib/rcu -Idrivers/bus/vdev -I../drivers/bus/vdev -Ilib/net -I../lib/net -Ilib/security -I../lib/security -fdiagnostics-color=always -D_FILE_OFFSET_BITS=64 -Wall -Winvalid-pch -Wextra -Werror -std=c11 -O3 -include rte_config.h -Wvla -Wcast-qual -Wcomma -Wdeprecated -Wformat -Wformat-nonliteral -Wformat-security -Wmissing-declarations -Wmissing-prototypes -Wnested-externs -Wold-style-definition -Wpointer-arith -Wshadow -Wsign-compare -Wstrict-prototypes -Wundef -Wwrite-strings -Wno-missing-field-initializers -D_GNU_SOURCE -fPIC -march=native -mrtm -DALLOW_EXPERIMENTAL_API -DALLOW_INTERNAL_API -Wno-format-truncation -Wno-address-of-packed-member -Wno-vla -DRTE_COMPONENT_CLASS=pmd_crypto -DRTE_COMPONENT_NAME=ipsec_mb -DRTE_LOG_DEFAULT_LOGTYPE=pmd.crypto.ipsec_mb -DRTE_ANNOTATE_LOCKS -Wthread-safety -MD -MQ drivers/libtmp_rte_crypto_ipsec_mb.a.p/crypto_ipsec_mb_pmd_aesni_mb.c.o -MF drivers/libtmp_rte_crypto_ipsec_mb.a.p/crypto_ipsec_mb_pmd_aesni_mb.c.o.d -o drivers/libtmp_rte_crypto_ipsec_mb.a.p/crypto_ipsec_mb_pmd_aesni_mb.c.o -c ../drivers/crypto/ipsec_mb/pmd_aesni_mb.c
In file included from ../drivers/crypto/ipsec_mb/pmd_aesni_mb.c:7:
../drivers/crypto/ipsec_mb/pmd_aesni_mb_priv.h:1271:4: error: use of undeclared identifier 'IMB_AUTH_SM3'
 1271 |                 [IMB_AUTH_SM3]                  = 32,
      |                  ^~~~~~~~~~~~
1 error generated.
[2699/3657] Generating drivers/rte_crypto_ionic.pmd.c with a custom command
[2700/3657] Compiling C object drivers/libtmp_rte_crypto_ipsec_mb.a.p/crypto_ipsec_mb_pmd_aesni_gcm.c.o
[2701/3657] Compiling C object drivers/libtmp_rte_crypto_nitrox.a.p/crypto_nitrox_nitrox_sym_capabilities.c.o
[2702/3657] Compiling C object drivers/libtmp_rte_crypto_cnxk.a.p/crypto_cnxk_cn9k_cryptodev_ops.c.o
[2703/3657] Compiling C object drivers/libtmp_rte_crypto_dpaa_sec.a.p/crypto_dpaa_sec_dpaa_sec.c.o
[2704/3657] Compiling C object drivers/libtmp_rte_crypto_dpaa2_sec.a.p/crypto_dpaa2_sec_dpaa2_sec_dpseci.c.o
[2705/3657] Compiling C object drivers/libtmp_rte_crypto_cnxk.a.p/crypto_cnxk_cn20k_cryptodev_ops.c.o
[2706/3657] Compiling C object drivers/libtmp_rte_crypto_cnxk.a.p/crypto_cnxk_cn10k_cryptodev_ops.c.o
ninja: build stopped




*Build Failed #22:
OS: OpenEuler2404-64
Target: x86_64-native-linuxapp-gcc
FAILED: drivers/libtmp_rte_crypto_ipsec_mb.a.p/crypto_ipsec_mb_ipsec_mb_ops.c.o 
gcc -Idrivers/libtmp_rte_crypto_ipsec_mb.a.p -Idrivers -I../drivers -Idrivers/crypto/ipsec_mb -I../drivers/crypto/ipsec_mb -Ilib/cryptodev -I../lib/cryptodev -Ilib/eal/common -I../lib/eal/common -I. -I.. -Iconfig -I../config -Ilib/eal/include -I../lib/eal/include -Ilib/eal/linux/include -I../lib/eal/linux/include -Ilib/eal/x86/include -I../lib/eal/x86/include -I../kernel/linux -Ilib/eal -I../lib/eal -Ilib/kvargs -I../lib/kvargs -Ilib/log -I../lib/log -Ilib/metrics -I../lib/metrics -Ilib/telemetry -I../lib/telemetry -Ilib/argparse -I../lib/argparse -Ilib/mbuf -I../lib/mbuf -Ilib/mempool -I../lib/mempool -Ilib/ring -I../lib/ring -Ilib/rcu -I../lib/rcu -Idrivers/bus/vdev -I../drivers/bus/vdev -Ilib/net -I../lib/net -Ilib/security -I../lib/security -fdiagnostics-color=always -D_FILE_OFFSET_BITS=64 -Wall -Winvalid-pch -Wextra -Werror -std=c11 -O3 -include rte_config.h -Wvla -Wcast-qual -Wdeprecated -Wformat -Wformat-nonliteral -Wformat-security -Wmissing-declarations -Wmissing-prototypes -Wnested-externs -Wold-style-definition -Wpointer-arith -Wshadow -Wsign-compare -Wstrict-prototypes -Wundef -Wwrite-strings -Wno-packed-not-aligned -Wno-missing-field-initializers -D_GNU_SOURCE -fPIC -march=native -mrtm -DALLOW_EXPERIMENTAL_API -DALLOW_INTERNAL_API -Wno-format-truncation -Wno-address-of-packed-member -Wno-vla -DRTE_COMPONENT_CLASS=pmd_crypto -DRTE_COMPONENT_NAME=ipsec_mb -DRTE_LOG_DEFAULT_LOGTYPE=pmd.crypto.ipsec_mb -MD -MQ drivers/libtmp_rte_crypto_ipsec_mb.a.p/crypto_ipsec_mb_ipsec_mb_ops.c.o -MF drivers/libtmp_rte_crypto_ipsec_mb.a.p/crypto_ipsec_mb_ipsec_mb_ops.c.o.d -o drivers/libtmp_rte_crypto_ipsec_mb.a.p/crypto_ipsec_mb_ipsec_mb_ops.c.o -c ../drivers/crypto/ipsec_mb/ipsec_mb_ops.c
../drivers/crypto/ipsec_mb/ipsec_mb_ops.c: In function ‘ipsec_mb_asym_session_configure’:
../drivers/crypto/ipsec_mb/ipsec_mb_ops.c:483:16: error: ‘mb_mgr’ may be used uninitialized [-Werror=maybe-uninitialized]
  483 |         ret = (*pmd_data->asym_session_configure)(mb_mgr,
      |               ~^~~~~~~~~~~~~~~~~~~~~~~~~~~~~~~~~~~~~~~~~~
  484 |                         CRYPTODEV_GET_ASYM_SESS_PRIV(sess), xform);
      |                         ~~~~~~~~~~~~~~~~~~~~~~~~~~~~~~~~~~~~~~~~~~
../drivers/crypto/ipsec_mb/ipsec_mb_ops.c:467:18: note: ‘mb_mgr’ was declared here
  467 |         IMB_MGR *mb_mgr;
      |                  ^~~~~~
cc1: all warnings being treated as errors
[2698/3657] Compiling C object drivers/librte_crypto_ionic.so.27.0.p/meson-generated_.._rte_crypto_ionic.pmd.c.o
[2699/3657] Compiling C object drivers/libtmp_rte_crypto_ipsec_mb.a.p/crypto_ipsec_mb_pmd_aesni_mb.c.o
FAILED: drivers/libtmp_rte_crypto_ipsec_mb.a.p/crypto_ipsec_mb_pmd_aesni_mb.c.o 
gcc -Idrivers/libtmp_rte_crypto_ipsec_mb.a.p -Idrivers -I../drivers -Idrivers/crypto/ipsec_mb -I../drivers/crypto/ipsec_mb -Ilib/cryptodev -I../lib/cryptodev -Ilib/eal/common -I../lib/eal/common -I. -I.. -Iconfig -I../config -Ilib/eal/include -I../lib/eal/include -Ilib/eal/linux/include -I../lib/eal/linux/include -Ilib/eal/x86/include -I../lib/eal/x86/include -I../kernel/linux -Ilib/eal -I../lib/eal -Ilib/kvargs -I../lib/kvargs -Ilib/log -I../lib/log -Ilib/metrics -I../lib/metrics -Ilib/telemetry -I../lib/telemetry -Ilib/argparse -I../lib/argparse -Ilib/mbuf -I../lib/mbuf -Ilib/mempool -I../lib/mempool -Ilib/ring -I../lib/ring -Ilib/rcu -I../lib/rcu -Idrivers/bus/vdev -I../drivers/bus/vdev -Ilib/net -I../lib/net -Ilib/security -I../lib/security -fdiagnostics-color=always -D_FILE_OFFSET_BITS=64 -Wall -Winvalid-pch -Wextra -Werror -std=c11 -O3 -include rte_config.h -Wvla -Wcast-qual -Wdeprecated -Wformat -Wformat-nonliteral -Wformat-security -Wmissing-declarations -Wmissing-prototypes -Wnested-externs -Wold-style-definition -Wpointer-arith -Wshadow -Wsign-compare -Wstrict-prototypes -Wundef -Wwrite-strings -Wno-packed-not-aligned -Wno-missing-field-initializers -D_GNU_SOURCE -fPIC -march=native -mrtm -DALLOW_EXPERIMENTAL_API -DALLOW_INTERNAL_API -Wno-format-truncation -Wno-address-of-packed-member -Wno-vla -DRTE_COMPONENT_CLASS=pmd_crypto -DRTE_COMPONENT_NAME=ipsec_mb -DRTE_LOG_DEFAULT_LOGTYPE=pmd.crypto.ipsec_mb -MD -MQ drivers/libtmp_rte_crypto_ipsec_mb.a.p/crypto_ipsec_mb_pmd_aesni_mb.c.o -MF drivers/libtmp_rte_crypto_ipsec_mb.a.p/crypto_ipsec_mb_pmd_aesni_mb.c.o.d -o drivers/libtmp_rte_crypto_ipsec_mb.a.p/crypto_ipsec_mb_pmd_aesni_mb.c.o -c ../drivers/crypto/ipsec_mb/pmd_aesni_mb.c
In file included from ../drivers/crypto/ipsec_mb/pmd_aesni_mb.c:7:
../drivers/crypto/ipsec_mb/pmd_aesni_mb_priv.h:1271:18: error: ‘IMB_AUTH_SM3’ undeclared here (not in a function); did you mean ‘IMB_AUTH_NUM’?
 1271 |                 [IMB_AUTH_SM3]                  = 32,
      |                  ^~~~~~~~~~~~
      |                  IMB_AUTH_NUM
../drivers/crypto/ipsec_mb/pmd_aesni_mb_priv.h:1271:18: error: array index in initializer not of integer type
../drivers/crypto/ipsec_mb/pmd_aesni_mb_priv.h:1271:18: note: (near initialization for ‘auth_digest_byte_lengths’)
../drivers/crypto/ipsec_mb/pmd_aesni_mb_priv.h:1272:18: error: ‘IMB_AUTH_HMAC_SM3’ undeclared here (not in a function); did you mean ‘IMB_AUTH_HMAC_SHA_1’?
 1272 |                 [IMB_AUTH_HMAC_SM3]             = 32,
      |                  ^~~~~~~~~~~~~~~~~
      |                  IMB_AUTH_HMAC_SHA_1
../drivers/crypto/ipsec_mb/pmd_aesni_mb_priv.h:1272:18: error: array index in initializer not of integer type
../drivers/crypto/ipsec_mb/pmd_aesni_mb_priv.h:1272:18: note: (near initialization for ‘auth_digest_byte_lengths’)
[2700/3657] Compiling C object drivers/libtmp_rte_crypto_ipsec_mb.a.p/crypto_ipsec_mb_ipsec_mb_private.c.o
[2701/3657] Compiling C object drivers/libtmp_rte_crypto_ipsec_mb.a.p/crypto_ipsec_mb_pmd_aesni_gcm.c.o
[2702/3657] Compiling C object drivers/libtmp_rte_crypto_dpaa_sec.a.p/crypto_dpaa_sec_dpaa_sec.c.o
[2703/3657] Compiling C object drivers/libtmp_rte_crypto_dpaa2_sec.a.p/crypto_dpaa2_sec_dpaa2_sec_dpseci.c.o
[2704/3657] Compiling C object drivers/libtmp_rte_crypto_cnxk.a.p/crypto_cnxk_cn9k_cryptodev_ops.c.o
[2705/3657] Compiling C object drivers/libtmp_rte_crypto_cnxk.a.p/crypto_cnxk_cn20k_cryptodev_ops.c.o
[2706/3657] Compiling C object drivers/libtmp_rte_crypto_cnxk.a.p/crypto_cnxk_cn10k_cryptodev_ops.c.o
ninja: build stopped


DPDK STV team


More information about the test-report mailing list