|FAILURE| pw171495-171519 [PATCH v27 25/25] doc: update release notes with NXP DPAA changes
qemudev at loongson.cn
qemudev at loongson.cn
Fri Oct 16 13:40:19 CEST 2026
Test-Label: loongson-unit-loongarch-abi2
Test-Status: FAILURE
http://dpdk.org/patch/171519
_Unit Testing FAIL_
Submitter: Hemant Agrawal <hemant.agrawal at nxp.com>
Date: Fri, 16 Oct 2026 16:49:34 +0530
DPDK git baseline: Repo:dpdk
Branch: main
CommitID: 9a45341f18a1ab47af7123e63d942b90c1b79f38
171495-171519 --> testing fail
Test environment and result as below:
+---------------------+----------------+
| Environment | dpdk_unit_test |
+---------------------+----------------+
| Loongnix-Server 23.2 | FAIL |
+---------------------+----------------+
Loongnix-Server 23.2
Kernel: 6.6.52-1.10.lns23.loongarch64
Compiler: gcc 12.3
Test result details:
1/116 DPDK:fast-tests / acl_autotest OK 2.64s
2/116 DPDK:fast-tests / alarm_autotest OK 1.34s
3/116 DPDK:fast-tests / argparse_autotest OK 0.33s
4/116 DPDK:fast-tests / bitcount_autotest OK 0.34s
5/116 DPDK:fast-tests / bitmap_autotest OK 0.34s
6/116 DPDK:fast-tests / bitops_autotest OK 1.83s
7/116 DPDK:fast-tests / bitset_autotest OK 4.10s
8/116 DPDK:fast-tests / bitratestats_autotest OK 0.34s
9/116 DPDK:fast-tests / bpf_no_instructions_autotest OK 0.34s
10/116 DPDK:fast-tests / bpf_exit_only_autotest OK 0.32s
11/116 DPDK:fast-tests / bpf_no_exit_autotest OK 0.31s
12/116 DPDK:fast-tests / bpf_minimal_working_autotest OK 0.34s
13/116 DPDK:fast-tests / bpf_add_one_autotest OK 0.31s
14/116 DPDK:fast-tests / bpf_subtract_one_autotest OK 0.34s
15/116 DPDK:fast-tests / bpf_jump_over_invalid_first_autotest OK 0.17s
16/116 DPDK:fast-tests / bpf_jump_over_invalid_non_first_autotest OK 0.32s
17/116 DPDK:fast-tests / bpf_load_null_autotest OK 0.34s
18/116 DPDK:fast-tests / bpf_exec_wrong_nb_prog_arg_autotest OK 0.34s
19/116 DPDK:fast-tests / bpf_exec_wrong_flags_autotest OK 0.33s
20/116 DPDK:fast-tests / bpf_autotest OK 0.34s
21/116 DPDK:fast-tests / bpf_stack_alignment_autotest SKIP 0.34s exit status 77
22/116 DPDK:fast-tests / bpf_stack_copy_uint128_autotest SKIP 0.34s exit status 77
23/116 DPDK:fast-tests / bpf_stack_sse2_autotest SKIP 0.33s exit status 77
24/116 DPDK:fast-tests / bpf_stack_memcpy_autotest SKIP 0.34s exit status 77
25/116 DPDK:fast-tests / bpf_elf_autotest SKIP 0.34s exit status 77
26/116 DPDK:fast-tests / bpf_convert_autotest OK 0.34s
27/116 DPDK:fast-tests / bpf_xadd32_autotest OK 0.34s
28/116 DPDK:fast-tests / bpf_xadd64_autotest OK 0.34s
29/116 DPDK:fast-tests / bpf_xchg32_autotest OK 0.34s
30/116 DPDK:fast-tests / bpf_xchg64_autotest OK 0.31s
31/116 DPDK:fast-tests / bpf_atomic_imms_autotest OK 0.34s
32/116 DPDK:fast-tests / bpf_validate_events_autotest OK 0.33s
33/116 DPDK:fast-tests / bpf_validate_autotest OK 0.20s
34/116 DPDK:fast-tests / byteorder_autotest OK 0.32s
35/116 DPDK:fast-tests / cfgfile_autotest OK 0.34s
36/116 DPDK:fast-tests / cksum_autotest OK 0.34s
37/116 DPDK:fast-tests / cmdline_autotest OK 0.34s
38/116 DPDK:fast-tests / common_autotest OK 0.88s
39/116 DPDK:fast-tests / cpuflags_autotest OK 0.34s
40/116 DPDK:fast-tests / crc_autotest OK 0.34s
41/116 DPDK:fast-tests / user_delay_us OK 0.16s
42/116 DPDK:fast-tests / debug_autotest OK 1.24s
43/116 DPDK:fast-tests / devargs_autotest OK 0.33s
44/116 DPDK:fast-tests / eal_fs_autotest OK 0.34s
45/116 DPDK:fast-tests / errno_autotest OK 0.34s
46/116 DPDK:fast-tests / ethdev_link_status OK 0.34s
47/116 DPDK:fast-tests / ethdev_module_eeprom_autotest OK 0.34s
48/116 DPDK:fast-tests / event_ring_autotest OK 0.34s
49/116 DPDK:fast-tests / eventdev_common_autotest OK 0.34s
50/116 DPDK:fast-tests / eventdev_selftest_sw OK 7.24s
51/116 DPDK:fast-tests / fbarray_autotest OK 0.32s
52/116 DPDK:fast-tests / fib_autotest OK 1.06s
53/116 DPDK:fast-tests / fib6_autotest OK 1.11s
54/116 DPDK:fast-tests / graph_autotest OK 0.33s
55/116 DPDK:fast-tests / node_list_dump OK 0.34s
56/116 DPDK:fast-tests / graph_feature_arc_autotest OK 0.34s
57/116 DPDK:fast-tests / hash_autotest OK 1.00s
58/116 DPDK:fast-tests / interrupt_autotest OK 1.63s
59/116 DPDK:fast-tests / ipsec_autotest SKIP 0.34s exit status 77
60/116 DPDK:fast-tests / ipsec_sad_autotest OK 0.67s
61/116 DPDK:fast-tests / kvargs_autotest OK 0.16s
62/116 DPDK:fast-tests / latencystats_autotest OK 0.32s
63/116 DPDK:fast-tests / lcore_var_autotest OK 0.47s
64/116 DPDK:fast-tests / lcores_autotest OK 0.44s
65/116 DPDK:fast-tests / logs_autotest OK 0.34s
66/116 DPDK:fast-tests / lpm_autotest OK 2.20s
67/116 DPDK:fast-tests / lpm6_autotest OK 5.35s
68/116 DPDK:fast-tests / member_autotest OK 1.77s
69/116 DPDK:fast-tests / memcpy_autotest OK 0.89s
70/116 DPDK:fast-tests / meter_autotest OK 0.34s
71/116 DPDK:fast-tests / metrics_autotest OK 0.34s
72/116 DPDK:fast-tests / net_ether_autotest OK 0.99s
73/116 DPDK:fast-tests / net_ipv6_autotest OK 0.34s
74/116 DPDK:fast-tests / pcapng_autotest OK 3.33s
75/116 DPDK:fast-tests / pdump_autotest OK 0.40s
76/116 DPDK:fast-tests / per_lcore_autotest OK 0.44s
77/116 DPDK:fast-tests / pflock_autotest OK 1.07s
78/116 DPDK:fast-tests / pie_autotest OK 0.20s
79/116 DPDK:fast-tests / af_packet_pmd_autotest OK 0.32s
80/116 DPDK:fast-tests / pcap_pmd_autotest OK 0.49s
81/116 DPDK:fast-tests / ring_pmd_autotest OK 0.33s
82/116 DPDK:fast-tests / tap_pmd_autotest SKIP 0.33s exit status 77
83/116 DPDK:fast-tests / power_autotest OK 0.34s
84/116 DPDK:fast-tests / power_caps_autotest SKIP 0.35s exit status 77
85/116 DPDK:fast-tests / power_intel_uncore_autotest SKIP 0.34s exit status 77
86/116 DPDK:fast-tests / prefetch_autotest OK 0.34s
87/116 DPDK:fast-tests / ptr_compress_autotest OK 0.34s
88/116 DPDK:fast-tests / rawdev_autotest OK 0.34s
89/116 DPDK:fast-tests / rcu_qsbr_autotest OK 0.79s
90/116 DPDK:fast-tests / reassembly_autotest OK 0.34s
91/116 DPDK:fast-tests / reorder_autotest OK 0.37s
92/116 DPDK:fast-tests / rib_autotest OK 10.35s
93/116 DPDK:fast-tests / rib6_autotest OK 10.22s
94/116 DPDK:fast-tests / ring_autotest OK 0.35s
95/116 DPDK:fast-tests / rwlock_test1_autotest OK 1.07s
96/116 DPDK:fast-tests / rwlock_rda_autotest OK 5.23s
97/116 DPDK:fast-tests / rwlock_rds_wrm_autotest OK 5.16s
98/116 DPDK:fast-tests / rwlock_rde_wro_autotest OK 5.32s
99/116 DPDK:fast-tests / sched_autotest OK 0.34s
100/116 DPDK:fast-tests / seqlock_autotest OK 2.33s
101/116 DPDK:fast-tests / service_autotest OK 2.86s
102/116 DPDK:fast-tests / soring_autotest OK 0.33s
103/116 DPDK:fast-tests / spinlock_autotest OK 0.43s
104/116 DPDK:fast-tests / stack_pile_autotest FAIL 0.05s exit status 255
105/116 DPDK:fast-tests / string_autotest OK 0.33s
106/116 DPDK:fast-tests / tailq_autotest OK 0.34s
107/116 DPDK:fast-tests / telemetry_data_autotest OK 0.34s
108/116 DPDK:fast-tests / telemetry_json_autotest OK 0.34s
109/116 DPDK:fast-tests / thash_autotest OK 0.17s
110/116 DPDK:fast-tests / threads_autotest OK 0.39s
111/116 DPDK:fast-tests / ticketlock_autotest OK 0.42s
112/116 DPDK:fast-tests / trace_autotest OK 0.16s
113/116 DPDK:fast-tests / trace_autotest_with_traces OK 0.33s
114/116 DPDK:fast-tests / vdev_autotest OK 0.34s
115/116 DPDK:fast-tests / version_autotest OK 0.16s
116/116 DPDK:fast-tests / telemetry_all OK 18.44s
Ok: 106
Expected Fail: 0
Fail: 1
Unexpected Pass: 0
Skipped: 9
Timeout: 0
Test logs for failed test cases:
================================================================================
DPDK:fast-tests / stack_pile_autotest: FAIL
================================================================================
-------------------------------------stdout-------------------------------------
Error with EAL initialization, ret = -1
-------------------------------------stderr-------------------------------------
EAL: Detected CPU lcores: 32
EAL: Detected NUMA nodes: 2
EAL: Detected static linkage of DPDK
EAL: Multi-process socket /run/user/1000/dpdk/stack_pile_autotest/mp_socket
EAL: Selected IOVA mode 'VA'
EAL: get_seg_fd(): open '/dev/hugepages/stack_pile_autotestmap_0_0' failed: Permission denied
EAL: Couldn't get fd on hugepage file
EAL: get_seg_fd(): open '/dev/hugepages/stack_pile_autotestmap_1_0' failed: Permission denied
EAL: Couldn't get fd on hugepage file
EAL: error allocating rte services array
EAL: rte_service_init() failed
LoongArch-unsupported tests NOT executed in this run
(known architecture limitations, confirmed with the dpdk.org maintainers):
- dispatcher_autotest
- eal_flags_mem_autotest
- event_eth_tx_adapter_autotest
- func_reentrancy_autotest
- timer_secondary_autotest
- atomic_autotest
- compressdev_autotest
- distributor_autotest
- eal_flags_c_opt_autotest
- eal_flags_main_opt_autotest
- eal_flags_n_opt_autotest
- eal_flags_pagesz_mem_autotest
- eal_flags_hpet_autotest
- eal_flags_no_huge_autotest
- eal_flags_a_opt_autotest
- eal_flags_b_opt_autotest
- eal_flags_vdev_opt_autotest
- eal_flags_r_opt_autotest
- eal_flags_file_prefix_autotest
- eal_flags_misc_autotest
- external_mem_autotest
- hash_readwrite_func_autotest
- ipfrag_autotest
- malloc_autotest
- mbuf_autotest
- mcslock_autotest
- memory_autotest
- mempool_autotest
- memzone_autotest
- multiprocess_autotest
- pdcp_autotest
- power_cpufreq_autotest
- power_kvm_vm_autotest
- security_autotest
- stack_autotest
- stack_lf_autotest
- timer_autotest
More information about the test-report
mailing list