compilation|FAILURE| pw(172031) sid(39794) job(PER_PATCH_BUILD20749)[v2] examples/l3fwd: fix RFC 1812 checks
sys_stv at intel.com
sys_stv at intel.com
Sat Oct 24 12:41:43 CEST 2026
Test-Label: Intel-compilation
Test-Status: FAILURE
http://dpdk.org/patch/172031
_Compilation issues_
Submitter: Morten Brørup <mb at smartsharesystems.com>
Date: 2026-10-24 10:10:14
Reply_mail: <20261024101014.3232120-1-mb at smartsharesystems.com>
DPDK git baseline: Repo:dpdk, CommitID: 0e03411639496a7f9705494db31cde313f0e80b5
Meson Build Summary: 23 Builds Done, 17 Successful, 6 Failures, 0 Blocked
+-------------------+------------+--------------+------------+------------+-----------+----------+------------+
| os | gcc-static | clang-static | icc-static | gcc-shared | gcc-debug | document | gcc-16byte |
+-------------------+------------+--------------+------------+------------+-----------+----------+------------+
| OpenAnolis8.10-64 | fail | | | | | | |
| FreeBSD15-64 | pass | fail | | pass | pass | | |
| RHEL10-64 | pass | fail | | pass | pass | | |
| SUSE16-64 | pass | fail | | | | | |
| AzureLinux4.0-64 | pass | | | | | | |
| UB2604-32 | pass | | | | | | |
| RHEL10.2-64 | pass | | | | | | |
| UB2604-64 | pass | fail | | | | pass | pass |
| RHEL10.2-64RT | pass | | | | | | |
| UB2404-64 | pass | | | | | | |
| Fedora44-64 | pass | fail | | | | | |
| OpenEuler2404-64 | pass | | | | | | |
+-------------------+------------+--------------+------------+------------+-----------+----------+------------+
Comments:
Because of DPDK bug (https://bugs.dpdk.org/show_bug.cgi?id=928),
All the dpdk-next-* branch add `Ddisable_drivers=event/cnxk` option when build with ICC complier.
Test environment and configuration as below:
OS: OpenAnolis8.10-64
Kernel Version: 5.10.134-18.an8.x86_64
GCC Version: gcc (GCC) 8.5.0 20210514 (Anolis 8.5.0-24.0.1)
Clang Version: 18.1.8 (Red Hat 18.1.8-1.0.1.module+an8.9.0+11287+9d0292d3)
x86_64-native-linuxapp-gcc
OS: FreeBSD15-64
Kernel Version: 15.1-RELEASE-p3
GCC Version: gcc (FreeBSD Ports Collection) 14.2.0
Clang Version: 19.1.7 (https://github.com/llvm/llvm-project.git llvmorg-19.1.7-0-gcd708029e0b2)
x86_64-native-bsdapp-gcc
x86_64-native-bsdapp-clang
x86_64-native-bsdapp-gcc+shared
x86_64-native-bsdapp-gcc+debug
OS: RHEL10-64
Kernel Version: 6.12.0-55.9.1.el10_0.x86_64
GCC Version: gcc (GCC) 14.2.1 20250110 (Red Hat 14.2.1-7)
Clang Version: 19.1.7 (Red Hat, Inc. 19.1.7-2.el10)
x86_64-native-linuxapp-gcc
x86_64-native-linuxapp-clang
x86_64-native-linuxapp-gcc+shared
x86_64-native-linuxapp-gcc+debug
OS: SUSE16-64
Kernel Version: 6.12.0-160000.26-default
GCC Version: gcc (SUSE Linux) 15.2.0
Clang Version: 19.1.7
x86_64-native-linuxapp-clang
x86_64-native-linuxapp-gcc
OS: AzureLinux4.0-64
Kernel Version: 6.18.31-1.3.azl4.x86_64
GCC Version: gcc (GCC) 15.2.1 20260123 (Red Hat 15.2.1-7)
Clang Version: 21.1.8 (Microsoft Corporation 21.1.8-8.azl4)
x86_64-native-linuxapp-gcc
OS: UB2604-32
Kernel Version: 7.0.0-31-generic
GCC Version: gcc (Ubuntu 15.2.0-16ubuntu1) 15.2.0
Clang Version: 21.1.8 (6ubuntu1)
i686-native-linuxapp-gcc
OS: RHEL10.2-64
Kernel Version: 6.12.0-211.7.3.el10_2.x86_64
GCC Version: gcc (GCC) 14.3.1 20251022 (Red Hat 14.3.1-4)
Clang Version: 21.1.8 (Red Hat, Inc. 21.1.8-1.el10)
x86_64-native-linuxapp-gcc
OS: UB2604-64
Kernel Version: 7.0.0-31-generic
GCC Version: gcc (Ubuntu 15.2.0-16ubuntu1) 15.2.0
Clang Version: 21.1.8 (6ubuntu1)
x86_64-native-linuxapp-gcc+16byte
x86_64-native-linuxapp-gcc
x86_64-native-linuxapp-clang
x86_64-native-linuxapp-doc
OS: RHEL10.2-64RT
Kernel Version: 6.12.0-211.7.3.el10_2.x86_64+rt
GCC Version: gcc (GCC) 14.3.1 20251022 (Red Hat 14.3.1-4)
Clang Version: 21.1.8 (Red Hat, Inc. 21.1.8-1.el10)
x86_64-native-linuxapp-gcc
OS: UB2404-64
Kernel Version: 6.8.0-139-generic
GCC Version: gcc (Ubuntu 13.3.0-6ubuntu2~24.04.1) 13.3.0
Clang Version: 18.1.3 (1ubuntu1)
x86_64-native-linuxapp-gcc
OS: Fedora44-64
Kernel Version: 6.19.10-300.fc44.x86_64
GCC Version: gcc (GCC) 16.0.1 20260321 (Red Hat 16.0.1-0)
Clang Version: 22.1.8 (Fedora 22.1.8-4.fc44)
x86_64-native-linuxapp-gcc
x86_64-native-linuxapp-clang
OS: OpenEuler2404-64
Kernel Version: 6.6.0-159.4.13.167.oe2403sp4.x86_64
GCC Version: gcc (GCC) 12.3.1 (openEuler 12.3.1-110.oe2403sp4)
Clang Version: 17.0.6 ( 17.0.6-67.oe2403sp4)
x86_64-native-linuxapp-gcc
*Build Failed #1:
OS: OpenAnolis8.10-64
Target: x86_64-native-linuxapp-gcc
FAILED: examples/dpdk-l3fwd.p/l3fwd_l3fwd_event_generic.c.o
gcc -Iexamples/dpdk-l3fwd.p -Iexamples -I../examples -Iexamples/l3fwd -I../examples/l3fwd -I../examples/common -Ilib/eal/common -I../lib/eal/common -I. -I.. -Iconfig -I../config -Ilib/eal/include -I../lib/eal/include -Ilib/eal/linux/include -I../lib/eal/linux/include -Ilib/eal/x86/include -I../lib/eal/x86/include -I../kernel/linux -Ilib/eal -I../lib/eal -Ilib/kvargs -I../lib/kvargs -Ilib/log -I../lib/log -Ilib/metrics -I../lib/metrics -Ilib/telemetry -I../lib/telemetry -Ilib/argparse -I../lib/argparse -Ilib/mempool -I../lib/mempool -Ilib/ring -I../lib/ring -Ilib/net -I../lib/net -Ilib/mbuf -I../lib/mbuf -Ilib/ethdev -I../lib/ethdev -Ilib/meter -I../lib/meter -Ilib/cmdline -I../lib/cmdline -Ilib/acl -I../lib/acl -Ilib/hash -I../lib/hash -Ilib/rcu -I../lib/rcu -Ilib/lpm -I../lib/lpm -Ilib/fib -I../lib/fib -Ilib/rib -I../lib/rib -Ilib/eventdev -I../lib/eventdev -Ilib/timer -I../lib/timer -Ilib/cryptodev -I../lib/cryptodev -Ilib/dmadev -I../lib/dmadev -fdiagnostics-color=always -D_FILE_OFFSET_BITS=64 -Wall -Winvalid-pch -Wextra -Werror -std=c11 -O3 -include rte_config.h -Wvla -Wcast-qual -Wdeprecated -Wformat -Wformat-nonliteral -Wformat-security -Wmissing-declarations -Wmissing-prototypes -Wnested-externs -Wold-style-definition -Wpointer-arith -Wshadow -Wsign-compare -Wstrict-prototypes -Wundef -Wwrite-strings -Wno-packed-not-aligned -Wno-missing-field-initializers -D_GNU_SOURCE -march=native -mrtm -Wno-vla -DALLOW_EXPERIMENTAL_API -MD -MQ examples/dpdk-l3fwd.p/l3fwd_l3fwd_event_generic.c.o -MF examples/dpdk-l3fwd.p/l3fwd_l3fwd_event_generic.c.o.d -o examples/dpdk-l3fwd.p/l3fwd_l3fwd_event_generic.c.o -c ../examples/l3fwd/l3fwd_event_generic.c
In file included from ../examples/l3fwd/l3fwd_event_generic.c:8:
../examples/l3fwd/l3fwd.h: In function ‘is_valid_ipv4_pkt’:
../examples/l3fwd/l3fwd.h:176:3: error: a label can only be part of a statement and a declaration is not a statement
uint16_t actual_cksum, expected_cksum;
^~~~~~~~
[3638/3737] Compiling C object examples/dpdk-l2fwd-event.p/l2fwd-event_l2fwd_event.c.o
[3639/3737] Compiling C object examples/dpdk-l3fwd.p/l3fwd_l3fwd_fib.c.o
FAILED: examples/dpdk-l3fwd.p/l3fwd_l3fwd_fib.c.o
gcc -Iexamples/dpdk-l3fwd.p -Iexamples -I../examples -Iexamples/l3fwd -I../examples/l3fwd -I../examples/common -Ilib/eal/common -I../lib/eal/common -I. -I.. -Iconfig -I../config -Ilib/eal/include -I../lib/eal/include -Ilib/eal/linux/include -I../lib/eal/linux/include -Ilib/eal/x86/include -I../lib/eal/x86/include -I../kernel/linux -Ilib/eal -I../lib/eal -Ilib/kvargs -I../lib/kvargs -Ilib/log -I../lib/log -Ilib/metrics -I../lib/metrics -Ilib/telemetry -I../lib/telemetry -Ilib/argparse -I../lib/argparse -Ilib/mempool -I../lib/mempool -Ilib/ring -I../lib/ring -Ilib/net -I../lib/net -Ilib/mbuf -I../lib/mbuf -Ilib/ethdev -I../lib/ethdev -Ilib/meter -I../lib/meter -Ilib/cmdline -I../lib/cmdline -Ilib/acl -I../lib/acl -Ilib/hash -I../lib/hash -Ilib/rcu -I../lib/rcu -Ilib/lpm -I../lib/lpm -Ilib/fib -I../lib/fib -Ilib/rib -I../lib/rib -Ilib/eventdev -I../lib/eventdev -Ilib/timer -I../lib/timer -Ilib/cryptodev -I../lib/cryptodev -Ilib/dmadev -I../lib/dmadev -fdiagnostics-color=always -D_FILE_OFFSET_BITS=64 -Wall -Winvalid-pch -Wextra -Werror -std=c11 -O3 -include rte_config.h -Wvla -Wcast-qual -Wdeprecated -Wformat -Wformat-nonliteral -Wformat-security -Wmissing-declarations -Wmissing-prototypes -Wnested-externs -Wold-style-definition -Wpointer-arith -Wshadow -Wsign-compare -Wstrict-prototypes -Wundef -Wwrite-strings -Wno-packed-not-aligned -Wno-missing-field-initializers -D_GNU_SOURCE -march=native -mrtm -Wno-vla -DALLOW_EXPERIMENTAL_API -MD -MQ examples/dpdk-l3fwd.p/l3fwd_l3fwd_fib.c.o -MF examples/dpdk-l3fwd.p/l3fwd_l3fwd_fib.c.o.d -o examples/dpdk-l3fwd.p/l3fwd_l3fwd_fib.c.o -c ../examples/l3fwd/l3fwd_fib.c
In file included from ../examples/l3fwd/l3fwd_fib.c:14:
../examples/l3fwd/l3fwd.h: In function ‘is_valid_ipv4_pkt’:
../examples/l3fwd/l3fwd.h:176:3: error: a label can only be part of a statement and a declaration is not a statement
uint16_t actual_cksum, expected_cksum;
^~~~~~~~
[3640/3737] Compiling C object examples/dpdk-ipv4_multicast.p/ipv4_multicast_main.c.o
[3641/3737] Compiling C object examples/dpdk-l2fwd-event.p/l2fwd-event_main.c.o
[3642/3737] Compiling C object examples/dpdk-l2fwd-keepalive.p/l2fwd-keepalive_main.c.o
[3643/3737] Compiling C object examples/dpdk-l2fwd-crypto.p/l2fwd-crypto_main.c.o
[3644/3737] Compiling C object examples/dpdk-l2fwd-macsec.p/l2fwd-macsec_main.c.o
[3645/3737] Compiling C object examples/dpdk-ipsec-secgw.p/ipsec-secgw_ipsec_worker.c.o
[3646/3737] Linking target examples/dpdk-l2fwd
ninja: build stopped
*Build Failed #2:
OS: FreeBSD15-64
Target: x86_64-native-bsdapp-clang
FAILED: [code=1] examples/dpdk-l3fwd.p/l3fwd_l3fwd_acl.c.o
clang -Iexamples/dpdk-l3fwd.p -Iexamples -I../examples -Iexamples/l3fwd -I../examples/l3fwd -I../examples/common -Ilib/eal/common -I../lib/eal/common -I. -I.. -Iconfig -I../config -Ilib/eal/include -I../lib/eal/include -Ilib/eal/freebsd/include -I../lib/eal/freebsd/include -Ilib/eal/x86/include -I../lib/eal/x86/include -Ilib/eal -I../lib/eal -Ilib/kvargs -I../lib/kvargs -Ilib/log -I../lib/log -Ilib/metrics -I../lib/metrics -Ilib/telemetry -I../lib/telemetry -Ilib/argparse -I../lib/argparse -Ilib/mempool -I../lib/mempool -Ilib/ring -I../lib/ring -Ilib/net -I../lib/net -Ilib/mbuf -I../lib/mbuf -Ilib/ethdev -I../lib/ethdev -Ilib/meter -I../lib/meter -Ilib/cmdline -I../lib/cmdline -Ilib/acl -I../lib/acl -Ilib/hash -I../lib/hash -Ilib/rcu -I../lib/rcu -Ilib/lpm -I../lib/lpm -Ilib/fib -I../lib/fib -Ilib/rib -I../lib/rib -Ilib/eventdev -I../lib/eventdev -Ilib/timer -I../lib/timer -Ilib/cryptodev -I../lib/cryptodev -Ilib/dmadev -I../lib/dmadev -fdiagnostics-color=always -D_FILE_OFFSET_BITS=64 -Wall -Winvalid-pch -Wextra -Werror -std=c11 -O3 -include rte_config.h -Wvla -Wcast-qual -Wcomma -Wdeprecated -Wformat -Wformat-nonliteral -Wformat-security -Wmissing-declarations -Wmissing-prototypes -Wnested-externs -Wold-style-definition -Wpointer-arith -Wshadow -Wsign-compare -Wstrict-prototypes -Wundef -Wwrite-strings -Wno-missing-field-initializers -D_GNU_SOURCE -D__BSD_VISIBLE -march=native -mrtm -Wno-vla -DALLOW_EXPERIMENTAL_API -MD -MQ examples/dpdk-l3fwd.p/l3fwd_l3fwd_acl.c.o -MF examples/dpdk-l3fwd.p/l3fwd_l3fwd_acl.c.o.d -o examples/dpdk-l3fwd.p/l3fwd_l3fwd_acl.c.o -c ../examples/l3fwd/l3fwd_acl.c
In file included from ../examples/l3fwd/l3fwd_acl.c:5:
../examples/l3fwd/l3fwd.h:176:3: error: label followed by a declaration is a C23 extension [-Werror,-Wc23-extensions]
176 | uint16_t actual_cksum, expected_cksum;
| ^
1 error generated.
[2078/2277] Compiling C object examples/dpdk-l3fwd.p/l3fwd_l3fwd_em.c.o
FAILED: [code=1] examples/dpdk-l3fwd.p/l3fwd_l3fwd_em.c.o
clang -Iexamples/dpdk-l3fwd.p -Iexamples -I../examples -Iexamples/l3fwd -I../examples/l3fwd -I../examples/common -Ilib/eal/common -I../lib/eal/common -I. -I.. -Iconfig -I../config -Ilib/eal/include -I../lib/eal/include -Ilib/eal/freebsd/include -I../lib/eal/freebsd/include -Ilib/eal/x86/include -I../lib/eal/x86/include -Ilib/eal -I../lib/eal -Ilib/kvargs -I../lib/kvargs -Ilib/log -I../lib/log -Ilib/metrics -I../lib/metrics -Ilib/telemetry -I../lib/telemetry -Ilib/argparse -I../lib/argparse -Ilib/mempool -I../lib/mempool -Ilib/ring -I../lib/ring -Ilib/net -I../lib/net -Ilib/mbuf -I../lib/mbuf -Ilib/ethdev -I../lib/ethdev -Ilib/meter -I../lib/meter -Ilib/cmdline -I../lib/cmdline -Ilib/acl -I../lib/acl -Ilib/hash -I../lib/hash -Ilib/rcu -I../lib/rcu -Ilib/lpm -I../lib/lpm -Ilib/fib -I../lib/fib -Ilib/rib -I../lib/rib -Ilib/eventdev -I../lib/eventdev -Ilib/timer -I../lib/timer -Ilib/cryptodev -I../lib/cryptodev -Ilib/dmadev -I../lib/dmadev -fdiagnostics-color=always -D_FILE_OFFSET_BITS=64 -Wall -Winvalid-pch -Wextra -Werror -std=c11 -O3 -include rte_config.h -Wvla -Wcast-qual -Wcomma -Wdeprecated -Wformat -Wformat-nonliteral -Wformat-security -Wmissing-declarations -Wmissing-prototypes -Wnested-externs -Wold-style-definition -Wpointer-arith -Wshadow -Wsign-compare -Wstrict-prototypes -Wundef -Wwrite-strings -Wno-missing-field-initializers -D_GNU_SOURCE -D__BSD_VISIBLE -march=native -mrtm -Wno-vla -DALLOW_EXPERIMENTAL_API -MD -MQ examples/dpdk-l3fwd.p/l3fwd_l3fwd_em.c.o -MF examples/dpdk-l3fwd.p/l3fwd_l3fwd_em.c.o.d -o examples/dpdk-l3fwd.p/l3fwd_l3fwd_em.c.o -c ../examples/l3fwd/l3fwd_em.c
In file included from ../examples/l3fwd/l3fwd_em.c:28:
../examples/l3fwd/l3fwd.h:176:3: error: label followed by a declaration is a C23 extension [-Werror,-Wc23-extensions]
176 | uint16_t actual_cksum, expected_cksum;
| ^
1 error generated.
[2079/2277] Compiling C object examples/dpdk-l3fwd.p/l3fwd_l3fwd_event.c.o
FAILED: [code=1] examples/dpdk-l3fwd.p/l3fwd_l3fwd_event.c.o
clang -Iexamples/dpdk-l3fwd.p -Iexamples -I../examples -Iexamples/l3fwd -I../examples/l3fwd -I../examples/common -Ilib/eal/common -I../lib/eal/common -I. -I.. -Iconfig -I../config -Ilib/eal/include -I../lib/eal/include -Ilib/eal/freebsd/include -I../lib/eal/freebsd/include -Ilib/eal/x86/include -I../lib/eal/x86/include -Ilib/eal -I../lib/eal -Ilib/kvargs -I../lib/kvargs -Ilib/log -I../lib/log -Ilib/metrics -I../lib/metrics -Ilib/telemetry -I../lib/telemetry -Ilib/argparse -I../lib/argparse -Ilib/mempool -I../lib/mempool -Ilib/ring -I../lib/ring -Ilib/net -I../lib/net -Ilib/mbuf -I../lib/mbuf -Ilib/ethdev -I../lib/ethdev -Ilib/meter -I../lib/meter -Ilib/cmdline -I../lib/cmdline -Ilib/acl -I../lib/acl -Ilib/hash -I../lib/hash -Ilib/rcu -I../lib/rcu -Ilib/lpm -I../lib/lpm -Ilib/fib -I../lib/fib -Ilib/rib -I../lib/rib -Ilib/eventdev -I../lib/eventdev -Ilib/timer -I../lib/timer -Ilib/cryptodev -I../lib/cryptodev -Ilib/dmadev -I../lib/dmadev -fdiagnostics-color=always -D_FILE_OFFSET_BITS=64 -Wall -Winvalid-pch -Wextra -Werror -std=c11 -O3 -include rte_config.h -Wvla -Wcast-qual -Wcomma -Wdeprecated -Wformat -Wformat-nonliteral -Wformat-security -Wmissing-declarations -Wmissing-prototypes -Wnested-externs -Wold-style-definition -Wpointer-arith -Wshadow -Wsign-compare -Wstrict-prototypes -Wundef -Wwrite-strings -Wno-missing-field-initializers -D_GNU_SOURCE -D__BSD_VISIBLE -march=native -mrtm -Wno-vla -DALLOW_EXPERIMENTAL_API -MD -MQ examples/dpdk-l3fwd.p/l3fwd_l3fwd_event.c.o -MF examples/dpdk-l3fwd.p/l3fwd_l3fwd_event.c.o.d -o examples/dpdk-l3fwd.p/l3fwd_l3fwd_event.c.o -c ../examples/l3fwd/l3fwd_event.c
In file included from ../examples/l3fwd/l3fwd_event.c:11:
../examples/l3fwd/l3fwd.h:176:3: error: label followed by a declaration is a C23 extension [-Werror,-Wc23-extensions]
176 | uint16_t actual_cksum, expected_cksum;
| ^
1 error generated.
[2080/2277] Compiling C object examples/dpdk-l2fwd-macsec.p/l2fwd-macsec_main.c.o
[2081/2277] Compiling C object examples/dpdk-l3fwd.p/l3fwd_l3fwd_event_internal_port.c.o
FAILED: [code=1] examples/dpdk-l3fwd.p/l3fwd_l3fwd_event_internal_port.c.o
clang -Iexamples/dpdk-l3fwd.p -Iexamples -I../examples -Iexamples/l3fwd -I../examples/l3fwd -I../examples/common -Ilib/eal/common -I../lib/eal/common -I. -I.. -Iconfig -I../config -Ilib/eal/include -I../lib/eal/include -Ilib/eal/freebsd/include -I../lib/eal/freebsd/include -Ilib/eal/x86/include -I../lib/eal/x86/include -Ilib/eal -I../lib/eal -Ilib/kvargs -I../lib/kvargs -Ilib/log -I../lib/log -Ilib/metrics -I../lib/metrics -Ilib/telemetry -I../lib/telemetry -Ilib/argparse -I../lib/argparse -Ilib/mempool -I../lib/mempool -Ilib/ring -I../lib/ring -Ilib/net -I../lib/net -Ilib/mbuf -I../lib/mbuf -Ilib/ethdev -I../lib/ethdev -Ilib/meter -I../lib/meter -Ilib/cmdline -I../lib/cmdline -Ilib/acl -I../lib/acl -Ilib/hash -I../lib/hash -Ilib/rcu -I../lib/rcu -Ilib/lpm -I../lib/lpm -Ilib/fib -I../lib/fib -Ilib/rib -I../lib/rib -Ilib/eventdev -I../lib/eventdev -Ilib/timer -I../lib/timer -Ilib/cryptodev -I../lib/cryptodev -Ilib/dmadev -I../lib/dmadev -fdiagnostics-color=always -D_FILE_OFFSET_BITS=64 -Wall -Winvalid-pch -Wextra -Werror -std=c11 -O3 -include rte_config.h -Wvla -Wcast-qual -Wcomma -Wdeprecated -Wformat -Wformat-nonliteral -Wformat-security -Wmissing-declarations -Wmissing-prototypes -Wnested-externs -Wold-style-definition -Wpointer-arith -Wshadow -Wsign-compare -Wstrict-prototypes -Wundef -Wwrite-strings -Wno-missing-field-initializers -D_GNU_SOURCE -D__BSD_VISIBLE -march=native -mrtm -Wno-vla -DALLOW_EXPERIMENTAL_API -MD -MQ examples/dpdk-l3fwd.p/l3fwd_l3fwd_event_internal_port.c.o -MF examples/dpdk-l3fwd.p/l3fwd_l3fwd_event_internal_port.c.o.d -o examples/dpdk-l3fwd.p/l3fwd_l3fwd_event_internal_port.c.o -c ../examples/l3fwd/l3fwd_event_internal_port.c
In file included from ../examples/l3fwd/l3fwd_event_internal_port.c:8:
../examples/l3fwd/l3fwd.h:176:3: error: label followed by a declaration is a C23 extension [-Werror,-Wc23-extensions]
176 | uint16_t actual_cksum, expected_cksum;
| ^
1 error generated.
[2082/2277] Compiling C object examples/dpdk-l3fwd.p/l3fwd_l3fwd_event_generic.c.o
FAILED: [code=1] examples/dpdk-l3fwd.p/l3fwd_l3fwd_event_generic.c.o
clang -Iexamples/dpdk-l3fwd.p -Iexamples -I../examples -Iexamples/l3fwd -I../examples/l3fwd -I../examples/common -Ilib/eal/common -I../lib/eal/common -I. -I.. -Iconfig -I../config -Ilib/eal/include -I../lib/eal/include -Ilib/eal/freebsd/include -I../lib/eal/freebsd/include -Ilib/eal/x86/include -I../lib/eal/x86/include -Ilib/eal -I../lib/eal -Ilib/kvargs -I../lib/kvargs -Ilib/log -I../lib/log -Ilib/metrics -I../lib/metrics -Ilib/telemetry -I../lib/telemetry -Ilib/argparse -I../lib/argparse -Ilib/mempool -I../lib/mempool -Ilib/ring -I../lib/ring -Ilib/net -I../lib/net -Ilib/mbuf -I../lib/mbuf -Ilib/ethdev -I../lib/ethdev -Ilib/meter -I../lib/meter -Ilib/cmdline -I../lib/cmdline -Ilib/acl -I../lib/acl -Ilib/hash -I../lib/hash -Ilib/rcu -I../lib/rcu -Ilib/lpm -I../lib/lpm -Ilib/fib -I../lib/fib -Ilib/rib -I../lib/rib -Ilib/eventdev -I../lib/eventdev -Ilib/timer -I../lib/timer -Ilib/cryptodev -I../lib/cryptodev -Ilib/dmadev -I../lib/dmadev -fdiagnostics-color=always -D_FILE_OFFSET_BITS=64 -Wall -Winvalid-pch -Wextra -Werror -std=c11 -O3 -include rte_config.h -Wvla -Wcast-qual -Wcomma -Wdeprecated -Wformat -Wformat-nonliteral -Wformat-security -Wmissing-declarations -Wmissing-prototypes -Wnested-externs -Wold-style-definition -Wpointer-arith -Wshadow -Wsign-compare -Wstrict-prototypes -Wundef -Wwrite-strings -Wno-missing-field-initializers -D_GNU_SOURCE -D__BSD_VISIBLE -march=native -mrtm -Wno-vla -DALLOW_EXPERIMENTAL_API -MD -MQ examples/dpdk-l3fwd.p/l3fwd_l3fwd_event_generic.c.o -MF examples/dpdk-l3fwd.p/l3fwd_l3fwd_event_generic.c.o.d -o examples/dpdk-l3fwd.p/l3fwd_l3fwd_event_generic.c.o -c ../examples/l3fwd/l3fwd_event_generic.c
In file included from ../examples/l3fwd/l3fwd_event_generic.c:8:
../examples/l3fwd/l3fwd.h:176:3: error: label followed by a declaration is a C23 extension [-Werror,-Wc23-extensions]
176 | uint16_t actual_cksum, expected_cksum;
| ^
1 error generated.
[2083/2277] Compiling C object examples/dpdk-l3fwd.p/l3fwd_l3fwd_fib.c.o
FAILED: [code=1] examples/dpdk-l3fwd.p/l3fwd_l3fwd_fib.c.o
clang -Iexamples/dpdk-l3fwd.p -Iexamples -I../examples -Iexamples/l3fwd -I../examples/l3fwd -I../examples/common -Ilib/eal/common -I../lib/eal/common -I. -I.. -Iconfig -I../config -Ilib/eal/include -I../lib/eal/include -Ilib/eal/freebsd/include -I../lib/eal/freebsd/include -Ilib/eal/x86/include -I../lib/eal/x86/include -Ilib/eal -I../lib/eal -Ilib/kvargs -I../lib/kvargs -Ilib/log -I../lib/log -Ilib/metrics -I../lib/metrics -Ilib/telemetry -I../lib/telemetry -Ilib/argparse -I../lib/argparse -Ilib/mempool -I../lib/mempool -Ilib/ring -I../lib/ring -Ilib/net -I../lib/net -Ilib/mbuf -I../lib/mbuf -Ilib/ethdev -I../lib/ethdev -Ilib/meter -I../lib/meter -Ilib/cmdline -I../lib/cmdline -Ilib/acl -I../lib/acl -Ilib/hash -I../lib/hash -Ilib/rcu -I../lib/rcu -Ilib/lpm -I../lib/lpm -Ilib/fib -I../lib/fib -Ilib/rib -I../lib/rib -Ilib/eventdev -I../lib/eventdev -Ilib/timer -I../lib/timer -Ilib/cryptodev -I../lib/cryptodev -Ilib/dmadev -I../lib/dmadev -fdiagnostics-color=always -D_FILE_OFFSET_BITS=64 -Wall -Winvalid-pch -Wextra -Werror -std=c11 -O3 -include rte_config.h -Wvla -Wcast-qual -Wcomma -Wdeprecated -Wformat -Wformat-nonliteral -Wformat-security -Wmissing-declarations -Wmissing-prototypes -Wnested-externs -Wold-style-definition -Wpointer-arith -Wshadow -Wsign-compare -Wstrict-prototypes -Wundef -Wwrite-strings -Wno-missing-field-initializers -D_GNU_SOURCE -D__BSD_VISIBLE -march=native -mrtm -Wno-vla -DALLOW_EXPERIMENTAL_API -MD -MQ examples/dpdk-l3fwd.p/l3fwd_l3fwd_fib.c.o -MF examples/dpdk-l3fwd.p/l3fwd_l3fwd_fib.c.o.d -o examples/dpdk-l3fwd.p/l3fwd_l3fwd_fib.c.o -c ../examples/l3fwd/l3fwd_fib.c
In file included from ../examples/l3fwd/l3fwd_fib.c:14:
../examples/l3fwd/l3fwd.h:176:3: error: label followed by a declaration is a C23 extension [-Werror,-Wc23-extensions]
176 | uint16_t actual_cksum, expected_cksum;
| ^
1 error generated.
[2084/2277] Compiling C object examples/dpdk-l3fwd.p/l3fwd_l3fwd_lpm.c.o
FAILED: [code=1] examples/dpdk-l3fwd.p/l3fwd_l3fwd_lpm.c.o
clang -Iexamples/dpdk-l3fwd.p -Iexamples -I../examples -Iexamples/l3fwd -I../examples/l3fwd -I../examples/common -Ilib/eal/common -I../lib/eal/common -I. -I.. -Iconfig -I../config -Ilib/eal/include -I../lib/eal/include -Ilib/eal/freebsd/include -I../lib/eal/freebsd/include -Ilib/eal/x86/include -I../lib/eal/x86/include -Ilib/eal -I../lib/eal -Ilib/kvargs -I../lib/kvargs -Ilib/log -I../lib/log -Ilib/metrics -I../lib/metrics -Ilib/telemetry -I../lib/telemetry -Ilib/argparse -I../lib/argparse -Ilib/mempool -I../lib/mempool -Ilib/ring -I../lib/ring -Ilib/net -I../lib/net -Ilib/mbuf -I../lib/mbuf -Ilib/ethdev -I../lib/ethdev -Ilib/meter -I../lib/meter -Ilib/cmdline -I../lib/cmdline -Ilib/acl -I../lib/acl -Ilib/hash -I../lib/hash -Ilib/rcu -I../lib/rcu -Ilib/lpm -I../lib/lpm -Ilib/fib -I../lib/fib -Ilib/rib -I../lib/rib -Ilib/eventdev -I../lib/eventdev -Ilib/timer -I../lib/timer -Ilib/cryptodev -I../lib/cryptodev -Ilib/dmadev -I../lib/dmadev -fdiagnostics-color=always -D_FILE_OFFSET_BITS=64 -Wall -Winvalid-pch -Wextra -Werror -std=c11 -O3 -include rte_config.h -Wvla -Wcast-qual -Wcomma -Wdeprecated -Wformat -Wformat-nonliteral -Wformat-security -Wmissing-declarations -Wmissing-prototypes -Wnested-externs -Wold-style-definition -Wpointer-arith -Wshadow -Wsign-compare -Wstrict-prototypes -Wundef -Wwrite-strings -Wno-missing-field-initializers -D_GNU_SOURCE -D__BSD_VISIBLE -march=native -mrtm -Wno-vla -DALLOW_EXPERIMENTAL_API -MD -MQ examples/dpdk-l3fwd.p/l3fwd_l3fwd_lpm.c.o -MF examples/dpdk-l3fwd.p/l3fwd_l3fwd_lpm.c.o.d -o examples/dpdk-l3fwd.p/l3fwd_l3fwd_lpm.c.o -c ../examples/l3fwd/l3fwd_lpm.c
In file included from ../examples/l3fwd/l3fwd_lpm.c:30:
../examples/l3fwd/l3fwd.h:176:3: error: label followed by a declaration is a C23 extension [-Werror,-Wc23-extensions]
176 | uint16_t actual_cksum, expected_cksum;
| ^
1 error generated.
[2085/2277] Compiling C object examples/dpdk-l3fwd.p/l3fwd_main.c.o
FAILED: [code=1] examples/dpdk-l3fwd.p/l3fwd_main.c.o
clang -Iexamples/dpdk-l3fwd.p -Iexamples -I../examples -Iexamples/l3fwd -I../examples/l3fwd -I../examples/common -Ilib/eal/common -I../lib/eal/common -I. -I.. -Iconfig -I../config -Ilib/eal/include -I../lib/eal/include -Ilib/eal/freebsd/include -I../lib/eal/freebsd/include -Ilib/eal/x86/include -I../lib/eal/x86/include -Ilib/eal -I../lib/eal -Ilib/kvargs -I../lib/kvargs -Ilib/log -I../lib/log -Ilib/metrics -I../lib/metrics -Ilib/telemetry -I../lib/telemetry -Ilib/argparse -I../lib/argparse -Ilib/mempool -I../lib/mempool -Ilib/ring -I../lib/ring -Ilib/net -I../lib/net -Ilib/mbuf -I../lib/mbuf -Ilib/ethdev -I../lib/ethdev -Ilib/meter -I../lib/meter -Ilib/cmdline -I../lib/cmdline -Ilib/acl -I../lib/acl -Ilib/hash -I../lib/hash -Ilib/rcu -I../lib/rcu -Ilib/lpm -I../lib/lpm -Ilib/fib -I../lib/fib -Ilib/rib -I../lib/rib -Ilib/eventdev -I../lib/eventdev -Ilib/timer -I../lib/timer -Ilib/cryptodev -I../lib/cryptodev -Ilib/dmadev -I../lib/dmadev -fdiagnostics-color=always -D_FILE_OFFSET_BITS=64 -Wall -Winvalid-pch -Wextra -Werror -std=c11 -O3 -include rte_config.h -Wvla -Wcast-qual -Wcomma -Wdeprecated -Wformat -Wformat-nonliteral -Wformat-security -Wmissing-declarations -Wmissing-prototypes -Wnested-externs -Wold-style-definition -Wpointer-arith -Wshadow -Wsign-compare -Wstrict-prototypes -Wundef -Wwrite-strings -Wno-missing-field-initializers -D_GNU_SOURCE -D__BSD_VISIBLE -march=native -mrtm -Wno-vla -DALLOW_EXPERIMENTAL_API -MD -MQ examples/dpdk-l3fwd.p/l3fwd_main.c.o -MF examples/dpdk-l3fwd.p/l3fwd_main.c.o.d -o examples/dpdk-l3fwd.p/l3fwd_main.c.o -c ../examples/l3fwd/main.c
In file included from ../examples/l3fwd/main.c:47:
../examples/l3fwd/l3fwd.h:176:3: error: label followed by a declaration is a C23 extension [-Werror,-Wc23-extensions]
176 | uint16_t actual_cksum, expected_cksum;
| ^
1 error generated.
[2086/2277] Compiling C object app/dpdk-test.p/test_test_ring.c.o
ninja: build stopped
*Build Failed #3:
OS: RHEL10-64
Target: x86_64-native-linuxapp-clang
FAILED: [code=1] examples/dpdk-l3fwd.p/l3fwd_l3fwd_acl.c.o
clang -Iexamples/dpdk-l3fwd.p -Iexamples -I../examples -Iexamples/l3fwd -I../examples/l3fwd -I../examples/common -Ilib/eal/common -I../lib/eal/common -I. -I.. -Iconfig -I../config -Ilib/eal/include -I../lib/eal/include -Ilib/eal/linux/include -I../lib/eal/linux/include -Ilib/eal/x86/include -I../lib/eal/x86/include -I../kernel/linux -Ilib/eal -I../lib/eal -Ilib/kvargs -I../lib/kvargs -Ilib/log -I../lib/log -Ilib/metrics -I../lib/metrics -Ilib/telemetry -I../lib/telemetry -Ilib/argparse -I../lib/argparse -Ilib/mempool -I../lib/mempool -Ilib/ring -I../lib/ring -Ilib/net -I../lib/net -Ilib/mbuf -I../lib/mbuf -Ilib/ethdev -I../lib/ethdev -Ilib/meter -I../lib/meter -Ilib/cmdline -I../lib/cmdline -Ilib/acl -I../lib/acl -Ilib/hash -I../lib/hash -Ilib/rcu -I../lib/rcu -Ilib/lpm -I../lib/lpm -Ilib/fib -I../lib/fib -Ilib/rib -I../lib/rib -Ilib/eventdev -I../lib/eventdev -Ilib/timer -I../lib/timer -Ilib/cryptodev -I../lib/cryptodev -Ilib/dmadev -I../lib/dmadev -fdiagnostics-color=always -D_FILE_OFFSET_BITS=64 -Wall -Winvalid-pch -Wextra -Werror -std=c11 -O3 -include rte_config.h -Wvla -Wcast-qual -Wcomma -Wdeprecated -Wformat -Wformat-nonliteral -Wformat-security -Wmissing-declarations -Wmissing-prototypes -Wnested-externs -Wold-style-definition -Wpointer-arith -Wshadow -Wsign-compare -Wstrict-prototypes -Wundef -Wwrite-strings -Wno-missing-field-initializers -D_GNU_SOURCE -march=native -mrtm -Wno-vla -DALLOW_EXPERIMENTAL_API -MD -MQ examples/dpdk-l3fwd.p/l3fwd_l3fwd_acl.c.o -MF examples/dpdk-l3fwd.p/l3fwd_l3fwd_acl.c.o.d -o examples/dpdk-l3fwd.p/l3fwd_l3fwd_acl.c.o -c ../examples/l3fwd/l3fwd_acl.c
In file included from ../examples/l3fwd/l3fwd_acl.c:5:
../examples/l3fwd/l3fwd.h:176:3: error: label followed by a declaration is a C23 extension [-Werror,-Wc23-extensions]
176 | uint16_t actual_cksum, expected_cksum;
| ^
1 error generated.
[3401/3678] Compiling C object examples/dpdk-l2fwd-macsec.p/l2fwd-macsec_main.c.o
[3402/3678] Compiling C object examples/dpdk-l3fwd.p/l3fwd_l3fwd_em.c.o
FAILED: [code=1] examples/dpdk-l3fwd.p/l3fwd_l3fwd_em.c.o
clang -Iexamples/dpdk-l3fwd.p -Iexamples -I../examples -Iexamples/l3fwd -I../examples/l3fwd -I../examples/common -Ilib/eal/common -I../lib/eal/common -I. -I.. -Iconfig -I../config -Ilib/eal/include -I../lib/eal/include -Ilib/eal/linux/include -I../lib/eal/linux/include -Ilib/eal/x86/include -I../lib/eal/x86/include -I../kernel/linux -Ilib/eal -I../lib/eal -Ilib/kvargs -I../lib/kvargs -Ilib/log -I../lib/log -Ilib/metrics -I../lib/metrics -Ilib/telemetry -I../lib/telemetry -Ilib/argparse -I../lib/argparse -Ilib/mempool -I../lib/mempool -Ilib/ring -I../lib/ring -Ilib/net -I../lib/net -Ilib/mbuf -I../lib/mbuf -Ilib/ethdev -I../lib/ethdev -Ilib/meter -I../lib/meter -Ilib/cmdline -I../lib/cmdline -Ilib/acl -I../lib/acl -Ilib/hash -I../lib/hash -Ilib/rcu -I../lib/rcu -Ilib/lpm -I../lib/lpm -Ilib/fib -I../lib/fib -Ilib/rib -I../lib/rib -Ilib/eventdev -I../lib/eventdev -Ilib/timer -I../lib/timer -Ilib/cryptodev -I../lib/cryptodev -Ilib/dmadev -I../lib/dmadev -fdiagnostics-color=always -D_FILE_OFFSET_BITS=64 -Wall -Winvalid-pch -Wextra -Werror -std=c11 -O3 -include rte_config.h -Wvla -Wcast-qual -Wcomma -Wdeprecated -Wformat -Wformat-nonliteral -Wformat-security -Wmissing-declarations -Wmissing-prototypes -Wnested-externs -Wold-style-definition -Wpointer-arith -Wshadow -Wsign-compare -Wstrict-prototypes -Wundef -Wwrite-strings -Wno-missing-field-initializers -D_GNU_SOURCE -march=native -mrtm -Wno-vla -DALLOW_EXPERIMENTAL_API -MD -MQ examples/dpdk-l3fwd.p/l3fwd_l3fwd_em.c.o -MF examples/dpdk-l3fwd.p/l3fwd_l3fwd_em.c.o.d -o examples/dpdk-l3fwd.p/l3fwd_l3fwd_em.c.o -c ../examples/l3fwd/l3fwd_em.c
In file included from ../examples/l3fwd/l3fwd_em.c:28:
../examples/l3fwd/l3fwd.h:176:3: error: label followed by a declaration is a C23 extension [-Werror,-Wc23-extensions]
176 | uint16_t actual_cksum, expected_cksum;
| ^
1 error generated.
[3403/3678] Compiling C object examples/dpdk-l3fwd.p/l3fwd_l3fwd_event.c.o
FAILED: [code=1] examples/dpdk-l3fwd.p/l3fwd_l3fwd_event.c.o
clang -Iexamples/dpdk-l3fwd.p -Iexamples -I../examples -Iexamples/l3fwd -I../examples/l3fwd -I../examples/common -Ilib/eal/common -I../lib/eal/common -I. -I.. -Iconfig -I../config -Ilib/eal/include -I../lib/eal/include -Ilib/eal/linux/include -I../lib/eal/linux/include -Ilib/eal/x86/include -I../lib/eal/x86/include -I../kernel/linux -Ilib/eal -I../lib/eal -Ilib/kvargs -I../lib/kvargs -Ilib/log -I../lib/log -Ilib/metrics -I../lib/metrics -Ilib/telemetry -I../lib/telemetry -Ilib/argparse -I../lib/argparse -Ilib/mempool -I../lib/mempool -Ilib/ring -I../lib/ring -Ilib/net -I../lib/net -Ilib/mbuf -I../lib/mbuf -Ilib/ethdev -I../lib/ethdev -Ilib/meter -I../lib/meter -Ilib/cmdline -I../lib/cmdline -Ilib/acl -I../lib/acl -Ilib/hash -I../lib/hash -Ilib/rcu -I../lib/rcu -Ilib/lpm -I../lib/lpm -Ilib/fib -I../lib/fib -Ilib/rib -I../lib/rib -Ilib/eventdev -I../lib/eventdev -Ilib/timer -I../lib/timer -Ilib/cryptodev -I../lib/cryptodev -Ilib/dmadev -I../lib/dmadev -fdiagnostics-color=always -D_FILE_OFFSET_BITS=64 -Wall -Winvalid-pch -Wextra -Werror -std=c11 -O3 -include rte_config.h -Wvla -Wcast-qual -Wcomma -Wdeprecated -Wformat -Wformat-nonliteral -Wformat-security -Wmissing-declarations -Wmissing-prototypes -Wnested-externs -Wold-style-definition -Wpointer-arith -Wshadow -Wsign-compare -Wstrict-prototypes -Wundef -Wwrite-strings -Wno-missing-field-initializers -D_GNU_SOURCE -march=native -mrtm -Wno-vla -DALLOW_EXPERIMENTAL_API -MD -MQ examples/dpdk-l3fwd.p/l3fwd_l3fwd_event.c.o -MF examples/dpdk-l3fwd.p/l3fwd_l3fwd_event.c.o.d -o examples/dpdk-l3fwd.p/l3fwd_l3fwd_event.c.o -c ../examples/l3fwd/l3fwd_event.c
In file included from ../examples/l3fwd/l3fwd_event.c:11:
../examples/l3fwd/l3fwd.h:176:3: error: label followed by a declaration is a C23 extension [-Werror,-Wc23-extensions]
176 | uint16_t actual_cksum, expected_cksum;
| ^
1 error generated.
[3404/3678] Compiling C object examples/dpdk-l3fwd.p/l3fwd_l3fwd_event_internal_port.c.o
FAILED: [code=1] examples/dpdk-l3fwd.p/l3fwd_l3fwd_event_internal_port.c.o
clang -Iexamples/dpdk-l3fwd.p -Iexamples -I../examples -Iexamples/l3fwd -I../examples/l3fwd -I../examples/common -Ilib/eal/common -I../lib/eal/common -I. -I.. -Iconfig -I../config -Ilib/eal/include -I../lib/eal/include -Ilib/eal/linux/include -I../lib/eal/linux/include -Ilib/eal/x86/include -I../lib/eal/x86/include -I../kernel/linux -Ilib/eal -I../lib/eal -Ilib/kvargs -I../lib/kvargs -Ilib/log -I../lib/log -Ilib/metrics -I../lib/metrics -Ilib/telemetry -I../lib/telemetry -Ilib/argparse -I../lib/argparse -Ilib/mempool -I../lib/mempool -Ilib/ring -I../lib/ring -Ilib/net -I../lib/net -Ilib/mbuf -I../lib/mbuf -Ilib/ethdev -I../lib/ethdev -Ilib/meter -I../lib/meter -Ilib/cmdline -I../lib/cmdline -Ilib/acl -I../lib/acl -Ilib/hash -I../lib/hash -Ilib/rcu -I../lib/rcu -Ilib/lpm -I../lib/lpm -Ilib/fib -I../lib/fib -Ilib/rib -I../lib/rib -Ilib/eventdev -I../lib/eventdev -Ilib/timer -I../lib/timer -Ilib/cryptodev -I../lib/cryptodev -Ilib/dmadev -I../lib/dmadev -fdiagnostics-color=always -D_FILE_OFFSET_BITS=64 -Wall -Winvalid-pch -Wextra -Werror -std=c11 -O3 -include rte_config.h -Wvla -Wcast-qual -Wcomma -Wdeprecated -Wformat -Wformat-nonliteral -Wformat-security -Wmissing-declarations -Wmissing-prototypes -Wnested-externs -Wold-style-definition -Wpointer-arith -Wshadow -Wsign-compare -Wstrict-prototypes -Wundef -Wwrite-strings -Wno-missing-field-initializers -D_GNU_SOURCE -march=native -mrtm -Wno-vla -DALLOW_EXPERIMENTAL_API -MD -MQ examples/dpdk-l3fwd.p/l3fwd_l3fwd_event_internal_port.c.o -MF examples/dpdk-l3fwd.p/l3fwd_l3fwd_event_internal_port.c.o.d -o examples/dpdk-l3fwd.p/l3fwd_l3fwd_event_internal_port.c.o -c ../examples/l3fwd/l3fwd_event_internal_port.c
In file included from ../examples/l3fwd/l3fwd_event_internal_port.c:8:
../examples/l3fwd/l3fwd.h:176:3: error: label followed by a declaration is a C23 extension [-Werror,-Wc23-extensions]
176 | uint16_t actual_cksum, expected_cksum;
| ^
1 error generated.
[3405/3678] Compiling C object examples/dpdk-l3fwd.p/l3fwd_l3fwd_event_generic.c.o
FAILED: [code=1] examples/dpdk-l3fwd.p/l3fwd_l3fwd_event_generic.c.o
clang -Iexamples/dpdk-l3fwd.p -Iexamples -I../examples -Iexamples/l3fwd -I../examples/l3fwd -I../examples/common -Ilib/eal/common -I../lib/eal/common -I. -I.. -Iconfig -I../config -Ilib/eal/include -I../lib/eal/include -Ilib/eal/linux/include -I../lib/eal/linux/include -Ilib/eal/x86/include -I../lib/eal/x86/include -I../kernel/linux -Ilib/eal -I../lib/eal -Ilib/kvargs -I../lib/kvargs -Ilib/log -I../lib/log -Ilib/metrics -I../lib/metrics -Ilib/telemetry -I../lib/telemetry -Ilib/argparse -I../lib/argparse -Ilib/mempool -I../lib/mempool -Ilib/ring -I../lib/ring -Ilib/net -I../lib/net -Ilib/mbuf -I../lib/mbuf -Ilib/ethdev -I../lib/ethdev -Ilib/meter -I../lib/meter -Ilib/cmdline -I../lib/cmdline -Ilib/acl -I../lib/acl -Ilib/hash -I../lib/hash -Ilib/rcu -I../lib/rcu -Ilib/lpm -I../lib/lpm -Ilib/fib -I../lib/fib -Ilib/rib -I../lib/rib -Ilib/eventdev -I../lib/eventdev -Ilib/timer -I../lib/timer -Ilib/cryptodev -I../lib/cryptodev -Ilib/dmadev -I../lib/dmadev -fdiagnostics-color=always -D_FILE_OFFSET_BITS=64 -Wall -Winvalid-pch -Wextra -Werror -std=c11 -O3 -include rte_config.h -Wvla -Wcast-qual -Wcomma -Wdeprecated -Wformat -Wformat-nonliteral -Wformat-security -Wmissing-declarations -Wmissing-prototypes -Wnested-externs -Wold-style-definition -Wpointer-arith -Wshadow -Wsign-compare -Wstrict-prototypes -Wundef -Wwrite-strings -Wno-missing-field-initializers -D_GNU_SOURCE -march=native -mrtm -Wno-vla -DALLOW_EXPERIMENTAL_API -MD -MQ examples/dpdk-l3fwd.p/l3fwd_l3fwd_event_generic.c.o -MF examples/dpdk-l3fwd.p/l3fwd_l3fwd_event_generic.c.o.d -o examples/dpdk-l3fwd.p/l3fwd_l3fwd_event_generic.c.o -c ../examples/l3fwd/l3fwd_event_generic.c
In file included from ../examples/l3fwd/l3fwd_event_generic.c:8:
../examples/l3fwd/l3fwd.h:176:3: error: label followed by a declaration is a C23 extension [-Werror,-Wc23-extensions]
176 | uint16_t actual_cksum, expected_cksum;
| ^
1 error generated.
[3406/3678] Compiling C object examples/dpdk-l3fwd.p/l3fwd_l3fwd_fib.c.o
FAILED: [code=1] examples/dpdk-l3fwd.p/l3fwd_l3fwd_fib.c.o
clang -Iexamples/dpdk-l3fwd.p -Iexamples -I../examples -Iexamples/l3fwd -I../examples/l3fwd -I../examples/common -Ilib/eal/common -I../lib/eal/common -I. -I.. -Iconfig -I../config -Ilib/eal/include -I../lib/eal/include -Ilib/eal/linux/include -I../lib/eal/linux/include -Ilib/eal/x86/include -I../lib/eal/x86/include -I../kernel/linux -Ilib/eal -I../lib/eal -Ilib/kvargs -I../lib/kvargs -Ilib/log -I../lib/log -Ilib/metrics -I../lib/metrics -Ilib/telemetry -I../lib/telemetry -Ilib/argparse -I../lib/argparse -Ilib/mempool -I../lib/mempool -Ilib/ring -I../lib/ring -Ilib/net -I../lib/net -Ilib/mbuf -I../lib/mbuf -Ilib/ethdev -I../lib/ethdev -Ilib/meter -I../lib/meter -Ilib/cmdline -I../lib/cmdline -Ilib/acl -I../lib/acl -Ilib/hash -I../lib/hash -Ilib/rcu -I../lib/rcu -Ilib/lpm -I../lib/lpm -Ilib/fib -I../lib/fib -Ilib/rib -I../lib/rib -Ilib/eventdev -I../lib/eventdev -Ilib/timer -I../lib/timer -Ilib/cryptodev -I../lib/cryptodev -Ilib/dmadev -I../lib/dmadev -fdiagnostics-color=always -D_FILE_OFFSET_BITS=64 -Wall -Winvalid-pch -Wextra -Werror -std=c11 -O3 -include rte_config.h -Wvla -Wcast-qual -Wcomma -Wdeprecated -Wformat -Wformat-nonliteral -Wformat-security -Wmissing-declarations -Wmissing-prototypes -Wnested-externs -Wold-style-definition -Wpointer-arith -Wshadow -Wsign-compare -Wstrict-prototypes -Wundef -Wwrite-strings -Wno-missing-field-initializers -D_GNU_SOURCE -march=native -mrtm -Wno-vla -DALLOW_EXPERIMENTAL_API -MD -MQ examples/dpdk-l3fwd.p/l3fwd_l3fwd_fib.c.o -MF examples/dpdk-l3fwd.p/l3fwd_l3fwd_fib.c.o.d -o examples/dpdk-l3fwd.p/l3fwd_l3fwd_fib.c.o -c ../examples/l3fwd/l3fwd_fib.c
In file included from ../examples/l3fwd/l3fwd_fib.c:14:
../examples/l3fwd/l3fwd.h:176:3: error: label followed by a declaration is a C23 extension [-Werror,-Wc23-extensions]
176 | uint16_t actual_cksum, expected_cksum;
| ^
1 error generated.
[3407/3678] Compiling C object examples/dpdk-l3fwd.p/l3fwd_main.c.o
FAILED: [code=1] examples/dpdk-l3fwd.p/l3fwd_main.c.o
clang -Iexamples/dpdk-l3fwd.p -Iexamples -I../examples -Iexamples/l3fwd -I../examples/l3fwd -I../examples/common -Ilib/eal/common -I../lib/eal/common -I. -I.. -Iconfig -I../config -Ilib/eal/include -I../lib/eal/include -Ilib/eal/linux/include -I../lib/eal/linux/include -Ilib/eal/x86/include -I../lib/eal/x86/include -I../kernel/linux -Ilib/eal -I../lib/eal -Ilib/kvargs -I../lib/kvargs -Ilib/log -I../lib/log -Ilib/metrics -I../lib/metrics -Ilib/telemetry -I../lib/telemetry -Ilib/argparse -I../lib/argparse -Ilib/mempool -I../lib/mempool -Ilib/ring -I../lib/ring -Ilib/net -I../lib/net -Ilib/mbuf -I../lib/mbuf -Ilib/ethdev -I../lib/ethdev -Ilib/meter -I../lib/meter -Ilib/cmdline -I../lib/cmdline -Ilib/acl -I../lib/acl -Ilib/hash -I../lib/hash -Ilib/rcu -I../lib/rcu -Ilib/lpm -I../lib/lpm -Ilib/fib -I../lib/fib -Ilib/rib -I../lib/rib -Ilib/eventdev -I../lib/eventdev -Ilib/timer -I../lib/timer -Ilib/cryptodev -I../lib/cryptodev -Ilib/dmadev -I../lib/dmadev -fdiagnostics-color=always -D_FILE_OFFSET_BITS=64 -Wall -Winvalid-pch -Wextra -Werror -std=c11 -O3 -include rte_config.h -Wvla -Wcast-qual -Wcomma -Wdeprecated -Wformat -Wformat-nonliteral -Wformat-security -Wmissing-declarations -Wmissing-prototypes -Wnested-externs -Wold-style-definition -Wpointer-arith -Wshadow -Wsign-compare -Wstrict-prototypes -Wundef -Wwrite-strings -Wno-missing-field-initializers -D_GNU_SOURCE -march=native -mrtm -Wno-vla -DALLOW_EXPERIMENTAL_API -MD -MQ examples/dpdk-l3fwd.p/l3fwd_main.c.o -MF examples/dpdk-l3fwd.p/l3fwd_main.c.o.d -o examples/dpdk-l3fwd.p/l3fwd_main.c.o -c ../examples/l3fwd/main.c
In file included from ../examples/l3fwd/main.c:47:
../examples/l3fwd/l3fwd.h:176:3: error: label followed by a declaration is a C23 extension [-Werror,-Wc23-extensions]
176 | uint16_t actual_cksum, expected_cksum;
| ^
1 error generated.
[3408/3678] Compiling C object examples/dpdk-l3fwd.p/l3fwd_l3fwd_lpm.c.o
FAILED: [code=1] examples/dpdk-l3fwd.p/l3fwd_l3fwd_lpm.c.o
clang -Iexamples/dpdk-l3fwd.p -Iexamples -I../examples -Iexamples/l3fwd -I../examples/l3fwd -I../examples/common -Ilib/eal/common -I../lib/eal/common -I. -I.. -Iconfig -I../config -Ilib/eal/include -I../lib/eal/include -Ilib/eal/linux/include -I../lib/eal/linux/include -Ilib/eal/x86/include -I../lib/eal/x86/include -I../kernel/linux -Ilib/eal -I../lib/eal -Ilib/kvargs -I../lib/kvargs -Ilib/log -I../lib/log -Ilib/metrics -I../lib/metrics -Ilib/telemetry -I../lib/telemetry -Ilib/argparse -I../lib/argparse -Ilib/mempool -I../lib/mempool -Ilib/ring -I../lib/ring -Ilib/net -I../lib/net -Ilib/mbuf -I../lib/mbuf -Ilib/ethdev -I../lib/ethdev -Ilib/meter -I../lib/meter -Ilib/cmdline -I../lib/cmdline -Ilib/acl -I../lib/acl -Ilib/hash -I../lib/hash -Ilib/rcu -I../lib/rcu -Ilib/lpm -I../lib/lpm -Ilib/fib -I../lib/fib -Ilib/rib -I../lib/rib -Ilib/eventdev -I../lib/eventdev -Ilib/timer -I../lib/timer -Ilib/cryptodev -I../lib/cryptodev -Ilib/dmadev -I../lib/dmadev -fdiagnostics-color=always -D_FILE_OFFSET_BITS=64 -Wall -Winvalid-pch -Wextra -Werror -std=c11 -O3 -include rte_config.h -Wvla -Wcast-qual -Wcomma -Wdeprecated -Wformat -Wformat-nonliteral -Wformat-security -Wmissing-declarations -Wmissing-prototypes -Wnested-externs -Wold-style-definition -Wpointer-arith -Wshadow -Wsign-compare -Wstrict-prototypes -Wundef -Wwrite-strings -Wno-missing-field-initializers -D_GNU_SOURCE -march=native -mrtm -Wno-vla -DALLOW_EXPERIMENTAL_API -MD -MQ examples/dpdk-l3fwd.p/l3fwd_l3fwd_lpm.c.o -MF examples/dpdk-l3fwd.p/l3fwd_l3fwd_lpm.c.o.d -o examples/dpdk-l3fwd.p/l3fwd_l3fwd_lpm.c.o -c ../examples/l3fwd/l3fwd_lpm.c
In file included from ../examples/l3fwd/l3fwd_lpm.c:30:
../examples/l3fwd/l3fwd.h:176:3: error: label followed by a declaration is a C23 extension [-Werror,-Wc23-extensions]
176 | uint16_t actual_cksum, expected_cksum;
| ^
1 error generated.
[3409/3678] Compiling C object examples/dpdk-l3fwd-graph.p/l3fwd-graph_main.c.o
ninja: build stopped
*Build Failed #4:
OS: SUSE16-64
Target: x86_64-native-linuxapp-clang
FAILED: examples/dpdk-l3fwd.p/l3fwd_l3fwd_event.c.o
clang -Iexamples/dpdk-l3fwd.p -Iexamples -I../examples -Iexamples/l3fwd -I../examples/l3fwd -I../examples/common -Ilib/eal/common -I../lib/eal/common -I. -I.. -Iconfig -I../config -Ilib/eal/include -I../lib/eal/include -Ilib/eal/linux/include -I../lib/eal/linux/include -Ilib/eal/x86/include -I../lib/eal/x86/include -I../kernel/linux -Ilib/eal -I../lib/eal -Ilib/kvargs -I../lib/kvargs -Ilib/log -I../lib/log -Ilib/metrics -I../lib/metrics -Ilib/telemetry -I../lib/telemetry -Ilib/argparse -I../lib/argparse -Ilib/mempool -I../lib/mempool -Ilib/ring -I../lib/ring -Ilib/net -I../lib/net -Ilib/mbuf -I../lib/mbuf -Ilib/ethdev -I../lib/ethdev -Ilib/meter -I../lib/meter -Ilib/cmdline -I../lib/cmdline -Ilib/acl -I../lib/acl -Ilib/hash -I../lib/hash -Ilib/rcu -I../lib/rcu -Ilib/lpm -I../lib/lpm -Ilib/fib -I../lib/fib -Ilib/rib -I../lib/rib -Ilib/eventdev -I../lib/eventdev -Ilib/timer -I../lib/timer -Ilib/cryptodev -I../lib/cryptodev -Ilib/dmadev -I../lib/dmadev -fdiagnostics-color=always -D_FILE_OFFSET_BITS=64 -Wall -Winvalid-pch -Wextra -Werror -std=c11 -O3 -include rte_config.h -Wvla -Wcast-qual -Wcomma -Wdeprecated -Wformat -Wformat-nonliteral -Wformat-security -Wmissing-declarations -Wmissing-prototypes -Wnested-externs -Wold-style-definition -Wpointer-arith -Wshadow -Wsign-compare -Wstrict-prototypes -Wundef -Wwrite-strings -Wno-missing-field-initializers -D_GNU_SOURCE -march=native -mrtm -Wno-vla -DALLOW_EXPERIMENTAL_API -MD -MQ examples/dpdk-l3fwd.p/l3fwd_l3fwd_event.c.o -MF examples/dpdk-l3fwd.p/l3fwd_l3fwd_event.c.o.d -o examples/dpdk-l3fwd.p/l3fwd_l3fwd_event.c.o -c ../examples/l3fwd/l3fwd_event.c
In file included from ../examples/l3fwd/l3fwd_event.c:11:
../examples/l3fwd/l3fwd.h:176:3: error: label followed by a declaration is a C23 extension [-Werror,-Wc23-extensions]
176 | uint16_t actual_cksum, expected_cksum;
| ^
1 error generated.
[3559/3660] Compiling C object examples/dpdk-l2fwd-keepalive.p/l2fwd-keepalive_shm.c.o
[3560/3660] Compiling C object examples/dpdk-l2fwd-event.p/l2fwd-event_l2fwd_event.c.o
[3561/3660] Compiling C object examples/dpdk-ipv4_multicast.p/ipv4_multicast_main.c.o
[3562/3660] Compiling C object examples/dpdk-l2fwd-crypto.p/l2fwd-crypto_main.c.o
[3563/3660] Linking target examples/dpdk-l2fwd
[3564/3660] Compiling C object examples/dpdk-l2fwd-jobstats.p/l2fwd-jobstats_main.c.o
[3565/3660] Compiling C object examples/dpdk-ipsec-secgw.p/ipsec-secgw_ipsec-secgw.c.o
[3566/3660] Compiling C object examples/dpdk-l2fwd-event.p/l2fwd-event_l2fwd_poll.c.o
[3567/3660] Compiling C object examples/dpdk-l2fwd-event.p/l2fwd-event_l2fwd_event_internal_port.c.o
ninja: build stopped
*Build Failed #5:
OS: UB2604-64
Target: x86_64-native-linuxapp-clang
FAILED: examples/dpdk-l3fwd.p/l3fwd_l3fwd_lpm.c.o
clang -Iexamples/dpdk-l3fwd.p -Iexamples -I../examples -Iexamples/l3fwd -I../examples/l3fwd -I../examples/common -Ilib/eal/common -I../lib/eal/common -I. -I.. -Iconfig -I../config -Ilib/eal/include -I../lib/eal/include -Ilib/eal/linux/include -I../lib/eal/linux/include -Ilib/eal/x86/include -I../lib/eal/x86/include -I../kernel/linux -Ilib/eal -I../lib/eal -Ilib/kvargs -I../lib/kvargs -Ilib/log -I../lib/log -Ilib/metrics -I../lib/metrics -Ilib/telemetry -I../lib/telemetry -Ilib/argparse -I../lib/argparse -Ilib/mempool -I../lib/mempool -Ilib/ring -I../lib/ring -Ilib/net -I../lib/net -Ilib/mbuf -I../lib/mbuf -Ilib/ethdev -I../lib/ethdev -Ilib/meter -I../lib/meter -Ilib/cmdline -I../lib/cmdline -Ilib/acl -I../lib/acl -Ilib/hash -I../lib/hash -Ilib/rcu -I../lib/rcu -Ilib/lpm -I../lib/lpm -Ilib/fib -I../lib/fib -Ilib/rib -I../lib/rib -Ilib/eventdev -I../lib/eventdev -Ilib/timer -I../lib/timer -Ilib/cryptodev -I../lib/cryptodev -Ilib/dmadev -I../lib/dmadev -fdiagnostics-color=always -D_FILE_OFFSET_BITS=64 -Wall -Winvalid-pch -Wextra -Werror -std=c11 -O3 -include rte_config.h -Wvla -Wcast-qual -Wcomma -Wdeprecated -Wformat -Wformat-nonliteral -Wformat-security -Wmissing-declarations -Wmissing-prototypes -Wnested-externs -Wold-style-definition -Wpointer-arith -Wshadow -Wsign-compare -Wstrict-prototypes -Wundef -Wwrite-strings -Wno-missing-field-initializers -D_GNU_SOURCE -march=native -mrtm -Wno-vla -DALLOW_EXPERIMENTAL_API -MD -MQ examples/dpdk-l3fwd.p/l3fwd_l3fwd_lpm.c.o -MF examples/dpdk-l3fwd.p/l3fwd_l3fwd_lpm.c.o.d -o examples/dpdk-l3fwd.p/l3fwd_l3fwd_lpm.c.o -c ../examples/l3fwd/l3fwd_lpm.c
In file included from ../examples/l3fwd/l3fwd_lpm.c:30:
../examples/l3fwd/l3fwd.h:176:3: error: label followed by a declaration is a C23 extension [-Werror,-Wc23-extensions]
176 | uint16_t actual_cksum, expected_cksum;
| ^
1 error generated.
[3812/3920] Compiling C object examples/dpdk-l2fwd-event.p/l2fwd-event_l2fwd_event_generic.c.o
[3813/3920] Linking target examples/dpdk-helloworld
[3814/3920] Linking target examples/dpdk-ip_reassembly
[3815/3920] Compiling C object examples/dpdk-l2fwd.p/l2fwd_main.c.o
[3816/3920] Linking target examples/dpdk-ipsec-secgw
[3817/3920] Linking target examples/dpdk-ip_fragmentation
[3818/3920] Compiling C object examples/dpdk-l2fwd-event.p/l2fwd-event_l2fwd_common.c.o
[3819/3920] Compiling C object app/dpdk-test.p/test_test_ring_perf.c.o
[3820/3920] Compiling C object app/dpdk-test.p/test_test_ring.c.o
ninja: build stopped
*Build Failed #6:
OS: Fedora44-64
Target: x86_64-native-linuxapp-clang
FAILED: examples/dpdk-l3fwd.p/l3fwd_l3fwd_event.c.o
clang -Iexamples/dpdk-l3fwd.p -Iexamples -I../examples -Iexamples/l3fwd -I../examples/l3fwd -I../examples/common -Ilib/eal/common -I../lib/eal/common -I. -I.. -Iconfig -I../config -Ilib/eal/include -I../lib/eal/include -Ilib/eal/linux/include -I../lib/eal/linux/include -Ilib/eal/x86/include -I../lib/eal/x86/include -I../kernel/linux -Ilib/eal -I../lib/eal -Ilib/kvargs -I../lib/kvargs -Ilib/log -I../lib/log -Ilib/metrics -I../lib/metrics -Ilib/telemetry -I../lib/telemetry -Ilib/argparse -I../lib/argparse -Ilib/mempool -I../lib/mempool -Ilib/ring -I../lib/ring -Ilib/net -I../lib/net -Ilib/mbuf -I../lib/mbuf -Ilib/ethdev -I../lib/ethdev -Ilib/meter -I../lib/meter -Ilib/cmdline -I../lib/cmdline -Ilib/acl -I../lib/acl -Ilib/hash -I../lib/hash -Ilib/rcu -I../lib/rcu -Ilib/lpm -I../lib/lpm -Ilib/fib -I../lib/fib -Ilib/rib -I../lib/rib -Ilib/eventdev -I../lib/eventdev -Ilib/timer -I../lib/timer -Ilib/cryptodev -I../lib/cryptodev -Ilib/dmadev -I../lib/dmadev -fdiagnostics-color=always -D_FILE_OFFSET_BITS=64 -Wall -Winvalid-pch -Wextra -Werror -std=c11 -O3 -include rte_config.h -Wvla -Wcast-qual -Wcomma -Wdeprecated -Wformat -Wformat-nonliteral -Wformat-security -Wmissing-declarations -Wmissing-prototypes -Wnested-externs -Wold-style-definition -Wpointer-arith -Wshadow -Wsign-compare -Wstrict-prototypes -Wundef -Wwrite-strings -Wno-missing-field-initializers -D_GNU_SOURCE -march=native -mrtm -Wno-vla -DALLOW_EXPERIMENTAL_API -MD -MQ examples/dpdk-l3fwd.p/l3fwd_l3fwd_event.c.o -MF examples/dpdk-l3fwd.p/l3fwd_l3fwd_event.c.o.d -o examples/dpdk-l3fwd.p/l3fwd_l3fwd_event.c.o -c ../examples/l3fwd/l3fwd_event.c
In file included from ../examples/l3fwd/l3fwd_event.c:11:
../examples/l3fwd/l3fwd.h:176:3: error: label followed by a declaration is a C23 extension [-Werror,-Wc23-extensions]
176 | uint16_t actual_cksum, expected_cksum;
| ^
1 error generated.
[3583/3678] Compiling C object examples/dpdk-l3fwd.p/l3fwd_l3fwd_em.c.o
FAILED: examples/dpdk-l3fwd.p/l3fwd_l3fwd_em.c.o
clang -Iexamples/dpdk-l3fwd.p -Iexamples -I../examples -Iexamples/l3fwd -I../examples/l3fwd -I../examples/common -Ilib/eal/common -I../lib/eal/common -I. -I.. -Iconfig -I../config -Ilib/eal/include -I../lib/eal/include -Ilib/eal/linux/include -I../lib/eal/linux/include -Ilib/eal/x86/include -I../lib/eal/x86/include -I../kernel/linux -Ilib/eal -I../lib/eal -Ilib/kvargs -I../lib/kvargs -Ilib/log -I../lib/log -Ilib/metrics -I../lib/metrics -Ilib/telemetry -I../lib/telemetry -Ilib/argparse -I../lib/argparse -Ilib/mempool -I../lib/mempool -Ilib/ring -I../lib/ring -Ilib/net -I../lib/net -Ilib/mbuf -I../lib/mbuf -Ilib/ethdev -I../lib/ethdev -Ilib/meter -I../lib/meter -Ilib/cmdline -I../lib/cmdline -Ilib/acl -I../lib/acl -Ilib/hash -I../lib/hash -Ilib/rcu -I../lib/rcu -Ilib/lpm -I../lib/lpm -Ilib/fib -I../lib/fib -Ilib/rib -I../lib/rib -Ilib/eventdev -I../lib/eventdev -Ilib/timer -I../lib/timer -Ilib/cryptodev -I../lib/cryptodev -Ilib/dmadev -I../lib/dmadev -fdiagnostics-color=always -D_FILE_OFFSET_BITS=64 -Wall -Winvalid-pch -Wextra -Werror -std=c11 -O3 -include rte_config.h -Wvla -Wcast-qual -Wcomma -Wdeprecated -Wformat -Wformat-nonliteral -Wformat-security -Wmissing-declarations -Wmissing-prototypes -Wnested-externs -Wold-style-definition -Wpointer-arith -Wshadow -Wsign-compare -Wstrict-prototypes -Wundef -Wwrite-strings -Wno-missing-field-initializers -D_GNU_SOURCE -march=native -mrtm -Wno-vla -DALLOW_EXPERIMENTAL_API -MD -MQ examples/dpdk-l3fwd.p/l3fwd_l3fwd_em.c.o -MF examples/dpdk-l3fwd.p/l3fwd_l3fwd_em.c.o.d -o examples/dpdk-l3fwd.p/l3fwd_l3fwd_em.c.o -c ../examples/l3fwd/l3fwd_em.c
In file included from ../examples/l3fwd/l3fwd_em.c:28:
../examples/l3fwd/l3fwd.h:176:3: error: label followed by a declaration is a C23 extension [-Werror,-Wc23-extensions]
176 | uint16_t actual_cksum, expected_cksum;
| ^
1 error generated.
[3584/3678] Compiling C object examples/dpdk-l2fwd-event.p/l2fwd-event_main.c.o
[3585/3678] Compiling C object examples/dpdk-l3fwd-power.p/l3fwd-power_perf_core.c.o
[3586/3678] Compiling C object examples/dpdk-l2fwd-event.p/l2fwd-event_l2fwd_event.c.o
[3587/3678] Linking target examples/dpdk-ipsec-secgw
[3588/3678] Linking target examples/dpdk-l2fwd-crypto
[3589/3678] Linking target examples/dpdk-l2fwd-keepalive
[3590/3678] Compiling C object app/dpdk-test.p/test_test_ring_perf.c.o
[3591/3678] Compiling C object app/dpdk-test.p/test_test_ring.c.o
ninja: build stopped
DPDK STV team
More information about the test-report
mailing list