compilation|FAILURE| pw(172181) sid(39836) job(PER_PATCH_BUILD20790)Revert "examples/symmetric_mp: do not print or exit in handler"
sys_stv at intel.com
sys_stv at intel.com
Tue Oct 27 16:45:10 CET 2026
Test-Label: Intel-compilation
Test-Status: FAILURE
http://dpdk.org/patch/172181
_Compilation issues_
Submitter: Stephen Hemminger <stephen at networkplumber.org>
Date: 2026-10-27 15:07:48
Reply_mail: <20261027150748.1170031-1-stephen at networkplumber.org>
DPDK git baseline: Repo:dpdk, CommitID: a635140ba95d13826d3185ffbc9246d8fd3ae80b
Meson Build Summary: 23 Builds Done, 3 Successful, 20 Failures, 0 Blocked
+-------------------+------------+--------------+------------+------------+-----------+----------+------------+
| os | gcc-static | clang-static | icc-static | gcc-shared | gcc-debug | document | gcc-16byte |
+-------------------+------------+--------------+------------+------------+-----------+----------+------------+
| OpenAnolis8.10-64 | fail | | | | | | |
| FreeBSD15-64 | fail | fail | | pass | fail | | |
| RHEL10-64 | fail | fail | | pass | fail | | |
| SUSE16-64 | fail | fail | | | | | |
| AzureLinux4.0-64 | fail | | | | | | |
| UB2604-32 | fail | | | | | | |
| RHEL10.2-64 | fail | | | | | | |
| UB2604-64 | fail | fail | | | | pass | fail |
| RHEL10.2-64RT | fail | | | | | | |
| UB2404-64 | fail | | | | | | |
| Fedora44-64 | fail | fail | | | | | |
| OpenEuler2404-64 | fail | | | | | | |
+-------------------+------------+--------------+------------+------------+-----------+----------+------------+
Comments:
Because of DPDK bug (https://bugs.dpdk.org/show_bug.cgi?id=928),
All the dpdk-next-* branch add `Ddisable_drivers=event/cnxk` option when build with ICC complier.
Test environment and configuration as below:
OS: OpenAnolis8.10-64
Kernel Version: 5.10.134-18.an8.x86_64
GCC Version: gcc (GCC) 8.5.0 20210514 (Anolis 8.5.0-24.0.1)
Clang Version: 18.1.8 (Red Hat 18.1.8-1.0.1.module+an8.9.0+11287+9d0292d3)
x86_64-native-linuxapp-gcc
OS: FreeBSD15-64
Kernel Version: 15.1-RELEASE-p3
GCC Version: gcc (FreeBSD Ports Collection) 14.2.0
Clang Version: 19.1.7 (https://github.com/llvm/llvm-project.git llvmorg-19.1.7-0-gcd708029e0b2)
x86_64-native-bsdapp-gcc
x86_64-native-bsdapp-clang
x86_64-native-bsdapp-gcc+shared
x86_64-native-bsdapp-gcc+debug
OS: RHEL10-64
Kernel Version: 6.12.0-55.9.1.el10_0.x86_64
GCC Version: gcc (GCC) 14.2.1 20250110 (Red Hat 14.2.1-7)
Clang Version: 19.1.7 (Red Hat, Inc. 19.1.7-2.el10)
x86_64-native-linuxapp-gcc
x86_64-native-linuxapp-clang
x86_64-native-linuxapp-gcc+shared
x86_64-native-linuxapp-gcc+debug
OS: SUSE16-64
Kernel Version: 6.12.0-160000.26-default
GCC Version: gcc (SUSE Linux) 15.2.0
Clang Version: 19.1.7
x86_64-native-linuxapp-clang
x86_64-native-linuxapp-gcc
OS: AzureLinux4.0-64
Kernel Version: 6.18.31-1.3.azl4.x86_64
GCC Version: gcc (GCC) 15.2.1 20260123 (Red Hat 15.2.1-7)
Clang Version: 21.1.8 (Microsoft Corporation 21.1.8-8.azl4)
x86_64-native-linuxapp-gcc
OS: UB2604-32
Kernel Version: 7.0.0-31-generic
GCC Version: gcc (Ubuntu 15.2.0-16ubuntu1) 15.2.0
Clang Version: 21.1.8 (6ubuntu1)
i686-native-linuxapp-gcc
OS: RHEL10.2-64
Kernel Version: 6.12.0-211.7.3.el10_2.x86_64
GCC Version: gcc (GCC) 14.3.1 20251022 (Red Hat 14.3.1-4)
Clang Version: 21.1.8 (Red Hat, Inc. 21.1.8-1.el10)
x86_64-native-linuxapp-gcc
OS: UB2604-64
Kernel Version: 7.0.0-31-generic
GCC Version: gcc (Ubuntu 15.2.0-16ubuntu1) 15.2.0
Clang Version: 21.1.8 (6ubuntu1)
x86_64-native-linuxapp-gcc+16byte
x86_64-native-linuxapp-gcc
x86_64-native-linuxapp-clang
x86_64-native-linuxapp-doc
OS: RHEL10.2-64RT
Kernel Version: 6.12.0-211.7.3.el10_2.x86_64+rt
GCC Version: gcc (GCC) 14.3.1 20251022 (Red Hat 14.3.1-4)
Clang Version: 21.1.8 (Red Hat, Inc. 21.1.8-1.el10)
x86_64-native-linuxapp-gcc
OS: UB2404-64
Kernel Version: 6.8.0-139-generic
GCC Version: gcc (Ubuntu 13.3.0-6ubuntu2~24.04.1) 13.3.0
Clang Version: 18.1.3 (1ubuntu1)
x86_64-native-linuxapp-gcc
OS: Fedora44-64
Kernel Version: 6.19.10-300.fc44.x86_64
GCC Version: gcc (GCC) 16.0.1 20260321 (Red Hat 16.0.1-0)
Clang Version: 22.1.8 (Fedora 22.1.8-4.fc44)
x86_64-native-linuxapp-gcc
x86_64-native-linuxapp-clang
OS: OpenEuler2404-64
Kernel Version: 6.6.0-159.4.13.167.oe2403sp4.x86_64
GCC Version: gcc (GCC) 12.3.1 (openEuler 12.3.1-110.oe2403sp4)
Clang Version: 17.0.6 ( 17.0.6-67.oe2403sp4)
x86_64-native-linuxapp-gcc
*Build Failed #1:
OS: OpenAnolis8.10-64
Target: x86_64-native-linuxapp-gcc
FAILED: examples/dpdk-symmetric_mp.p/multi_process_symmetric_mp_main.c.o
gcc -Iexamples/dpdk-symmetric_mp.p -Iexamples -I../examples -Iexamples/multi_process/symmetric_mp -I../examples/multi_process/symmetric_mp -I../examples/common -Ilib/eal/common -I../lib/eal/common -I. -I.. -Iconfig -I../config -Ilib/eal/include -I../lib/eal/include -Ilib/eal/linux/include -I../lib/eal/linux/include -Ilib/eal/x86/include -I../lib/eal/x86/include -I../kernel/linux -Ilib/eal -I../lib/eal -Ilib/kvargs -I../lib/kvargs -Ilib/log -I../lib/log -Ilib/metrics -I../lib/metrics -Ilib/telemetry -I../lib/telemetry -Ilib/argparse -I../lib/argparse -Ilib/mempool -I../lib/mempool -Ilib/ring -I../lib/ring -Ilib/net -I../lib/net -Ilib/mbuf -I../lib/mbuf -Ilib/ethdev -I../lib/ethdev -Ilib/meter -I../lib/meter -Ilib/cmdline -I../lib/cmdline -fdiagnostics-color=always -D_FILE_OFFSET_BITS=64 -Wall -Winvalid-pch -Wextra -Werror -std=c11 -O3 -include rte_config.h -Wvla -Wcast-qual -Wdeprecated -Wformat -Wformat-nonliteral -Wformat-security -Wmissing-declarations -Wmissing-prototypes -Wnested-externs -Wold-style-definition -Wpointer-arith -Wshadow -Wsign-compare -Wstrict-prototypes -Wundef -Wwrite-strings -Wno-packed-not-aligned -Wno-missing-field-initializers -D_GNU_SOURCE -march=native -mrtm -DALLOW_EXPERIMENTAL_API -MD -MQ examples/dpdk-symmetric_mp.p/multi_process_symmetric_mp_main.c.o -MF examples/dpdk-symmetric_mp.p/multi_process_symmetric_mp_main.c.o.d -o examples/dpdk-symmetric_mp.p/multi_process_symmetric_mp_main.c.o -c ../examples/multi_process/symmetric_mp/main.c
../examples/multi_process/symmetric_mp/main.c: In function ‘print_stats’:
../examples/multi_process/symmetric_mp/main.c:103:17: error: unused parameter ‘signum’ [-Werror=unused-parameter]
print_stats(int signum)
~~~~^~~~~~
cc1: all warnings being treated as errors
[3694/3738] Compiling C object examples/dpdk-ptpclient.p/ptpclient_ptpclient.c.o
[3695/3738] Compiling C object examples/dpdk-qos_meter.p/qos_meter_main.c.o
[3696/3738] Compiling C object examples/dpdk-qos_sched.p/qos_sched_args.c.o
[3697/3738] Compiling C object examples/dpdk-qos_sched.p/qos_sched_main.c.o
[3698/3738] Compiling C object examples/dpdk-packet_ordering.p/packet_ordering_main.c.o
[3699/3738] Compiling C object examples/dpdk-qos_sched.p/qos_sched_cfg_file.c.o
[3700/3738] Linking target examples/dpdk-ntb
[3701/3738] Linking target examples/dpdk-pipeline
[3702/3738] Linking target examples/dpdk-simple_mp
ninja: build stopped
*Build Failed #2:
OS: FreeBSD15-64
Target: x86_64-native-bsdapp-gcc
FAILED: [code=1] examples/dpdk-symmetric_mp.p/multi_process_symmetric_mp_main.c.o
gcc -Iexamples/dpdk-symmetric_mp.p -Iexamples -I../examples -Iexamples/multi_process/symmetric_mp -I../examples/multi_process/symmetric_mp -I../examples/common -Ilib/eal/common -I../lib/eal/common -I. -I.. -Iconfig -I../config -Ilib/eal/include -I../lib/eal/include -Ilib/eal/freebsd/include -I../lib/eal/freebsd/include -Ilib/eal/x86/include -I../lib/eal/x86/include -Ilib/eal -I../lib/eal -Ilib/kvargs -I../lib/kvargs -Ilib/log -I../lib/log -Ilib/metrics -I../lib/metrics -Ilib/telemetry -I../lib/telemetry -Ilib/argparse -I../lib/argparse -Ilib/mempool -I../lib/mempool -Ilib/ring -I../lib/ring -Ilib/net -I../lib/net -Ilib/mbuf -I../lib/mbuf -Ilib/ethdev -I../lib/ethdev -Ilib/meter -I../lib/meter -Ilib/cmdline -I../lib/cmdline -fdiagnostics-color=always -D_FILE_OFFSET_BITS=64 -Wall -Winvalid-pch -Wextra -Werror -std=c11 -O3 -include rte_config.h -Wvla -Wcast-qual -Wdeprecated -Wformat -Wformat-nonliteral -Wformat-security -Wmissing-declarations -Wmissing-prototypes -Wnested-externs -Wold-style-definition -Wpointer-arith -Wshadow -Wsign-compare -Wstrict-prototypes -Wundef -Wwrite-strings -Wno-packed-not-aligned -Wno-missing-field-initializers -D_GNU_SOURCE -D__BSD_VISIBLE -march=native -mno-avx512f -mrtm -DALLOW_EXPERIMENTAL_API -MD -MQ examples/dpdk-symmetric_mp.p/multi_process_symmetric_mp_main.c.o -MF examples/dpdk-symmetric_mp.p/multi_process_symmetric_mp_main.c.o.d -o examples/dpdk-symmetric_mp.p/multi_process_symmetric_mp_main.c.o -c ../examples/multi_process/symmetric_mp/main.c
../examples/multi_process/symmetric_mp/main.c: In function 'print_stats':
../examples/multi_process/symmetric_mp/main.c:103:17: error: unused parameter 'signum' [-Werror=unused-parameter]
103 | print_stats(int signum)
| ~~~~^~~~~~
cc1: all warnings being treated as errors
[2086/2257] Compiling C object examples/dpdk-ptpclient.p/ptpclient_ptpclient.c.o
[2087/2257] Compiling C object examples/dpdk-simple_mp.p/multi_process_simple_mp_main.c.o
[2088/2257] Compiling C object examples/dpdk-simple_mp.p/multi_process_simple_mp_mp_commands.c.o
[2089/2257] Compiling C object examples/dpdk-qos_sched.p/qos_sched_args.c.o
[2090/2257] Compiling C object examples/dpdk-mp_server.p/multi_process_client_server_mp_mp_server_main.c.o
[2091/2257] Compiling C object examples/dpdk-qos_meter.p/qos_meter_main.c.o
[2092/2257] Compiling C object examples/dpdk-qos_sched.p/qos_sched_cfg_file.c.o
[2093/2257] Compiling C object examples/dpdk-qos_sched.p/qos_sched_app_thread.c.o
[2094/2257] Compiling C object examples/dpdk-packet_ordering.p/packet_ordering_main.c.o
ninja: build stopped
*Build Failed #3:
OS: FreeBSD15-64
Target: x86_64-native-bsdapp-clang
FAILED: [code=1] examples/dpdk-symmetric_mp.p/multi_process_symmetric_mp_main.c.o
clang -Iexamples/dpdk-symmetric_mp.p -Iexamples -I../examples -Iexamples/multi_process/symmetric_mp -I../examples/multi_process/symmetric_mp -I../examples/common -Ilib/eal/common -I../lib/eal/common -I. -I.. -Iconfig -I../config -Ilib/eal/include -I../lib/eal/include -Ilib/eal/freebsd/include -I../lib/eal/freebsd/include -Ilib/eal/x86/include -I../lib/eal/x86/include -Ilib/eal -I../lib/eal -Ilib/kvargs -I../lib/kvargs -Ilib/log -I../lib/log -Ilib/metrics -I../lib/metrics -Ilib/telemetry -I../lib/telemetry -Ilib/argparse -I../lib/argparse -Ilib/mempool -I../lib/mempool -Ilib/ring -I../lib/ring -Ilib/net -I../lib/net -Ilib/mbuf -I../lib/mbuf -Ilib/ethdev -I../lib/ethdev -Ilib/meter -I../lib/meter -Ilib/cmdline -I../lib/cmdline -fdiagnostics-color=always -D_FILE_OFFSET_BITS=64 -Wall -Winvalid-pch -Wextra -Werror -std=c11 -O3 -include rte_config.h -Wvla -Wcast-qual -Wcomma -Wdeprecated -Wformat -Wformat-nonliteral -Wformat-security -Wmissing-declarations -Wmissing-prototypes -Wnested-externs -Wold-style-definition -Wpointer-arith -Wshadow -Wsign-compare -Wstrict-prototypes -Wundef -Wwrite-strings -Wno-missing-field-initializers -D_GNU_SOURCE -D__BSD_VISIBLE -march=native -mrtm -DALLOW_EXPERIMENTAL_API -MD -MQ examples/dpdk-symmetric_mp.p/multi_process_symmetric_mp_main.c.o -MF examples/dpdk-symmetric_mp.p/multi_process_symmetric_mp_main.c.o.d -o examples/dpdk-symmetric_mp.p/multi_process_symmetric_mp_main.c.o -c ../examples/multi_process/symmetric_mp/main.c
../examples/multi_process/symmetric_mp/main.c:103:17: error: unused parameter 'signum' [-Werror,-Wunused-parameter]
103 | print_stats(int signum)
| ^
1 error generated.
[2098/2278] Compiling C object examples/dpdk-simple_mp.p/multi_process_simple_mp_main.c.o
[2099/2278] Compiling C object examples/dpdk-mp_server.p/multi_process_client_server_mp_mp_server_main.c.o
[2100/2278] Compiling C object examples/dpdk-qos_meter.p/qos_meter_main.c.o
[2101/2278] Compiling C object examples/dpdk-qos_sched.p/qos_sched_args.c.o
[2102/2278] Compiling C object examples/dpdk-ptpclient.p/ptpclient_ptpclient.c.o
[2103/2278] Compiling C object examples/dpdk-qos_sched.p/qos_sched_cfg_file.c.o
[2104/2278] Compiling C object examples/dpdk-qos_sched.p/qos_sched_app_thread.c.o
[2105/2278] Compiling C object examples/dpdk-qos_sched.p/qos_sched_cmdline.c.o
[2106/2278] Compiling C object examples/dpdk-packet_ordering.p/packet_ordering_main.c.o
ninja: build stopped
*Build Failed #4:
OS: FreeBSD15-64
Target: x86_64-native-bsdapp-gcc+debug
FAILED: [code=1] examples/dpdk-symmetric_mp.p/multi_process_symmetric_mp_main.c.o
gcc -Iexamples/dpdk-symmetric_mp.p -Iexamples -I../examples -Iexamples/multi_process/symmetric_mp -I../examples/multi_process/symmetric_mp -I../examples/common -Ilib/eal/common -I../lib/eal/common -I. -I.. -Iconfig -I../config -Ilib/eal/include -I../lib/eal/include -Ilib/eal/freebsd/include -I../lib/eal/freebsd/include -Ilib/eal/x86/include -I../lib/eal/x86/include -Ilib/eal -I../lib/eal -Ilib/kvargs -I../lib/kvargs -Ilib/log -I../lib/log -Ilib/metrics -I../lib/metrics -Ilib/telemetry -I../lib/telemetry -Ilib/argparse -I../lib/argparse -Ilib/mempool -I../lib/mempool -Ilib/ring -I../lib/ring -Ilib/net -I../lib/net -Ilib/mbuf -I../lib/mbuf -Ilib/ethdev -I../lib/ethdev -Ilib/meter -I../lib/meter -Ilib/cmdline -I../lib/cmdline -fdiagnostics-color=always -D_FILE_OFFSET_BITS=64 -Wall -Winvalid-pch -Wextra -Werror -std=c11 -O2 -g -include rte_config.h -Wvla -Wcast-qual -Wdeprecated -Wformat -Wformat-nonliteral -Wformat-security -Wmissing-declarations -Wmissing-prototypes -Wnested-externs -Wold-style-definition -Wpointer-arith -Wshadow -Wsign-compare -Wstrict-prototypes -Wundef -Wwrite-strings -Wno-packed-not-aligned -Wno-missing-field-initializers -D_GNU_SOURCE -D__BSD_VISIBLE -march=native -mno-avx512f -mrtm -DALLOW_EXPERIMENTAL_API -MD -MQ examples/dpdk-symmetric_mp.p/multi_process_symmetric_mp_main.c.o -MF examples/dpdk-symmetric_mp.p/multi_process_symmetric_mp_main.c.o.d -o examples/dpdk-symmetric_mp.p/multi_process_symmetric_mp_main.c.o -c ../examples/multi_process/symmetric_mp/main.c
../examples/multi_process/symmetric_mp/main.c: In function 'print_stats':
../examples/multi_process/symmetric_mp/main.c:103:17: error: unused parameter 'signum' [-Werror=unused-parameter]
103 | print_stats(int signum)
| ~~~~^~~~~~
cc1: all warnings being treated as errors
[2087/2257] Compiling C object examples/dpdk-simple_mp.p/multi_process_simple_mp_mp_commands.c.o
[2088/2257] Compiling C object examples/dpdk-qos_sched.p/qos_sched_args.c.o
[2089/2257] Compiling C object examples/dpdk-simple_mp.p/multi_process_simple_mp_main.c.o
[2090/2257] Compiling C object examples/dpdk-ptpclient.p/ptpclient_ptpclient.c.o
[2091/2257] Compiling C object examples/dpdk-qos_meter.p/qos_meter_main.c.o
[2092/2257] Compiling C object examples/dpdk-qos_sched.p/qos_sched_cfg_file.c.o
[2093/2257] Compiling C object examples/dpdk-qos_sched.p/qos_sched_cmdline.c.o
[2094/2257] Compiling C object examples/dpdk-qos_sched.p/qos_sched_app_thread.c.o
[2095/2257] Compiling C object examples/dpdk-packet_ordering.p/packet_ordering_main.c.o
ninja: build stopped
*Build Failed #5:
OS: RHEL10-64
Target: x86_64-native-linuxapp-gcc
FAILED: [code=1] examples/dpdk-symmetric_mp.p/multi_process_symmetric_mp_main.c.o
gcc -Iexamples/dpdk-symmetric_mp.p -Iexamples -I../examples -Iexamples/multi_process/symmetric_mp -I../examples/multi_process/symmetric_mp -I../examples/common -Ilib/eal/common -I../lib/eal/common -I. -I.. -Iconfig -I../config -Ilib/eal/include -I../lib/eal/include -Ilib/eal/linux/include -I../lib/eal/linux/include -Ilib/eal/x86/include -I../lib/eal/x86/include -I../kernel/linux -Ilib/eal -I../lib/eal -Ilib/kvargs -I../lib/kvargs -Ilib/log -I../lib/log -Ilib/metrics -I../lib/metrics -Ilib/telemetry -I../lib/telemetry -Ilib/argparse -I../lib/argparse -Ilib/mempool -I../lib/mempool -Ilib/ring -I../lib/ring -Ilib/net -I../lib/net -Ilib/mbuf -I../lib/mbuf -Ilib/ethdev -I../lib/ethdev -Ilib/meter -I../lib/meter -Ilib/cmdline -I../lib/cmdline -fdiagnostics-color=always -D_FILE_OFFSET_BITS=64 -Wall -Winvalid-pch -Wextra -Werror -std=c11 -O3 -include rte_config.h -Wvla -Wcast-qual -Wdeprecated -Wformat -Wformat-nonliteral -Wformat-security -Wmissing-declarations -Wmissing-prototypes -Wnested-externs -Wold-style-definition -Wpointer-arith -Wshadow -Wsign-compare -Wstrict-prototypes -Wundef -Wwrite-strings -Wno-packed-not-aligned -Wno-missing-field-initializers -D_GNU_SOURCE -march=native -mrtm -DALLOW_EXPERIMENTAL_API -MD -MQ examples/dpdk-symmetric_mp.p/multi_process_symmetric_mp_main.c.o -MF examples/dpdk-symmetric_mp.p/multi_process_symmetric_mp_main.c.o.d -o examples/dpdk-symmetric_mp.p/multi_process_symmetric_mp_main.c.o -c ../examples/multi_process/symmetric_mp/main.c
../examples/multi_process/symmetric_mp/main.c: In function ‘print_stats’:
../examples/multi_process/symmetric_mp/main.c:103:17: error: unused parameter ‘signum’ [-Werror=unused-parameter]
103 | print_stats(int signum)
| ~~~~^~~~~~
cc1: all warnings being treated as errors
[3427/3679] Compiling C object examples/dpdk-pipeline.p/pipeline_obj.c.o
[3428/3679] Compiling C object examples/dpdk-ntb.p/ntb_ntb_fwd.c.o
[3429/3679] Compiling C object examples/dpdk-ptpclient.p/ptpclient_ptpclient.c.o
[3430/3679] Compiling C object examples/dpdk-qos_sched.p/qos_sched_args.c.o
[3431/3679] Compiling C object examples/dpdk-qos_meter.p/qos_meter_main.c.o
[3432/3679] Compiling C object examples/dpdk-pipeline.p/pipeline_cli.c.o
[3433/3679] Compiling C object examples/dpdk-qos_sched.p/qos_sched_cfg_file.c.o
[3434/3679] Compiling C object examples/dpdk-qos_sched.p/qos_sched_app_thread.c.o
[3435/3679] Compiling C object examples/dpdk-packet_ordering.p/packet_ordering_main.c.o
ninja: build stopped
*Build Failed #6:
OS: RHEL10-64
Target: x86_64-native-linuxapp-clang
FAILED: [code=1] examples/dpdk-symmetric_mp.p/multi_process_symmetric_mp_main.c.o
clang -Iexamples/dpdk-symmetric_mp.p -Iexamples -I../examples -Iexamples/multi_process/symmetric_mp -I../examples/multi_process/symmetric_mp -I../examples/common -Ilib/eal/common -I../lib/eal/common -I. -I.. -Iconfig -I../config -Ilib/eal/include -I../lib/eal/include -Ilib/eal/linux/include -I../lib/eal/linux/include -Ilib/eal/x86/include -I../lib/eal/x86/include -I../kernel/linux -Ilib/eal -I../lib/eal -Ilib/kvargs -I../lib/kvargs -Ilib/log -I../lib/log -Ilib/metrics -I../lib/metrics -Ilib/telemetry -I../lib/telemetry -Ilib/argparse -I../lib/argparse -Ilib/mempool -I../lib/mempool -Ilib/ring -I../lib/ring -Ilib/net -I../lib/net -Ilib/mbuf -I../lib/mbuf -Ilib/ethdev -I../lib/ethdev -Ilib/meter -I../lib/meter -Ilib/cmdline -I../lib/cmdline -fdiagnostics-color=always -D_FILE_OFFSET_BITS=64 -Wall -Winvalid-pch -Wextra -Werror -std=c11 -O3 -include rte_config.h -Wvla -Wcast-qual -Wcomma -Wdeprecated -Wformat -Wformat-nonliteral -Wformat-security -Wmissing-declarations -Wmissing-prototypes -Wnested-externs -Wold-style-definition -Wpointer-arith -Wshadow -Wsign-compare -Wstrict-prototypes -Wundef -Wwrite-strings -Wno-missing-field-initializers -D_GNU_SOURCE -march=native -mrtm -DALLOW_EXPERIMENTAL_API -MD -MQ examples/dpdk-symmetric_mp.p/multi_process_symmetric_mp_main.c.o -MF examples/dpdk-symmetric_mp.p/multi_process_symmetric_mp_main.c.o.d -o examples/dpdk-symmetric_mp.p/multi_process_symmetric_mp_main.c.o -c ../examples/multi_process/symmetric_mp/main.c
../examples/multi_process/symmetric_mp/main.c:103:17: error: unused parameter 'signum' [-Werror,-Wunused-parameter]
103 | print_stats(int signum)
| ^
1 error generated.
[3427/3679] Compiling C object examples/dpdk-pipeline.p/pipeline_obj.c.o
[3428/3679] Compiling C object examples/dpdk-ntb.p/ntb_ntb_fwd.c.o
[3429/3679] Compiling C object examples/dpdk-qos_meter.p/qos_meter_main.c.o
[3430/3679] Compiling C object examples/dpdk-qos_sched.p/qos_sched_args.c.o
[3431/3679] Compiling C object examples/dpdk-ptpclient.p/ptpclient_ptpclient.c.o
[3432/3679] Compiling C object examples/dpdk-pipeline.p/pipeline_cli.c.o
[3433/3679] Compiling C object examples/dpdk-qos_sched.p/qos_sched_cfg_file.c.o
[3434/3679] Compiling C object examples/dpdk-qos_sched.p/qos_sched_app_thread.c.o
[3435/3679] Compiling C object examples/dpdk-packet_ordering.p/packet_ordering_main.c.o
ninja: build stopped
*Build Failed #7:
OS: RHEL10-64
Target: x86_64-native-linuxapp-gcc+debug
FAILED: [code=1] examples/dpdk-symmetric_mp.p/multi_process_symmetric_mp_main.c.o
gcc -Iexamples/dpdk-symmetric_mp.p -Iexamples -I../examples -Iexamples/multi_process/symmetric_mp -I../examples/multi_process/symmetric_mp -I../examples/common -Ilib/eal/common -I../lib/eal/common -I. -I.. -Iconfig -I../config -Ilib/eal/include -I../lib/eal/include -Ilib/eal/linux/include -I../lib/eal/linux/include -Ilib/eal/x86/include -I../lib/eal/x86/include -I../kernel/linux -Ilib/eal -I../lib/eal -Ilib/kvargs -I../lib/kvargs -Ilib/log -I../lib/log -Ilib/metrics -I../lib/metrics -Ilib/telemetry -I../lib/telemetry -Ilib/argparse -I../lib/argparse -Ilib/mempool -I../lib/mempool -Ilib/ring -I../lib/ring -Ilib/net -I../lib/net -Ilib/mbuf -I../lib/mbuf -Ilib/ethdev -I../lib/ethdev -Ilib/meter -I../lib/meter -Ilib/cmdline -I../lib/cmdline -fdiagnostics-color=always -D_FILE_OFFSET_BITS=64 -Wall -Winvalid-pch -Wextra -Werror -std=c11 -O2 -g -include rte_config.h -Wvla -Wcast-qual -Wdeprecated -Wformat -Wformat-nonliteral -Wformat-security -Wmissing-declarations -Wmissing-prototypes -Wnested-externs -Wold-style-definition -Wpointer-arith -Wshadow -Wsign-compare -Wstrict-prototypes -Wundef -Wwrite-strings -Wno-packed-not-aligned -Wno-missing-field-initializers -D_GNU_SOURCE -march=native -mrtm -DALLOW_EXPERIMENTAL_API -MD -MQ examples/dpdk-symmetric_mp.p/multi_process_symmetric_mp_main.c.o -MF examples/dpdk-symmetric_mp.p/multi_process_symmetric_mp_main.c.o.d -o examples/dpdk-symmetric_mp.p/multi_process_symmetric_mp_main.c.o -c ../examples/multi_process/symmetric_mp/main.c
../examples/multi_process/symmetric_mp/main.c: In function ‘print_stats’:
../examples/multi_process/symmetric_mp/main.c:103:17: error: unused parameter ‘signum’ [-Werror=unused-parameter]
103 | print_stats(int signum)
| ~~~~^~~~~~
cc1: all warnings being treated as errors
[3427/3679] Compiling C object examples/dpdk-mp_server.p/multi_process_client_server_mp_mp_server_main.c.o
[3428/3679] Compiling C object examples/dpdk-qos_meter.p/qos_meter_main.c.o
[3429/3679] Compiling C object examples/dpdk-ptpclient.p/ptpclient_ptpclient.c.o
[3430/3679] Compiling C object examples/dpdk-qos_sched.p/qos_sched_args.c.o
[3431/3679] Compiling C object examples/dpdk-ntb.p/ntb_ntb_fwd.c.o
[3432/3679] Compiling C object examples/dpdk-pipeline.p/pipeline_cli.c.o
[3433/3679] Compiling C object examples/dpdk-qos_sched.p/qos_sched_cfg_file.c.o
[3434/3679] Compiling C object examples/dpdk-qos_sched.p/qos_sched_app_thread.c.o
[3435/3679] Compiling C object examples/dpdk-packet_ordering.p/packet_ordering_main.c.o
ninja: build stopped
*Build Failed #8:
OS: SUSE16-64
Target: x86_64-native-linuxapp-clang
FAILED: examples/dpdk-symmetric_mp.p/multi_process_symmetric_mp_main.c.o
clang -Iexamples/dpdk-symmetric_mp.p -Iexamples -I../examples -Iexamples/multi_process/symmetric_mp -I../examples/multi_process/symmetric_mp -I../examples/common -Ilib/eal/common -I../lib/eal/common -I. -I.. -Iconfig -I../config -Ilib/eal/include -I../lib/eal/include -Ilib/eal/linux/include -I../lib/eal/linux/include -Ilib/eal/x86/include -I../lib/eal/x86/include -I../kernel/linux -Ilib/eal -I../lib/eal -Ilib/kvargs -I../lib/kvargs -Ilib/log -I../lib/log -Ilib/metrics -I../lib/metrics -Ilib/telemetry -I../lib/telemetry -Ilib/argparse -I../lib/argparse -Ilib/mempool -I../lib/mempool -Ilib/ring -I../lib/ring -Ilib/net -I../lib/net -Ilib/mbuf -I../lib/mbuf -Ilib/ethdev -I../lib/ethdev -Ilib/meter -I../lib/meter -Ilib/cmdline -I../lib/cmdline -fdiagnostics-color=always -D_FILE_OFFSET_BITS=64 -Wall -Winvalid-pch -Wextra -Werror -std=c11 -O3 -include rte_config.h -Wvla -Wcast-qual -Wcomma -Wdeprecated -Wformat -Wformat-nonliteral -Wformat-security -Wmissing-declarations -Wmissing-prototypes -Wnested-externs -Wold-style-definition -Wpointer-arith -Wshadow -Wsign-compare -Wstrict-prototypes -Wundef -Wwrite-strings -Wno-missing-field-initializers -D_GNU_SOURCE -march=native -mrtm -DALLOW_EXPERIMENTAL_API -MD -MQ examples/dpdk-symmetric_mp.p/multi_process_symmetric_mp_main.c.o -MF examples/dpdk-symmetric_mp.p/multi_process_symmetric_mp_main.c.o.d -o examples/dpdk-symmetric_mp.p/multi_process_symmetric_mp_main.c.o -c ../examples/multi_process/symmetric_mp/main.c
../examples/multi_process/symmetric_mp/main.c:103:17: error: unused parameter 'signum' [-Werror,-Wunused-parameter]
103 | print_stats(int signum)
| ^
1 error generated.
[3619/3661] Linking target examples/dpdk-simple_mp
[3620/3661] Linking target examples/dpdk-ptpclient
[3621/3661] Compiling C object examples/dpdk-ntb.p/ntb_ntb_fwd.c.o
[3622/3661] Linking target examples/dpdk-efd_node
[3623/3661] Compiling C object examples/dpdk-qos_sched.p/qos_sched_args.c.o
[3624/3661] Compiling C object examples/dpdk-qos_sched.p/qos_sched_main.c.o
[3625/3661] Linking target examples/dpdk-packet_ordering
[3626/3661] Compiling C object examples/dpdk-efd_server.p/server_node_efd_efd_server_main.c.o
[3627/3661] Compiling C object examples/dpdk-pipeline.p/pipeline_cli.c.o
ninja: build stopped
*Build Failed #9:
OS: SUSE16-64
Target: x86_64-native-linuxapp-gcc
FAILED: examples/dpdk-symmetric_mp.p/multi_process_symmetric_mp_main.c.o
gcc -Iexamples/dpdk-symmetric_mp.p -Iexamples -I../examples -Iexamples/multi_process/symmetric_mp -I../examples/multi_process/symmetric_mp -I../examples/common -Ilib/eal/common -I../lib/eal/common -I. -I.. -Iconfig -I../config -Ilib/eal/include -I../lib/eal/include -Ilib/eal/linux/include -I../lib/eal/linux/include -Ilib/eal/x86/include -I../lib/eal/x86/include -I../kernel/linux -Ilib/eal -I../lib/eal -Ilib/kvargs -I../lib/kvargs -Ilib/log -I../lib/log -Ilib/metrics -I../lib/metrics -Ilib/telemetry -I../lib/telemetry -Ilib/argparse -I../lib/argparse -Ilib/mempool -I../lib/mempool -Ilib/ring -I../lib/ring -Ilib/net -I../lib/net -Ilib/mbuf -I../lib/mbuf -Ilib/ethdev -I../lib/ethdev -Ilib/meter -I../lib/meter -Ilib/cmdline -I../lib/cmdline -fdiagnostics-color=always -D_FILE_OFFSET_BITS=64 -Wall -Winvalid-pch -Wextra -Werror -std=c11 -O3 -include rte_config.h -Wvla -Wcast-qual -Wdeprecated -Wformat -Wformat-nonliteral -Wformat-security -Wmissing-declarations -Wmissing-prototypes -Wnested-externs -Wold-style-definition -Wpointer-arith -Wshadow -Wsign-compare -Wstrict-prototypes -Wundef -Wwrite-strings -Wno-packed-not-aligned -Wno-missing-field-initializers -fzero-init-padding-bits=all -D_GNU_SOURCE -march=native -mrtm -DALLOW_EXPERIMENTAL_API -MD -MQ examples/dpdk-symmetric_mp.p/multi_process_symmetric_mp_main.c.o -MF examples/dpdk-symmetric_mp.p/multi_process_symmetric_mp_main.c.o.d -o examples/dpdk-symmetric_mp.p/multi_process_symmetric_mp_main.c.o -c ../examples/multi_process/symmetric_mp/main.c
../examples/multi_process/symmetric_mp/main.c: In function ‘print_stats’:
../examples/multi_process/symmetric_mp/main.c:103:17: error: unused parameter ‘signum’ [-Werror=unused-parameter]
103 | print_stats(int signum)
| ~~~~^~~~~~
cc1: all warnings being treated as errors
[3606/3661] Linking target examples/dpdk-link_status_interrupt
[3607/3661] Linking target examples/dpdk-l3fwd-power
[3608/3661] Compiling C object examples/dpdk-mp_server.p/multi_process_client_server_mp_mp_server_main.c.o
[3609/3661] Compiling C object examples/dpdk-packet_ordering.p/packet_ordering_main.c.o
[3610/3661] Compiling C object examples/dpdk-pipeline.p/pipeline_obj.c.o
[3611/3661] Linking target examples/dpdk-hotplug_mp
[3612/3661] Compiling C object examples/dpdk-mp_client.p/multi_process_client_server_mp_mp_client_client.c.o
[3613/3661] Compiling C object examples/dpdk-qos_sched.p/qos_sched_cfg_file.c.o
[3614/3661] Linking target examples/dpdk-qos_meter
ninja: build stopped
*Build Failed #10:
OS: AzureLinux4.0-64
Target: x86_64-native-linuxapp-gcc
FAILED: examples/dpdk-symmetric_mp.p/multi_process_symmetric_mp_main.c.o
gcc -Iexamples/dpdk-symmetric_mp.p -Iexamples -I../examples -Iexamples/multi_process/symmetric_mp -I../examples/multi_process/symmetric_mp -I../examples/common -Ilib/eal/common -I../lib/eal/common -I. -I.. -Iconfig -I../config -Ilib/eal/include -I../lib/eal/include -Ilib/eal/linux/include -I../lib/eal/linux/include -Ilib/eal/x86/include -I../lib/eal/x86/include -I../kernel/linux -Ilib/eal -I../lib/eal -Ilib/kvargs -I../lib/kvargs -Ilib/log -I../lib/log -Ilib/metrics -I../lib/metrics -Ilib/telemetry -I../lib/telemetry -Ilib/argparse -I../lib/argparse -Ilib/mempool -I../lib/mempool -Ilib/ring -I../lib/ring -Ilib/net -I../lib/net -Ilib/mbuf -I../lib/mbuf -Ilib/ethdev -I../lib/ethdev -Ilib/meter -I../lib/meter -Ilib/cmdline -I../lib/cmdline -fdiagnostics-color=always -D_FILE_OFFSET_BITS=64 -Wall -Winvalid-pch -Wextra -Werror -std=c11 -O3 -include rte_config.h -Wvla -Wcast-qual -Wdeprecated -Wformat -Wformat-nonliteral -Wformat-security -Wmissing-declarations -Wmissing-prototypes -Wnested-externs -Wold-style-definition -Wpointer-arith -Wshadow -Wsign-compare -Wstrict-prototypes -Wundef -Wwrite-strings -Wno-packed-not-aligned -Wno-missing-field-initializers -fzero-init-padding-bits=all -D_GNU_SOURCE -march=native -mrtm -DALLOW_EXPERIMENTAL_API -MD -MQ examples/dpdk-symmetric_mp.p/multi_process_symmetric_mp_main.c.o -MF examples/dpdk-symmetric_mp.p/multi_process_symmetric_mp_main.c.o.d -o examples/dpdk-symmetric_mp.p/multi_process_symmetric_mp_main.c.o -c ../examples/multi_process/symmetric_mp/main.c
../examples/multi_process/symmetric_mp/main.c: In function ‘print_stats’:
../examples/multi_process/symmetric_mp/main.c:103:17: error: unused parameter ‘signum’ [-Werror=unused-parameter]
103 | print_stats(int signum)
| ~~~~^~~~~~
cc1: all warnings being treated as errors
[3626/3679] Linking target examples/dpdk-l3fwd-power
[3627/3679] Compiling C object examples/dpdk-pipeline.p/pipeline_cli.c.o
[3628/3679] Linking target examples/dpdk-mp_server
[3629/3679] Linking target examples/dpdk-hotplug_mp
[3630/3679] Compiling C object examples/dpdk-simple_mp.p/multi_process_simple_mp_mp_commands.c.o
[3631/3679] Linking target examples/dpdk-ptpclient
[3632/3679] Compiling C object examples/dpdk-qos_meter.p/qos_meter_main.c.o
[3633/3679] Compiling C object examples/dpdk-qos_sched.p/qos_sched_app_thread.c.o
[3634/3679] Compiling C object examples/dpdk-packet_ordering.p/packet_ordering_main.c.o
ninja: build stopped
*Build Failed #11:
OS: UB2604-32
Target: i686-native-linuxapp-gcc
FAILED: examples/dpdk-symmetric_mp.p/multi_process_symmetric_mp_main.c.o
gcc -Iexamples/dpdk-symmetric_mp.p -Iexamples -I../examples -Iexamples/multi_process/symmetric_mp -I../examples/multi_process/symmetric_mp -I../examples/common -Ilib/eal/common -I../lib/eal/common -I. -I.. -Iconfig -I../config -Ilib/eal/include -I../lib/eal/include -Ilib/eal/linux/include -I../lib/eal/linux/include -Ilib/eal/x86/include -I../lib/eal/x86/include -I../kernel/linux -Ilib/eal -I../lib/eal -Ilib/kvargs -I../lib/kvargs -Ilib/log -I../lib/log -Ilib/metrics -I../lib/metrics -Ilib/telemetry -I../lib/telemetry -Ilib/argparse -I../lib/argparse -Ilib/mempool -I../lib/mempool -Ilib/ring -I../lib/ring -Ilib/net -I../lib/net -Ilib/mbuf -I../lib/mbuf -Ilib/ethdev -I../lib/ethdev -Ilib/meter -I../lib/meter -Ilib/cmdline -I../lib/cmdline -fdiagnostics-color=always -D_FILE_OFFSET_BITS=64 -Wall -Winvalid-pch -Wextra -Werror -std=c11 -O3 -include rte_config.h -Wvla -Wcast-qual -Wdeprecated -Wformat -Wformat-nonliteral -Wformat-security -Wmissing-declarations -Wmissing-prototypes -Wnested-externs -Wold-style-definition -Wpointer-arith -Wshadow -Wsign-compare -Wstrict-prototypes -Wundef -Wwrite-strings -Wno-packed-not-aligned -Wno-missing-field-initializers -fzero-init-padding-bits=all -Wno-pointer-to-int-cast -D_GNU_SOURCE -m32 -march=native -mrtm -DALLOW_EXPERIMENTAL_API -MD -MQ examples/dpdk-symmetric_mp.p/multi_process_symmetric_mp_main.c.o -MF examples/dpdk-symmetric_mp.p/multi_process_symmetric_mp_main.c.o.d -o examples/dpdk-symmetric_mp.p/multi_process_symmetric_mp_main.c.o -c ../examples/multi_process/symmetric_mp/main.c
../examples/multi_process/symmetric_mp/main.c: In function ‘print_stats’:
../examples/multi_process/symmetric_mp/main.c:103:17: error: unused parameter ‘signum’ [-Werror=unused-parameter]
103 | print_stats(int signum)
| ~~~~^~~~~~
cc1: all warnings being treated as errors
[2701/2765] Generating examples/multi_process/simple_mp/commands_hdr with a custom command (wrapped by meson to capture output)
[2702/2765] Compiling C object examples/dpdk-ptpclient.p/ptpclient_ptpclient.c.o
[2703/2765] Linking target examples/dpdk-l3fwd-power
[2704/2765] Linking target examples/dpdk-link_status_interrupt
[2705/2765] Linking target examples/dpdk-l3fwd
[2706/2765] Linking target examples/dpdk-l3fwd-graph
[2707/2765] Compiling C object examples/dpdk-qos_sched.p/qos_sched_stats.c.o
[2708/2765] Compiling C object examples/dpdk-qos_sched.p/qos_sched_cfg_file.c.o
[2709/2765] Compiling C object examples/dpdk-mp_server.p/multi_process_client_server_mp_mp_server_main.c.o
ninja: build stopped
*Build Failed #12:
OS: RHEL10.2-64
Target: x86_64-native-linuxapp-gcc
FAILED: examples/dpdk-symmetric_mp.p/multi_process_symmetric_mp_main.c.o
gcc -Iexamples/dpdk-symmetric_mp.p -Iexamples -I../examples -Iexamples/multi_process/symmetric_mp -I../examples/multi_process/symmetric_mp -I../examples/common -Ilib/eal/common -I../lib/eal/common -I. -I.. -Iconfig -I../config -Ilib/eal/include -I../lib/eal/include -Ilib/eal/linux/include -I../lib/eal/linux/include -Ilib/eal/x86/include -I../lib/eal/x86/include -I../kernel/linux -Ilib/eal -I../lib/eal -Ilib/kvargs -I../lib/kvargs -Ilib/log -I../lib/log -Ilib/metrics -I../lib/metrics -Ilib/telemetry -I../lib/telemetry -Ilib/argparse -I../lib/argparse -Ilib/mempool -I../lib/mempool -Ilib/ring -I../lib/ring -Ilib/net -I../lib/net -Ilib/mbuf -I../lib/mbuf -Ilib/ethdev -I../lib/ethdev -Ilib/meter -I../lib/meter -Ilib/cmdline -I../lib/cmdline -fdiagnostics-color=always -D_FILE_OFFSET_BITS=64 -Wall -Winvalid-pch -Wextra -Werror -std=c11 -O3 -include rte_config.h -Wvla -Wcast-qual -Wdeprecated -Wformat -Wformat-nonliteral -Wformat-security -Wmissing-declarations -Wmissing-prototypes -Wnested-externs -Wold-style-definition -Wpointer-arith -Wshadow -Wsign-compare -Wstrict-prototypes -Wundef -Wwrite-strings -Wno-packed-not-aligned -Wno-missing-field-initializers -D_GNU_SOURCE -march=native -mrtm -DALLOW_EXPERIMENTAL_API -MD -MQ examples/dpdk-symmetric_mp.p/multi_process_symmetric_mp_main.c.o -MF examples/dpdk-symmetric_mp.p/multi_process_symmetric_mp_main.c.o.d -o examples/dpdk-symmetric_mp.p/multi_process_symmetric_mp_main.c.o -c ../examples/multi_process/symmetric_mp/main.c
../examples/multi_process/symmetric_mp/main.c: In function ‘print_stats’:
../examples/multi_process/symmetric_mp/main.c:103:17: error: unused parameter ‘signum’ [-Werror=unused-parameter]
103 | print_stats(int signum)
| ~~~~^~~~~~
cc1: all warnings being treated as errors
[3621/3679] Linking target examples/dpdk-l3fwd-graph
[3622/3679] Linking target examples/dpdk-link_status_interrupt
[3623/3679] Linking target examples/dpdk-l3fwd
[3624/3679] Linking target examples/dpdk-mp_client
[3625/3679] Linking target examples/dpdk-hotplug_mp
[3626/3679] Compiling C object examples/dpdk-mp_server.p/multi_process_client_server_mp_mp_server_main.c.o
[3627/3679] Linking target examples/dpdk-l3fwd-power
[3628/3679] Compiling C object examples/dpdk-simple_mp.p/multi_process_simple_mp_main.c.o
[3629/3679] Compiling C object examples/dpdk-pipeline.p/pipeline_cli.c.o
ninja: build stopped
*Build Failed #13:
OS: UB2604-64
Target: x86_64-native-linuxapp-gcc+16byte
FAILED: examples/dpdk-symmetric_mp.p/multi_process_symmetric_mp_main.c.o
gcc -Iexamples/dpdk-symmetric_mp.p -Iexamples -I../examples -Iexamples/multi_process/symmetric_mp -I../examples/multi_process/symmetric_mp -I../examples/common -Ilib/eal/common -I../lib/eal/common -I. -I.. -Iconfig -I../config -Ilib/eal/include -I../lib/eal/include -Ilib/eal/linux/include -I../lib/eal/linux/include -Ilib/eal/x86/include -I../lib/eal/x86/include -I../kernel/linux -Ilib/eal -I../lib/eal -Ilib/kvargs -I../lib/kvargs -Ilib/log -I../lib/log -Ilib/metrics -I../lib/metrics -Ilib/telemetry -I../lib/telemetry -Ilib/argparse -I../lib/argparse -Ilib/mempool -I../lib/mempool -Ilib/ring -I../lib/ring -Ilib/net -I../lib/net -Ilib/mbuf -I../lib/mbuf -Ilib/ethdev -I../lib/ethdev -Ilib/meter -I../lib/meter -Ilib/cmdline -I../lib/cmdline -fdiagnostics-color=always -D_FILE_OFFSET_BITS=64 -Wall -Winvalid-pch -Wextra -Werror -std=c11 -O3 -include rte_config.h -Wvla -Wcast-qual -Wdeprecated -Wformat -Wformat-nonliteral -Wformat-security -Wmissing-declarations -Wmissing-prototypes -Wnested-externs -Wold-style-definition -Wpointer-arith -Wshadow -Wsign-compare -Wstrict-prototypes -Wundef -Wwrite-strings -Wno-packed-not-aligned -Wno-missing-field-initializers -fzero-init-padding-bits=all -D_GNU_SOURCE -DRTE_LIBRTE_I40E_16BYTE_RX_DESC -DRTE_LIBRTE_ICE_16BYTE_RX_DESC -march=native -mrtm -DALLOW_EXPERIMENTAL_API -MD -MQ examples/dpdk-symmetric_mp.p/multi_process_symmetric_mp_main.c.o -MF examples/dpdk-symmetric_mp.p/multi_process_symmetric_mp_main.c.o.d -o examples/dpdk-symmetric_mp.p/multi_process_symmetric_mp_main.c.o -c ../examples/multi_process/symmetric_mp/main.c
../examples/multi_process/symmetric_mp/main.c: In function ‘print_stats’:
../examples/multi_process/symmetric_mp/main.c:103:17: error: unused parameter ‘signum’ [-Werror=unused-parameter]
103 | print_stats(int signum)
| ~~~~^~~~~~
cc1: all warnings being treated as errors
[3881/3920] Compiling C object examples/dpdk-qos_sched.p/qos_sched_cmdline.c.o
[3882/3920] Linking target examples/dpdk-ptpclient
[3883/3920] Compiling C object examples/dpdk-pipeline.p/pipeline_cli.c.o
[3884/3920] Compiling C object examples/dpdk-qos_sched.p/qos_sched_init.c.o
[3885/3920] Compiling C object examples/dpdk-qos_sched.p/qos_sched_args.c.o
[3886/3920] Compiling C object examples/dpdk-packet_ordering.p/packet_ordering_main.c.o
[3887/3920] Linking target examples/dpdk-simple_mp
[3888/3920] Compiling C object examples/dpdk-ntb.p/ntb_ntb_fwd.c.o
[3889/3920] Compiling C object examples/dpdk-efd_node.p/server_node_efd_efd_node_node.c.o
ninja: build stopped
*Build Failed #14:
OS: UB2604-64
Target: x86_64-native-linuxapp-gcc
FAILED: examples/dpdk-symmetric_mp.p/multi_process_symmetric_mp_main.c.o
gcc -Iexamples/dpdk-symmetric_mp.p -Iexamples -I../examples -Iexamples/multi_process/symmetric_mp -I../examples/multi_process/symmetric_mp -I../examples/common -Ilib/eal/common -I../lib/eal/common -I. -I.. -Iconfig -I../config -Ilib/eal/include -I../lib/eal/include -Ilib/eal/linux/include -I../lib/eal/linux/include -Ilib/eal/x86/include -I../lib/eal/x86/include -I../kernel/linux -Ilib/eal -I../lib/eal -Ilib/kvargs -I../lib/kvargs -Ilib/log -I../lib/log -Ilib/metrics -I../lib/metrics -Ilib/telemetry -I../lib/telemetry -Ilib/argparse -I../lib/argparse -Ilib/mempool -I../lib/mempool -Ilib/ring -I../lib/ring -Ilib/net -I../lib/net -Ilib/mbuf -I../lib/mbuf -Ilib/ethdev -I../lib/ethdev -Ilib/meter -I../lib/meter -Ilib/cmdline -I../lib/cmdline -fdiagnostics-color=always -D_FILE_OFFSET_BITS=64 -Wall -Winvalid-pch -Wextra -Werror -std=c11 -O3 -include rte_config.h -Wvla -Wcast-qual -Wdeprecated -Wformat -Wformat-nonliteral -Wformat-security -Wmissing-declarations -Wmissing-prototypes -Wnested-externs -Wold-style-definition -Wpointer-arith -Wshadow -Wsign-compare -Wstrict-prototypes -Wundef -Wwrite-strings -Wno-packed-not-aligned -Wno-missing-field-initializers -fzero-init-padding-bits=all -D_GNU_SOURCE -march=native -mrtm -DALLOW_EXPERIMENTAL_API -MD -MQ examples/dpdk-symmetric_mp.p/multi_process_symmetric_mp_main.c.o -MF examples/dpdk-symmetric_mp.p/multi_process_symmetric_mp_main.c.o.d -o examples/dpdk-symmetric_mp.p/multi_process_symmetric_mp_main.c.o -c ../examples/multi_process/symmetric_mp/main.c
../examples/multi_process/symmetric_mp/main.c: In function ‘print_stats’:
../examples/multi_process/symmetric_mp/main.c:103:17: error: unused parameter ‘signum’ [-Werror=unused-parameter]
103 | print_stats(int signum)
| ~~~~^~~~~~
cc1: all warnings being treated as errors
[3875/3920] Compiling C object examples/dpdk-qos_meter.p/qos_meter_main.c.o
[3876/3920] Linking target examples/dpdk-mp_client
[3877/3920] Compiling C object examples/dpdk-qos_sched.p/qos_sched_app_thread.c.o
[3878/3920] Linking target examples/dpdk-ptpclient
[3879/3920] Compiling C object examples/dpdk-qos_sched.p/qos_sched_args.c.o
[3880/3920] Linking target examples/dpdk-simple_mp
[3881/3920] Linking target examples/dpdk-pipeline
[3882/3920] Compiling C object examples/dpdk-ntb.p/ntb_ntb_fwd.c.o
[3883/3920] Compiling C object examples/dpdk-packet_ordering.p/packet_ordering_main.c.o
ninja: build stopped
*Build Failed #15:
OS: UB2604-64
Target: x86_64-native-linuxapp-clang
FAILED: examples/dpdk-symmetric_mp.p/multi_process_symmetric_mp_main.c.o
clang -Iexamples/dpdk-symmetric_mp.p -Iexamples -I../examples -Iexamples/multi_process/symmetric_mp -I../examples/multi_process/symmetric_mp -I../examples/common -Ilib/eal/common -I../lib/eal/common -I. -I.. -Iconfig -I../config -Ilib/eal/include -I../lib/eal/include -Ilib/eal/linux/include -I../lib/eal/linux/include -Ilib/eal/x86/include -I../lib/eal/x86/include -I../kernel/linux -Ilib/eal -I../lib/eal -Ilib/kvargs -I../lib/kvargs -Ilib/log -I../lib/log -Ilib/metrics -I../lib/metrics -Ilib/telemetry -I../lib/telemetry -Ilib/argparse -I../lib/argparse -Ilib/mempool -I../lib/mempool -Ilib/ring -I../lib/ring -Ilib/net -I../lib/net -Ilib/mbuf -I../lib/mbuf -Ilib/ethdev -I../lib/ethdev -Ilib/meter -I../lib/meter -Ilib/cmdline -I../lib/cmdline -fdiagnostics-color=always -D_FILE_OFFSET_BITS=64 -Wall -Winvalid-pch -Wextra -Werror -std=c11 -O3 -include rte_config.h -Wvla -Wcast-qual -Wcomma -Wdeprecated -Wformat -Wformat-nonliteral -Wformat-security -Wmissing-declarations -Wmissing-prototypes -Wnested-externs -Wold-style-definition -Wpointer-arith -Wshadow -Wsign-compare -Wstrict-prototypes -Wundef -Wwrite-strings -Wno-missing-field-initializers -D_GNU_SOURCE -march=native -mrtm -DALLOW_EXPERIMENTAL_API -MD -MQ examples/dpdk-symmetric_mp.p/multi_process_symmetric_mp_main.c.o -MF examples/dpdk-symmetric_mp.p/multi_process_symmetric_mp_main.c.o.d -o examples/dpdk-symmetric_mp.p/multi_process_symmetric_mp_main.c.o -c ../examples/multi_process/symmetric_mp/main.c
../examples/multi_process/symmetric_mp/main.c:103:17: error: unused parameter 'signum' [-Werror,-Wunused-parameter]
103 | print_stats(int signum)
| ^
1 error generated.
[3878/3921] Compiling C object examples/dpdk-pipeline.p/pipeline_obj.c.o
[3879/3921] Compiling C object examples/dpdk-efd_server.p/server_node_efd_efd_server_args.c.o
[3880/3921] Compiling C object examples/dpdk-qos_sched.p/qos_sched_cmdline.c.o
[3881/3921] Compiling C object app/dpdk-test.p/test_test_ring.c.o
[3882/3921] Compiling C object examples/dpdk-packet_ordering.p/packet_ordering_main.c.o
[3883/3921] Compiling C object examples/dpdk-qos_sched.p/qos_sched_args.c.o
[3884/3921] Compiling C object examples/dpdk-efd_node.p/server_node_efd_efd_node_node.c.o
[3885/3921] Linking target examples/dpdk-simple_mp
[3886/3921] Linking target examples/dpdk-ntb
ninja: build stopped
*Build Failed #16:
OS: RHEL10.2-64RT
Target: x86_64-native-linuxapp-gcc
FAILED: examples/dpdk-symmetric_mp.p/multi_process_symmetric_mp_main.c.o
gcc -Iexamples/dpdk-symmetric_mp.p -Iexamples -I../examples -Iexamples/multi_process/symmetric_mp -I../examples/multi_process/symmetric_mp -I../examples/common -Ilib/eal/common -I../lib/eal/common -I. -I.. -Iconfig -I../config -Ilib/eal/include -I../lib/eal/include -Ilib/eal/linux/include -I../lib/eal/linux/include -Ilib/eal/x86/include -I../lib/eal/x86/include -I../kernel/linux -Ilib/eal -I../lib/eal -Ilib/kvargs -I../lib/kvargs -Ilib/log -I../lib/log -Ilib/metrics -I../lib/metrics -Ilib/telemetry -I../lib/telemetry -Ilib/argparse -I../lib/argparse -Ilib/mempool -I../lib/mempool -Ilib/ring -I../lib/ring -Ilib/net -I../lib/net -Ilib/mbuf -I../lib/mbuf -Ilib/ethdev -I../lib/ethdev -Ilib/meter -I../lib/meter -Ilib/cmdline -I../lib/cmdline -fdiagnostics-color=always -D_FILE_OFFSET_BITS=64 -Wall -Winvalid-pch -Wextra -Werror -std=c11 -O3 -include rte_config.h -Wvla -Wcast-qual -Wdeprecated -Wformat -Wformat-nonliteral -Wformat-security -Wmissing-declarations -Wmissing-prototypes -Wnested-externs -Wold-style-definition -Wpointer-arith -Wshadow -Wsign-compare -Wstrict-prototypes -Wundef -Wwrite-strings -Wno-packed-not-aligned -Wno-missing-field-initializers -D_GNU_SOURCE -march=native -mrtm -DALLOW_EXPERIMENTAL_API -MD -MQ examples/dpdk-symmetric_mp.p/multi_process_symmetric_mp_main.c.o -MF examples/dpdk-symmetric_mp.p/multi_process_symmetric_mp_main.c.o.d -o examples/dpdk-symmetric_mp.p/multi_process_symmetric_mp_main.c.o -c ../examples/multi_process/symmetric_mp/main.c
../examples/multi_process/symmetric_mp/main.c: In function ‘print_stats’:
../examples/multi_process/symmetric_mp/main.c:103:17: error: unused parameter ‘signum’ [-Werror=unused-parameter]
103 | print_stats(int signum)
| ~~~~^~~~~~
cc1: all warnings being treated as errors
[3623/3679] Linking target examples/dpdk-link_status_interrupt
[3624/3679] Linking target examples/dpdk-l3fwd
[3625/3679] Linking target examples/dpdk-mp_client
[3626/3679] Linking target examples/dpdk-hotplug_mp
[3627/3679] Linking target examples/dpdk-l3fwd-power
[3628/3679] Compiling C object examples/dpdk-simple_mp.p/multi_process_simple_mp_main.c.o
[3629/3679] Compiling C object examples/dpdk-simple_mp.p/multi_process_simple_mp_mp_commands.c.o
[3630/3679] Linking target examples/dpdk-mp_server
[3631/3679] Compiling C object examples/dpdk-pipeline.p/pipeline_cli.c.o
ninja: build stopped
*Build Failed #17:
OS: UB2404-64
Target: x86_64-native-linuxapp-gcc
FAILED: examples/dpdk-symmetric_mp.p/multi_process_symmetric_mp_main.c.o
gcc -Iexamples/dpdk-symmetric_mp.p -Iexamples -I../examples -Iexamples/multi_process/symmetric_mp -I../examples/multi_process/symmetric_mp -I../examples/common -Ilib/eal/common -I../lib/eal/common -I. -I.. -Iconfig -I../config -Ilib/eal/include -I../lib/eal/include -Ilib/eal/linux/include -I../lib/eal/linux/include -Ilib/eal/x86/include -I../lib/eal/x86/include -I../kernel/linux -Ilib/eal -I../lib/eal -Ilib/kvargs -I../lib/kvargs -Ilib/log -I../lib/log -Ilib/metrics -I../lib/metrics -Ilib/telemetry -I../lib/telemetry -Ilib/argparse -I../lib/argparse -Ilib/mempool -I../lib/mempool -Ilib/ring -I../lib/ring -Ilib/net -I../lib/net -Ilib/mbuf -I../lib/mbuf -Ilib/ethdev -I../lib/ethdev -Ilib/meter -I../lib/meter -Ilib/cmdline -I../lib/cmdline -fdiagnostics-color=always -D_FILE_OFFSET_BITS=64 -Wall -Winvalid-pch -Wextra -Werror -std=c11 -O3 -include rte_config.h -Wvla -Wcast-qual -Wdeprecated -Wformat -Wformat-nonliteral -Wformat-security -Wmissing-declarations -Wmissing-prototypes -Wnested-externs -Wold-style-definition -Wpointer-arith -Wshadow -Wsign-compare -Wstrict-prototypes -Wundef -Wwrite-strings -Wno-packed-not-aligned -Wno-missing-field-initializers -D_GNU_SOURCE -march=native -mrtm -DALLOW_EXPERIMENTAL_API -MD -MQ examples/dpdk-symmetric_mp.p/multi_process_symmetric_mp_main.c.o -MF examples/dpdk-symmetric_mp.p/multi_process_symmetric_mp_main.c.o.d -o examples/dpdk-symmetric_mp.p/multi_process_symmetric_mp_main.c.o -c ../examples/multi_process/symmetric_mp/main.c
../examples/multi_process/symmetric_mp/main.c: In function ‘print_stats’:
../examples/multi_process/symmetric_mp/main.c:103:17: error: unused parameter ‘signum’ [-Werror=unused-parameter]
103 | print_stats(int signum)
| ~~~~^~~~~~
cc1: all warnings being treated as errors
[3860/3920] Linking target examples/dpdk-link_status_interrupt
[3861/3920] Linking target examples/dpdk-l3fwd
[3862/3920] Compiling C object examples/dpdk-hotplug_mp.p/multi_process_hotplug_mp_commands.c.o
[3863/3920] Compiling C object examples/dpdk-pipeline.p/pipeline_obj.c.o
[3864/3920] Linking target examples/dpdk-mp_client
[3865/3920] Linking target examples/dpdk-ptpclient
[3866/3920] Compiling C object examples/dpdk-packet_ordering.p/packet_ordering_main.c.o
[3867/3920] Compiling C object examples/dpdk-simple_mp.p/multi_process_simple_mp_main.c.o
[3868/3920] Compiling C object examples/dpdk-mp_server.p/multi_process_client_server_mp_mp_server_main.c.o
ninja: build stopped
*Build Failed #18:
OS: Fedora44-64
Target: x86_64-native-linuxapp-gcc
FAILED: examples/dpdk-symmetric_mp.p/multi_process_symmetric_mp_main.c.o
gcc -Iexamples/dpdk-symmetric_mp.p -Iexamples -I../examples -Iexamples/multi_process/symmetric_mp -I../examples/multi_process/symmetric_mp -I../examples/common -Ilib/eal/common -I../lib/eal/common -I. -I.. -Iconfig -I../config -Ilib/eal/include -I../lib/eal/include -Ilib/eal/linux/include -I../lib/eal/linux/include -Ilib/eal/x86/include -I../lib/eal/x86/include -I../kernel/linux -Ilib/eal -I../lib/eal -Ilib/kvargs -I../lib/kvargs -Ilib/log -I../lib/log -Ilib/metrics -I../lib/metrics -Ilib/telemetry -I../lib/telemetry -Ilib/argparse -I../lib/argparse -Ilib/mempool -I../lib/mempool -Ilib/ring -I../lib/ring -Ilib/net -I../lib/net -Ilib/mbuf -I../lib/mbuf -Ilib/ethdev -I../lib/ethdev -Ilib/meter -I../lib/meter -Ilib/cmdline -I../lib/cmdline -fdiagnostics-color=always -D_FILE_OFFSET_BITS=64 -Wall -Winvalid-pch -Wextra -Werror -std=c11 -O3 -include rte_config.h -Wvla -Wcast-qual -Wdeprecated -Wformat -Wformat-nonliteral -Wformat-security -Wmissing-declarations -Wmissing-prototypes -Wnested-externs -Wold-style-definition -Wpointer-arith -Wshadow -Wsign-compare -Wstrict-prototypes -Wundef -Wwrite-strings -Wno-packed-not-aligned -Wno-missing-field-initializers -fzero-init-padding-bits=all -D_GNU_SOURCE -march=native -mrtm -DALLOW_EXPERIMENTAL_API -MD -MQ examples/dpdk-symmetric_mp.p/multi_process_symmetric_mp_main.c.o -MF examples/dpdk-symmetric_mp.p/multi_process_symmetric_mp_main.c.o.d -o examples/dpdk-symmetric_mp.p/multi_process_symmetric_mp_main.c.o -c ../examples/multi_process/symmetric_mp/main.c
../examples/multi_process/symmetric_mp/main.c: In function ‘print_stats’:
../examples/multi_process/symmetric_mp/main.c:103:17: error: unused parameter ‘signum’ [-Werror=unused-parameter]
103 | print_stats(int signum)
| ~~~~^~~~~~
cc1: all warnings being treated as errors
[3635/3679] Compiling C object examples/dpdk-qos_meter.p/qos_meter_main.c.o
[3636/3679] Linking target examples/dpdk-mp_client
[3637/3679] Compiling C object examples/dpdk-rxtx_callbacks.p/rxtx_callbacks_main.c.o
[3638/3679] Linking target examples/dpdk-simple_mp
[3639/3679] Compiling C object examples/dpdk-efd_server.p/server_node_efd_efd_server_init.c.o
[3640/3679] Compiling C object examples/dpdk-pipeline.p/pipeline_cli.c.o
[3641/3679] Compiling C object examples/dpdk-packet_ordering.p/packet_ordering_main.c.o
[3642/3679] Compiling C object examples/dpdk-ntb.p/ntb_ntb_fwd.c.o
[3643/3679] Linking target examples/dpdk-ptpclient
ninja: build stopped
*Build Failed #19:
OS: Fedora44-64
Target: x86_64-native-linuxapp-clang
FAILED: examples/dpdk-symmetric_mp.p/multi_process_symmetric_mp_main.c.o
clang -Iexamples/dpdk-symmetric_mp.p -Iexamples -I../examples -Iexamples/multi_process/symmetric_mp -I../examples/multi_process/symmetric_mp -I../examples/common -Ilib/eal/common -I../lib/eal/common -I. -I.. -Iconfig -I../config -Ilib/eal/include -I../lib/eal/include -Ilib/eal/linux/include -I../lib/eal/linux/include -Ilib/eal/x86/include -I../lib/eal/x86/include -I../kernel/linux -Ilib/eal -I../lib/eal -Ilib/kvargs -I../lib/kvargs -Ilib/log -I../lib/log -Ilib/metrics -I../lib/metrics -Ilib/telemetry -I../lib/telemetry -Ilib/argparse -I../lib/argparse -Ilib/mempool -I../lib/mempool -Ilib/ring -I../lib/ring -Ilib/net -I../lib/net -Ilib/mbuf -I../lib/mbuf -Ilib/ethdev -I../lib/ethdev -Ilib/meter -I../lib/meter -Ilib/cmdline -I../lib/cmdline -fdiagnostics-color=always -D_FILE_OFFSET_BITS=64 -Wall -Winvalid-pch -Wextra -Werror -std=c11 -O3 -include rte_config.h -Wvla -Wcast-qual -Wcomma -Wdeprecated -Wformat -Wformat-nonliteral -Wformat-security -Wmissing-declarations -Wmissing-prototypes -Wnested-externs -Wold-style-definition -Wpointer-arith -Wshadow -Wsign-compare -Wstrict-prototypes -Wundef -Wwrite-strings -Wno-missing-field-initializers -D_GNU_SOURCE -march=native -mrtm -DALLOW_EXPERIMENTAL_API -MD -MQ examples/dpdk-symmetric_mp.p/multi_process_symmetric_mp_main.c.o -MF examples/dpdk-symmetric_mp.p/multi_process_symmetric_mp_main.c.o.d -o examples/dpdk-symmetric_mp.p/multi_process_symmetric_mp_main.c.o -c ../examples/multi_process/symmetric_mp/main.c
../examples/multi_process/symmetric_mp/main.c:103:17: error: unused parameter 'signum' [-Werror,-Wunused-parameter]
103 | print_stats(int signum)
| ^
1 error generated.
[3631/3679] Compiling C object examples/dpdk-packet_ordering.p/packet_ordering_main.c.o
[3632/3679] Compiling C object examples/dpdk-ptpclient.p/ptpclient_ptpclient.c.o
[3633/3679] Compiling C object examples/dpdk-qos_sched.p/qos_sched_cfg_file.c.o
[3634/3679] Linking target examples/dpdk-mp_client
[3635/3679] Compiling C object examples/dpdk-ntb.p/ntb_ntb_fwd.c.o
[3636/3679] Compiling C object examples/dpdk-qos_sched.p/qos_sched_init.c.o
[3637/3679] Linking target examples/dpdk-pipeline
[3638/3679] Linking target examples/dpdk-simple_mp
[3639/3679] Compiling C object app/dpdk-test.p/test_test_ring.c.o
ninja: build stopped
*Build Failed #20:
OS: OpenEuler2404-64
Target: x86_64-native-linuxapp-gcc
FAILED: examples/dpdk-symmetric_mp.p/multi_process_symmetric_mp_main.c.o
gcc -Iexamples/dpdk-symmetric_mp.p -Iexamples -I../examples -Iexamples/multi_process/symmetric_mp -I../examples/multi_process/symmetric_mp -I../examples/common -Ilib/eal/common -I../lib/eal/common -I. -I.. -Iconfig -I../config -Ilib/eal/include -I../lib/eal/include -Ilib/eal/linux/include -I../lib/eal/linux/include -Ilib/eal/x86/include -I../lib/eal/x86/include -I../kernel/linux -Ilib/eal -I../lib/eal -Ilib/kvargs -I../lib/kvargs -Ilib/log -I../lib/log -Ilib/metrics -I../lib/metrics -Ilib/telemetry -I../lib/telemetry -Ilib/argparse -I../lib/argparse -Ilib/mempool -I../lib/mempool -Ilib/ring -I../lib/ring -Ilib/net -I../lib/net -Ilib/mbuf -I../lib/mbuf -Ilib/ethdev -I../lib/ethdev -Ilib/meter -I../lib/meter -Ilib/cmdline -I../lib/cmdline -fdiagnostics-color=always -D_FILE_OFFSET_BITS=64 -Wall -Winvalid-pch -Wextra -Werror -std=c11 -O3 -include rte_config.h -Wvla -Wcast-qual -Wdeprecated -Wformat -Wformat-nonliteral -Wformat-security -Wmissing-declarations -Wmissing-prototypes -Wnested-externs -Wold-style-definition -Wpointer-arith -Wshadow -Wsign-compare -Wstrict-prototypes -Wundef -Wwrite-strings -Wno-packed-not-aligned -Wno-missing-field-initializers -D_GNU_SOURCE -march=native -mrtm -DALLOW_EXPERIMENTAL_API -MD -MQ examples/dpdk-symmetric_mp.p/multi_process_symmetric_mp_main.c.o -MF examples/dpdk-symmetric_mp.p/multi_process_symmetric_mp_main.c.o.d -o examples/dpdk-symmetric_mp.p/multi_process_symmetric_mp_main.c.o -c ../examples/multi_process/symmetric_mp/main.c
../examples/multi_process/symmetric_mp/main.c: In function ‘print_stats’:
../examples/multi_process/symmetric_mp/main.c:103:17: error: unused parameter ‘signum’ [-Werror=unused-parameter]
103 | print_stats(int signum)
| ~~~~^~~~~~
cc1: all warnings being treated as errors
[3629/3679] Compiling C object examples/dpdk-pipeline.p/pipeline_cli.c.o
[3630/3679] Linking target examples/dpdk-l3fwd-power
[3631/3679] Compiling C object examples/dpdk-qos_sched.p/qos_sched_app_thread.c.o
[3632/3679] Linking target examples/dpdk-mp_client
[3633/3679] Compiling C object examples/dpdk-ntb.p/ntb_ntb_fwd.c.o
[3634/3679] Compiling C object examples/dpdk-qos_meter.p/qos_meter_main.c.o
[3635/3679] Linking target examples/dpdk-mp_server
[3636/3679] Linking target examples/dpdk-simple_mp
[3637/3679] Compiling C object examples/dpdk-packet_ordering.p/packet_ordering_main.c.o
ninja: build stopped
DPDK STV team
More information about the test-report
mailing list