compilation|FAILURE| pw(169412) sid(39232) job(PER_PATCH_BUILD20009)[v2, 47/47] net/dpaa2: reject Rx queue deferred start
sys_stv at intel.com
sys_stv at intel.com
Thu Sep 10 16:32:55 CEST 2026
Test-Label: Intel-compilation
Test-Status: FAILURE
http://dpdk.org/patch/169412
_Compilation issues_
Submitter: Prashant Gupta <prashant.gupta_3 at nxp.com>
Date: 2026-09-10 13:51:58
Reply_mail: <20260910135158.2181141-48-prashant.gupta_3 at nxp.com>
DPDK git baseline: Repo:dpdk, CommitID: d55ccd4e6de64e3f797f60de9e81f1d60f849775
Meson Build Summary: 23 Builds Done, 22 Successful, 1 Failures, 0 Blocked
+-------------------+------------+--------------+------------+------------+-----------+----------+------------+
| os | gcc-static | clang-static | icc-static | gcc-shared | gcc-debug | document | gcc-16byte |
+-------------------+------------+--------------+------------+------------+-----------+----------+------------+
| OpenAnolis8.10-64 | pass | | | | | | |
| FreeBSD15-64 | pass | pass | | pass | pass | | |
| RHEL96-64 | pass | pass | | pass | pass | | |
| SUSE16-64 | pass | pass | | | | | |
| AzureLinux3.0-64 | pass | | | | | | |
| UB2604-32 | fail | | | | | | |
| RHEL10.1-64 | pass | | | | | | |
| UB2604-64 | pass | pass | | | | pass | pass |
| RHEL10-64RT | pass | | | | | | |
| UB2510-64 | pass | | | | | | |
| Fedora43-64 | pass | pass | | | | | |
| OpenEuler2404-64 | pass | | | | | | |
+-------------------+------------+--------------+------------+------------+-----------+----------+------------+
Comments:
Because of DPDK bug (https://bugs.dpdk.org/show_bug.cgi?id=928),
All the dpdk-next-* branch add `Ddisable_drivers=event/cnxk` option when build with ICC complier.
Test environment and configuration as below:
OS: OpenAnolis8.10-64
Kernel Version: 5.10.134-18.an8.x86_64
GCC Version: gcc (GCC) 8.5.0 20210514 (Anolis 8.5.0-24.0.1)
Clang Version: 18.1.8 (Red Hat 18.1.8-1.0.1.module+an8.9.0+11287+9d0292d3)
x86_64-native-linuxapp-gcc
OS: FreeBSD15-64
Kernel Version: 15.0-RELEASE
GCC Version: gcc (FreeBSD Ports Collection) 14.2.0
Clang Version: 19.1.7 (https://github.com/llvm/llvm-project.git llvmorg-19.1.7-0-gcd708029e0b2)
x86_64-native-bsdapp-gcc
x86_64-native-bsdapp-clang
x86_64-native-bsdapp-gcc+shared
x86_64-native-bsdapp-gcc+debug
OS: RHEL96-64
Kernel Version: 5.14.0-570.12.1.el9_6.x86_64
GCC Version: gcc (GCC) 11.5.0 20240719 (Red Hat 11.5.0-5)
Clang Version: 19.1.7 (Red Hat, Inc. 19.1.7-2.el9)
x86_64-native-linuxapp-gcc
x86_64-native-linuxapp-clang
x86_64-native-linuxapp-gcc+shared
x86_64-native-linuxapp-gcc+debug
OS: SUSE16-64
Kernel Version: 6.12.0-160000.26-default
GCC Version: gcc (SUSE Linux) 15.2.0
Clang Version: 19.1.7
x86_64-native-linuxapp-clang
x86_64-native-linuxapp-gcc
OS: AzureLinux3.0-64
Kernel Version: 6.6.47.1-1.azl3
GCC Version: gcc (GCC) 13.2.0
Clang Version: 18.1.2
x86_64-native-linuxapp-gcc
OS: UB2604-32
Kernel Version: 7.0.0-14-generic
GCC Version: gcc (Ubuntu 15.2.0-16ubuntu1) 15.2.0
Clang Version: 21.1.8 (6ubuntu1)
i686-native-linuxapp-gcc
OS: RHEL10.1-64
Kernel Version: 6.12.0-124.8.1.el10_1.x86_64
GCC Version: gcc (GCC) 14.3.1 20250617 (Red Hat 14.3.1-2)
Clang Version: 20.1.8 (Red Hat, Inc. 20.1.8-1.el10)
x86_64-native-linuxapp-gcc
OS: UB2604-64
Kernel Version: 7.0.0-14-generic
GCC Version: gcc (Ubuntu 15.2.0-16ubuntu1) 15.2.0
Clang Version: 21.1.8 (6ubuntu1)
x86_64-native-linuxapp-gcc+16byte
x86_64-native-linuxapp-gcc
x86_64-native-linuxapp-clang
x86_64-native-linuxapp-doc
OS: RHEL10-64RT
Kernel Version: 6.12.0-55.9.1.el10_0.x86_64+rt
GCC Version: gcc (GCC) 14.2.1 20250110 (Red Hat 14.2.1-7)
Clang Version: 19.1.7 (Red Hat, Inc. 19.1.7-2.el10)
x86_64-native-linuxapp-gcc
OS: UB2510-64
Kernel Version: 6.17.0-5-generic
GCC Version: gcc (Ubuntu 15.2.0-4ubuntu4) 15.2.0
Clang Version: NA
x86_64-native-linuxapp-gcc
OS: Fedora43-64
Kernel Version: 6.17.1-300.fc43.x86_64
GCC Version: gcc (GCC) 15.2.1 20250924 (Red Hat 15.2.1-2)
Clang Version: 21.1.8 (Fedora 21.1.8-4.fc43)
x86_64-native-linuxapp-gcc
x86_64-native-linuxapp-clang
OS: OpenEuler2404-64
Kernel Version: 6.6.0-132.0.0.111.oe2403sp3.x86_64
GCC Version: gcc (GCC) 12.3.1 (openEuler 12.3.1-105.oe2403sp3)
Clang Version: 17.0.6 ( 17.0.6-63.oe2403sp3)
x86_64-native-linuxapp-gcc
*Build Failed #1:
OS: UB2604-32
Target: i686-native-linuxapp-gcc
FAILED: drivers/libtmp_rte_bus_fslmc.a.p/bus_fslmc_fslmc_bus.c.o
gcc -Idrivers/libtmp_rte_bus_fslmc.a.p -Idrivers -I../drivers -Idrivers/bus/fslmc -I../drivers/bus/fslmc -I../drivers/bus/fslmc/mc -I../drivers/bus/fslmc/qbman/include -I../drivers/bus/fslmc/portal -Ilib/eal/linux -I../lib/eal/linux -Ilib/eal/common -I../lib/eal/common -I. -I.. -Iconfig -I../config -Ilib/eal/include -I../lib/eal/include -Ilib/eal/linux/include -I../lib/eal/linux/include -Ilib/eal/x86/include -I../lib/eal/x86/include -I../kernel/linux -Ilib/eal -I../lib/eal -Ilib/kvargs -I../lib/kvargs -Ilib/log -I../lib/log -Ilib/metrics -I../lib/metrics -Ilib/telemetry -I../lib/telemetry -Ilib/argparse -I../lib/argparse -Idrivers/common/dpaax -I../drivers/common/dpaax -I../drivers/common/dpaax/caamflib -Ilib/eventdev -I../lib/eventdev -Ilib/ring -I../lib/ring -Ilib/ethdev -I../lib/ethdev -Ilib/net -I../lib/net -Ilib/mbuf -I../lib/mbuf -Ilib/mempool -I../lib/mempool -Ilib/meter -I../lib/meter -Ilib/hash -I../lib/hash -Ilib/rcu -I../lib/rcu -Ilib/timer -I../lib/timer -Ilib/cryptodev -I../lib/cryptodev -Ilib/dmadev -I../lib/dmadev -fdiagnostics-color=always -D_FILE_OFFSET_BITS=64 -Wall -Winvalid-pch -Wextra -Werror -std=c11 -O3 -include rte_config.h -Wvla -Wcast-qual -Wdeprecated -Wformat -Wformat-nonliteral -Wformat-security -Wmissing-declarations -Wmissing-prototypes -Wnested-externs -Wold-style-definition -Wpointer-arith -Wshadow -Wsign-compare -Wstrict-prototypes -Wundef -Wwrite-strings -Wno-packed-not-aligned -Wno-missing-field-initializers -fzero-init-padding-bits=all -Wno-pointer-to-int-cast -D_GNU_SOURCE -m32 -fPIC -march=native -mrtm -DALLOW_EXPERIMENTAL_API -DALLOW_INTERNAL_API -Wno-format-truncation -Wno-address-of-packed-member -Wno-shadow -DRTE_COMPONENT_CLASS=pmd_bus -DRTE_COMPONENT_NAME=fslmc -DRTE_LOG_DEFAULT_LOGTYPE=bus.fslmc -MD -MQ drivers/libtmp_rte_bus_fslmc.a.p/bus_fslmc_fslmc_bus.c.o -MF drivers/libtmp_rte_bus_fslmc.a.p/bus_fslmc_fslmc_bus.c.o.d -o drivers/libtmp_rte_bus_fslmc.a.p/bus_fslmc_fslmc_bus.c.o -c ../drivers/bus/fslmc/fslmc_bus.c
In file included from ../drivers/bus/fslmc/fslmc_bus.c:14:
../drivers/bus/fslmc/fslmc_bus.c: In function ‘fslmc_soft_parser_protocol_supported’:
../drivers/bus/fslmc/fslmc_bus.c:87:57: error: format ‘%lx’ expects argument of type ‘long unsigned int’, but argument 4 has type ‘long long unsigned int’ [-Werror=format=]
87 | sizeof(struct dpaa2_parser_ccsr));
| ^
../lib/log/rte_log.h:334:39: note: in definition of macro ‘RTE_LOG’
334 | RTE_LOGTYPE_ ## t, # t ": " __VA_ARGS__)
| ^
../drivers/bus/fslmc/fslmc_logs.h:14:9: note: in expansion of macro ‘RTE_LOG_LINE’
14 | RTE_LOG_LINE(level, DPAA2_BUS, __VA_ARGS__)
| ^~~~~~~~~~~~
../drivers/bus/fslmc/fslmc_logs.h:23:9: note: in expansion of macro ‘DPAA2_BUS_LOG’
23 | DPAA2_BUS_LOG(ERR, fmt, ## __VA_ARGS__)
| ^~~~~~~~~~~~~
../drivers/bus/fslmc/fslmc_bus.c:85:17: note: in expansion of macro ‘DPAA2_BUS_ERR’
85 | DPAA2_BUS_ERR("Map 0x%lx(size=0x%lx) failed",
| ^~~~~~~~~~~~~
../drivers/bus/fslmc/fslmc_bus.c:87:57: error: format ‘%lx’ expects argument of type ‘long unsigned int’, but argument 5 has type ‘unsigned int’ [-Werror=format=]
87 | sizeof(struct dpaa2_parser_ccsr));
| ^
../lib/log/rte_log.h:334:39: note: in definition of macro ‘RTE_LOG’
334 | RTE_LOGTYPE_ ## t, # t ": " __VA_ARGS__)
| ^
../drivers/bus/fslmc/fslmc_logs.h:14:9: note: in expansion of macro ‘RTE_LOG_LINE’
14 | RTE_LOG_LINE(level, DPAA2_BUS, __VA_ARGS__)
| ^~~~~~~~~~~~
../drivers/bus/fslmc/fslmc_logs.h:23:9: note: in expansion of macro ‘DPAA2_BUS_LOG’
23 | DPAA2_BUS_LOG(ERR, fmt, ## __VA_ARGS__)
| ^~~~~~~~~~~~~
../drivers/bus/fslmc/fslmc_bus.c:85:17: note: in expansion of macro ‘DPAA2_BUS_ERR’
85 | DPAA2_BUS_ERR("Map 0x%lx(size=0x%lx) failed",
| ^~~~~~~~~~~~~
cc1: all warnings being treated as errors
[660/2794] Generating drivers/rte_bus_fslmc_map with a custom command
[661/2794] Compiling C object drivers/libtmp_rte_bus_fslmc.a.p/bus_fslmc_qbman_qbman_debug.c.o
[662/2794] Compiling C object drivers/libtmp_rte_bus_fslmc.a.p/bus_fslmc_portal_dpaa2_hw_dprc.c.o
[663/2794] Compiling C object drivers/libtmp_rte_bus_fslmc.a.p/bus_fslmc_fslmc_vfio.c.o
[664/2794] Compiling C object drivers/libtmp_rte_bus_dpaa.a.p/bus_dpaa_base_qbman_qman.c.o
[665/2794] Compiling C object drivers/libtmp_rte_bus_fslmc.a.p/bus_fslmc_portal_dpaa2_hw_dpio.c.o
[666/2794] Compiling C object drivers/libtmp_rte_bus_fslmc.a.p/bus_fslmc_qbman_qbman_portal.c.o
[667/2794] Compiling C object drivers/libtmp_rte_bus_pci.a.p/bus_pci_pci_common.c.o
[668/2794] Compiling C object lib/librte_pipeline.a.p/pipeline_rte_table_action.c.o
ninja: build stopped
DPDK STV team
More information about the test-report
mailing list