compilation|FAILURE| pw(169438) sid(39241) job(PER_PATCH_BUILD20018)[9/9] net/mana: use common sysfs routines

sys_stv at intel.com sys_stv at intel.com
Sat Sep 12 09:17:21 CEST 2026


Test-Label: Intel-compilation
Test-Status: FAILURE
http://dpdk.org/patch/169438

_Compilation issues_

Submitter: Stephen Hemminger <stephen at networkplumber.org>
Date: 2026-09-12 06:30:28
Reply_mail: <20260912063319.4117869-10-stephen at networkplumber.org>

DPDK git baseline: Repo:dpdk, CommitID: d55ccd4e6de64e3f797f60de9e81f1d60f849775


Meson Build Summary: 23 Builds Done, 17 Successful, 6 Failures, 0 Blocked

+-------------------+------------+--------------+------------+------------+-----------+----------+------------+
| os                | gcc-static | clang-static | icc-static | gcc-shared | gcc-debug | document | gcc-16byte |
+-------------------+------------+--------------+------------+------------+-----------+----------+------------+
| OpenAnolis8.10-64 | pass       |              |            |            |           |          |            |
| FreeBSD15-64      | pass       | fail         |            | pass       | pass      |          |            |
| RHEL96-64         | pass       | fail         |            | pass       | pass      |          |            |
| SUSE16-64         | pass       | fail         |            |            |           |          |            |
| AzureLinux3.0-64  | pass       |              |            |            |           |          |            |
| UB2604-32         | pass       |              |            |            |           |          |            |
| RHEL10.1-64       | pass       |              |            |            |           |          |            |
| UB2604-64         | pass       | fail         |            |            |           | fail     | pass       |
| RHEL10-64RT       | pass       |              |            |            |           |          |            |
| UB2510-64         | pass       |              |            |            |           |          |            |
| Fedora43-64       | pass       | fail         |            |            |           |          |            |
| OpenEuler2404-64  | pass       |              |            |            |           |          |            |
+-------------------+------------+--------------+------------+------------+-----------+----------+------------+

Comments: 
Because of DPDK bug (https://bugs.dpdk.org/show_bug.cgi?id=928),
All the dpdk-next-* branch add `Ddisable_drivers=event/cnxk` option when build with ICC complier. 
 
Test environment and configuration as below:


OS: OpenAnolis8.10-64
	Kernel Version: 5.10.134-18.an8.x86_64
	GCC Version: gcc (GCC) 8.5.0 20210514 (Anolis 8.5.0-24.0.1)
	Clang Version: 18.1.8 (Red Hat 18.1.8-1.0.1.module+an8.9.0+11287+9d0292d3)
	x86_64-native-linuxapp-gcc

OS: FreeBSD15-64
	Kernel Version: 15.0-RELEASE
	GCC Version: gcc (FreeBSD Ports Collection) 14.2.0
	Clang Version: 19.1.7 (https://github.com/llvm/llvm-project.git llvmorg-19.1.7-0-gcd708029e0b2)
	x86_64-native-bsdapp-gcc
	x86_64-native-bsdapp-clang
	x86_64-native-bsdapp-gcc+shared
	x86_64-native-bsdapp-gcc+debug

OS: RHEL96-64
	Kernel Version: 5.14.0-570.12.1.el9_6.x86_64
	GCC Version: gcc (GCC) 11.5.0 20240719 (Red Hat 11.5.0-5)
	Clang Version: 19.1.7 (Red Hat, Inc. 19.1.7-2.el9)
	x86_64-native-linuxapp-gcc
	x86_64-native-linuxapp-clang
	x86_64-native-linuxapp-gcc+shared
	x86_64-native-linuxapp-gcc+debug

OS: SUSE16-64
	Kernel Version: 6.12.0-160000.26-default
	GCC Version: gcc (SUSE Linux) 15.2.0
	Clang Version: 19.1.7
	x86_64-native-linuxapp-clang
	x86_64-native-linuxapp-gcc

OS: AzureLinux3.0-64
	Kernel Version: 6.6.47.1-1.azl3
	GCC Version: gcc (GCC) 13.2.0
	Clang Version: 18.1.2
	x86_64-native-linuxapp-gcc

OS: UB2604-32
	Kernel Version: 7.0.0-14-generic
	GCC Version: gcc (Ubuntu 15.2.0-16ubuntu1) 15.2.0
	Clang Version: 21.1.8 (6ubuntu1)
	i686-native-linuxapp-gcc

OS: RHEL10.1-64
	Kernel Version: 6.12.0-124.8.1.el10_1.x86_64
	GCC Version: gcc (GCC) 14.3.1 20250617 (Red Hat 14.3.1-2)
	Clang Version: 20.1.8 (Red Hat, Inc. 20.1.8-1.el10)
	x86_64-native-linuxapp-gcc

OS: UB2604-64
	Kernel Version: 7.0.0-14-generic
	GCC Version: gcc (Ubuntu 15.2.0-16ubuntu1) 15.2.0
	Clang Version: 21.1.8 (6ubuntu1)
	x86_64-native-linuxapp-gcc+16byte
	x86_64-native-linuxapp-gcc
	x86_64-native-linuxapp-clang
	x86_64-native-linuxapp-doc

OS: RHEL10-64RT
	Kernel Version: 6.12.0-55.9.1.el10_0.x86_64+rt
	GCC Version: gcc (GCC) 14.2.1 20250110 (Red Hat 14.2.1-7)
	Clang Version: 19.1.7 (Red Hat, Inc. 19.1.7-2.el10)
	x86_64-native-linuxapp-gcc

OS: UB2510-64
	Kernel Version: 6.17.0-5-generic
	GCC Version: gcc (Ubuntu 15.2.0-4ubuntu4) 15.2.0
	Clang Version: NA
	x86_64-native-linuxapp-gcc

OS: Fedora43-64
	Kernel Version: 6.17.1-300.fc43.x86_64
	GCC Version: gcc (GCC) 15.2.1 20250924 (Red Hat 15.2.1-2)
	Clang Version: 21.1.8 (Fedora 21.1.8-4.fc43)
	x86_64-native-linuxapp-gcc
	x86_64-native-linuxapp-clang

OS: OpenEuler2404-64
	Kernel Version: 6.6.0-132.0.0.111.oe2403sp3.x86_64
	GCC Version: gcc (GCC) 12.3.1 (openEuler 12.3.1-105.oe2403sp3)
	Clang Version: 17.0.6 ( 17.0.6-63.oe2403sp3)
	x86_64-native-linuxapp-gcc



*Build Failed #1:
OS: FreeBSD15-64
Target: x86_64-native-bsdapp-clang
FAILED: lib/librte_eal.a.p/eal_unix_eal_unix_sysfs.c.o 
clang -Ilib/librte_eal.a.p -Ilib -I../lib -Ilib/eal/common -I../lib/eal/common -I. -I.. -Iconfig -I../config -Ilib/eal/include -I../lib/eal/include -Ilib/eal/freebsd/include -I../lib/eal/freebsd/include -Ilib/eal/x86/include -I../lib/eal/x86/include -Ilib/eal -I../lib/eal -Ilib/kvargs -I../lib/kvargs -Ilib/log -I../lib/log -Ilib/metrics -I../lib/metrics -Ilib/telemetry -I../lib/telemetry -Ilib/argparse -I../lib/argparse -fcolor-diagnostics -D_FILE_OFFSET_BITS=64 -Wall -Winvalid-pch -Wextra -Werror -std=c11 -O3 -include rte_config.h -Wvla -Wcast-qual -Wcomma -Wdeprecated -Wformat -Wformat-nonliteral -Wformat-security -Wmissing-declarations -Wmissing-prototypes -Wnested-externs -Wold-style-definition -Wpointer-arith -Wshadow -Wsign-compare -Wstrict-prototypes -Wundef -Wwrite-strings -Wno-missing-field-initializers -D_GNU_SOURCE -D__BSD_VISIBLE -fPIC -march=native -mrtm -DALLOW_EXPERIMENTAL_API -DALLOW_INTERNAL_API '-DABI_VERSION="27.0"' -DRTE_EAL_PTHREAD_ATTR_SETAFFINITY_NP -DRTE_LIBEAL_USE_GETENTROPY -DRTE_LOG_DEFAULT_LOGTYPE=lib.eal -DRTE_COMPONENT_CLASS=lib -DRTE_COMPONENT_NAME=eal -MD -MQ lib/librte_eal.a.p/eal_unix_eal_unix_sysfs.c.o -MF lib/librte_eal.a.p/eal_unix_eal_unix_sysfs.c.o.d -o lib/librte_eal.a.p/eal_unix_eal_unix_sysfs.c.o -c ../lib/eal/unix/eal_unix_sysfs.c
../lib/eal/unix/eal_unix_sysfs.c:27:38: error: format string is not a string literal [-Werror,-Wformat-nonliteral]
   27 |         len = vsnprintf(path, sizeof(path), format, ap);
      |                                             ^~~~~~
1 error generated.
[80/2308] Compiling C object lib/librte_eal.a.p/eal_unix_eal_unix_thread.c.o
[81/2308] Compiling C object lib/librte_eal.a.p/eal_unix_rte_thread.c.o
[82/2308] Compiling C object lib/librte_eal.a.p/eal_freebsd_eal_alarm.c.o
[83/2308] Compiling C object lib/librte_eal.a.p/eal_freebsd_eal.c.o
[84/2308] Compiling C object lib/librte_eal.a.p/eal_freebsd_eal_dev.c.o
[85/2308] Compiling C object lib/librte_eal.a.p/eal_freebsd_eal_hugepage_info.c.o
[86/2308] Compiling C object lib/librte_eal.a.p/eal_freebsd_eal_lcore.c.o
[87/2308] Compiling C object lib/librte_eal.a.p/eal_freebsd_eal_memalloc.c.o
[88/2308] Compiling C object lib/librte_eal.a.p/eal_freebsd_eal_interrupts.c.o
ninja: build stopped




*Build Failed #2:
OS: RHEL96-64
Target: x86_64-native-linuxapp-clang
FAILED: lib/librte_eal.a.p/eal_unix_eal_unix_sysfs.c.o 
clang -Ilib/librte_eal.a.p -Ilib -I../lib -Ilib/eal/common -I../lib/eal/common -I. -I.. -Iconfig -I../config -Ilib/eal/include -I../lib/eal/include -Ilib/eal/linux/include -I../lib/eal/linux/include -Ilib/eal/x86/include -I../lib/eal/x86/include -I../kernel/linux -Ilib/eal -I../lib/eal -Ilib/kvargs -I../lib/kvargs -Ilib/log -I../lib/log -Ilib/metrics -I../lib/metrics -Ilib/telemetry -I../lib/telemetry -Ilib/argparse -I../lib/argparse -fcolor-diagnostics -D_FILE_OFFSET_BITS=64 -Wall -Winvalid-pch -Wextra -Werror -std=c11 -O3 -include rte_config.h -Wvla -Wcast-qual -Wcomma -Wdeprecated -Wformat -Wformat-nonliteral -Wformat-security -Wmissing-declarations -Wmissing-prototypes -Wnested-externs -Wold-style-definition -Wpointer-arith -Wshadow -Wsign-compare -Wstrict-prototypes -Wundef -Wwrite-strings -Wno-missing-field-initializers -D_GNU_SOURCE -fPIC -march=native -mrtm -DALLOW_EXPERIMENTAL_API -DALLOW_INTERNAL_API '-DABI_VERSION="27.0"' -DRTE_EAL_PTHREAD_ATTR_SETAFFINITY_NP -DRTE_LOG_DEFAULT_LOGTYPE=lib.eal -DRTE_COMPONENT_CLASS=lib -DRTE_COMPONENT_NAME=eal -DRTE_ANNOTATE_LOCKS -Wthread-safety -MD -MQ lib/librte_eal.a.p/eal_unix_eal_unix_sysfs.c.o -MF lib/librte_eal.a.p/eal_unix_eal_unix_sysfs.c.o.d -o lib/librte_eal.a.p/eal_unix_eal_unix_sysfs.c.o -c ../lib/eal/unix/eal_unix_sysfs.c
../lib/eal/unix/eal_unix_sysfs.c:27:38: error: format string is not a string literal [-Werror,-Wformat-nonliteral]
   27 |         len = vsnprintf(path, sizeof(path), format, ap);
      |                                             ^~~~~~
1 error generated.
[89/3660] Compiling C object lib/librte_eal.a.p/eal_unix_eal_unix_memory.c.o
[90/3660] Compiling C object lib/librte_eal.a.p/eal_unix_eal_unix_timer.c.o
[91/3660] Compiling C object lib/librte_eal.a.p/eal_unix_rte_thread.c.o
[92/3660] Compiling C object lib/librte_eal.a.p/eal_linux_eal.c.o
[93/3660] Compiling C object lib/librte_eal.a.p/eal_linux_eal_alarm.c.o
[94/3660] Compiling C object lib/librte_eal.a.p/eal_linux_eal_lcore.c.o
[95/3660] Compiling C object lib/librte_eal.a.p/eal_linux_eal_dev.c.o
[96/3660] Compiling C object lib/librte_eal.a.p/eal_linux_eal_hugepage_info.c.o
[97/3660] Compiling C object lib/librte_eal.a.p/eal_linux_eal_interrupts.c.o
ninja: build stopped




*Build Failed #3:
OS: SUSE16-64
Target: x86_64-native-linuxapp-clang
FAILED: lib/librte_eal.a.p/eal_unix_eal_unix_sysfs.c.o 
clang -Ilib/librte_eal.a.p -Ilib -I../lib -Ilib/eal/common -I../lib/eal/common -I. -I.. -Iconfig -I../config -Ilib/eal/include -I../lib/eal/include -Ilib/eal/linux/include -I../lib/eal/linux/include -Ilib/eal/x86/include -I../lib/eal/x86/include -I../kernel/linux -Ilib/eal -I../lib/eal -Ilib/kvargs -I../lib/kvargs -Ilib/log -I../lib/log -Ilib/metrics -I../lib/metrics -Ilib/telemetry -I../lib/telemetry -Ilib/argparse -I../lib/argparse -fdiagnostics-color=always -D_FILE_OFFSET_BITS=64 -Wall -Winvalid-pch -Wextra -Werror -std=c11 -O3 -include rte_config.h -Wvla -Wcast-qual -Wcomma -Wdeprecated -Wformat -Wformat-nonliteral -Wformat-security -Wmissing-declarations -Wmissing-prototypes -Wnested-externs -Wold-style-definition -Wpointer-arith -Wshadow -Wsign-compare -Wstrict-prototypes -Wundef -Wwrite-strings -Wno-missing-field-initializers -D_GNU_SOURCE -fPIC -march=native -mrtm -DALLOW_EXPERIMENTAL_API -DALLOW_INTERNAL_API '-DABI_VERSION="27.0"' -DRTE_EAL_PTHREAD_ATTR_SETAFFINITY_NP -DRTE_LOG_DEFAULT_LOGTYPE=lib.eal -DRTE_COMPONENT_CLASS=lib -DRTE_COMPONENT_NAME=eal -DRTE_ANNOTATE_LOCKS -Wthread-safety -MD -MQ lib/librte_eal.a.p/eal_unix_eal_unix_sysfs.c.o -MF lib/librte_eal.a.p/eal_unix_eal_unix_sysfs.c.o.d -o lib/librte_eal.a.p/eal_unix_eal_unix_sysfs.c.o -c ../lib/eal/unix/eal_unix_sysfs.c
../lib/eal/unix/eal_unix_sysfs.c:27:38: error: format string is not a string literal [-Werror,-Wformat-nonliteral]
   27 |         len = vsnprintf(path, sizeof(path), format, ap);
      |                                             ^~~~~~
1 error generated.
[87/3683] Compiling C object lib/librte_eal.a.p/eal_unix_eal_unix_thread.c.o
[88/3683] Compiling C object lib/librte_eal.a.p/eal_linux_eal_alarm.c.o
[89/3683] Compiling C object lib/librte_eal.a.p/eal_linux_eal.c.o
[90/3683] Compiling C object lib/librte_eal.a.p/eal_unix_eal_unix_timer.c.o
[91/3683] Compiling C object lib/librte_eal.a.p/eal_linux_eal_dev.c.o
[92/3683] Compiling C object lib/librte_eal.a.p/eal_linux_eal_hugepage_info.c.o
[93/3683] Compiling C object lib/librte_eal.a.p/eal_linux_eal_lcore.c.o
[94/3683] Compiling C object lib/librte_eal.a.p/eal_unix_rte_thread.c.o
[95/3683] Compiling C object lib/librte_eal.a.p/eal_linux_eal_interrupts.c.o
ninja: build stopped




*Build Failed #4:
OS: UB2604-64
Target: x86_64-native-linuxapp-clang
FAILED: lib/librte_eal.a.p/eal_unix_eal_unix_sysfs.c.o 
clang -Ilib/librte_eal.a.p -Ilib -I../lib -Ilib/eal/common -I../lib/eal/common -I. -I.. -Iconfig -I../config -Ilib/eal/include -I../lib/eal/include -Ilib/eal/linux/include -I../lib/eal/linux/include -Ilib/eal/x86/include -I../lib/eal/x86/include -I../kernel/linux -Ilib/eal -I../lib/eal -Ilib/kvargs -I../lib/kvargs -Ilib/log -I../lib/log -Ilib/metrics -I../lib/metrics -Ilib/telemetry -I../lib/telemetry -Ilib/argparse -I../lib/argparse -fdiagnostics-color=always -D_FILE_OFFSET_BITS=64 -Wall -Winvalid-pch -Wextra -Werror -std=c11 -O3 -include rte_config.h -Wvla -Wcast-qual -Wcomma -Wdeprecated -Wformat -Wformat-nonliteral -Wformat-security -Wmissing-declarations -Wmissing-prototypes -Wnested-externs -Wold-style-definition -Wpointer-arith -Wshadow -Wsign-compare -Wstrict-prototypes -Wundef -Wwrite-strings -Wno-missing-field-initializers -D_GNU_SOURCE -fPIC -march=native -mrtm -DALLOW_EXPERIMENTAL_API -DALLOW_INTERNAL_API '-DABI_VERSION="27.0"' -DRTE_EAL_PTHREAD_ATTR_SETAFFINITY_NP -DRTE_LOG_DEFAULT_LOGTYPE=lib.eal -DRTE_COMPONENT_CLASS=lib -DRTE_COMPONENT_NAME=eal -DRTE_ANNOTATE_LOCKS -Wthread-safety -MD -MQ lib/librte_eal.a.p/eal_unix_eal_unix_sysfs.c.o -MF lib/librte_eal.a.p/eal_unix_eal_unix_sysfs.c.o.d -o lib/librte_eal.a.p/eal_unix_eal_unix_sysfs.c.o -c ../lib/eal/unix/eal_unix_sysfs.c
../lib/eal/unix/eal_unix_sysfs.c:27:38: error: format string is not a string literal [-Werror,-Wformat-nonliteral]
   27 |         len = vsnprintf(path, sizeof(path), format, ap);
      |                                             ^~~~~~
1 error generated.
[86/3943] Compiling C object lib/librte_eal.a.p/eal_unix_eal_unix_memory.c.o
[87/3943] Compiling C object lib/librte_eal.a.p/eal_unix_eal_unix_timer.c.o
[88/3943] Compiling C object lib/librte_eal.a.p/eal_unix_eal_unix_thread.c.o
[89/3943] Compiling C object lib/librte_eal.a.p/eal_unix_rte_thread.c.o
[90/3943] Compiling C object lib/librte_eal.a.p/eal_linux_eal_alarm.c.o
[91/3943] Compiling C object lib/librte_eal.a.p/eal_linux_eal.c.o
[92/3943] Compiling C object lib/librte_eal.a.p/eal_linux_eal_dev.c.o
[93/3943] Compiling C object lib/librte_eal.a.p/eal_linux_eal_hugepage_info.c.o
[94/3943] Compiling C object lib/librte_eal.a.p/eal_linux_eal_interrupts.c.o
ninja: build stopped




*Build Failed #5:
OS: UB2604-64
Target: x86_64-native-linuxapp-doc
FAILED: doc/api/man 
/usr/bin/python3 ../doc/api/generate_doxygen.py doc/api/man /usr/bin/doxygen doc/api/doxy-api-man.conf
/root/UB2604-64_K7.0.0_GCC15.2.0/x86_64-native-linuxapp-doc/39241/dpdk/lib/eal/include/rte_sysfs.h:104: error: argument 'val' of command @param is not found in the argument list of __rte_format_printf(2, 3) (warning treated as error, aborting now)
Traceback (most recent call last):
  File "/root/UB2604-64_K7.0.0_GCC15.2.0/x86_64-native-linuxapp-doc/39241/dpdk/x86_64-native-linuxapp-doc/../doc/api/generate_doxygen.py", line 13, in <module>
    subprocess.run(doxygen_command, check=True, stdout=out)
    ~~~~~~~~~~~~~~^^^^^^^^^^^^^^^^^^^^^^^^^^^^^^^^^^^^^^^^^
  File "/usr/lib/python3.14/subprocess.py", line 578, in run
    raise CalledProcessError(retcode, process.args,
                             output=stdout, stderr=stderr)
subprocess.CalledProcessError: Command '['/usr/bin/doxygen', 'doc/api/doxy-api-man.conf']' returned non-zero exit status 1.
[3745/3751] Generating doc/api/doxygen-html with a custom command
FAILED: doc/api/html 
/usr/bin/python3 ../doc/api/generate_doxygen.py doc/api/html /usr/bin/doxygen doc/api/doxy-api-html.conf
/root/UB2604-64_K7.0.0_GCC15.2.0/x86_64-native-linuxapp-doc/39241/dpdk/lib/eal/include/rte_sysfs.h:104: error: argument 'val' of command @param is not found in the argument list of __rte_format_printf(2, 3) (warning treated as error, aborting now)
Traceback (most recent call last):
  File "/root/UB2604-64_K7.0.0_GCC15.2.0/x86_64-native-linuxapp-doc/39241/dpdk/x86_64-native-linuxapp-doc/../doc/api/generate_doxygen.py", line 13, in <module>
    subprocess.run(doxygen_command, check=True, stdout=out)
    ~~~~~~~~~~~~~~^^^^^^^^^^^^^^^^^^^^^^^^^^^^^^^^^^^^^^^^^
  File "/usr/lib/python3.14/subprocess.py", line 578, in run
    raise CalledProcessError(retcode, process.args,
                             output=stdout, stderr=stderr)
subprocess.CalledProcessError: Command '['/usr/bin/doxygen', 'doc/api/doxy-api-html.conf']' returned non-zero exit status 1.
[3746/3751] Compiling C object app/dpdk-test.p/test_test_trace_perf.c.o
[3747/3751] Compiling C object app/dpdk-test.p/test_test_ring_perf.c.o
[3748/3751] Compiling C object app/dpdk-test.p/test_test_ring.c.o
[3749/3751] Generating doc/guides/html_guides with a custom command
Install the sphinx ReadTheDocs theme for improved html documentation layout: https://sphinx-rtd-theme.readthedocs.io/
ninja: build stopped




*Build Failed #6:
OS: Fedora43-64
Target: x86_64-native-linuxapp-clang
FAILED: lib/librte_eal.a.p/eal_unix_eal_unix_sysfs.c.o 
clang -Ilib/librte_eal.a.p -Ilib -I../lib -Ilib/eal/common -I../lib/eal/common -I. -I.. -Iconfig -I../config -Ilib/eal/include -I../lib/eal/include -Ilib/eal/linux/include -I../lib/eal/linux/include -Ilib/eal/x86/include -I../lib/eal/x86/include -I../kernel/linux -Ilib/eal -I../lib/eal -Ilib/kvargs -I../lib/kvargs -Ilib/log -I../lib/log -Ilib/metrics -I../lib/metrics -Ilib/telemetry -I../lib/telemetry -Ilib/argparse -I../lib/argparse -fdiagnostics-color=always -D_FILE_OFFSET_BITS=64 -Wall -Winvalid-pch -Wextra -Werror -std=c11 -O3 -include rte_config.h -Wvla -Wcast-qual -Wcomma -Wdeprecated -Wformat -Wformat-nonliteral -Wformat-security -Wmissing-declarations -Wmissing-prototypes -Wnested-externs -Wold-style-definition -Wpointer-arith -Wshadow -Wsign-compare -Wstrict-prototypes -Wundef -Wwrite-strings -Wno-missing-field-initializers -D_GNU_SOURCE -fPIC -march=native -mrtm -DALLOW_EXPERIMENTAL_API -DALLOW_INTERNAL_API '-DABI_VERSION="27.0"' -DRTE_EAL_PTHREAD_ATTR_SETAFFINITY_NP -DRTE_LOG_DEFAULT_LOGTYPE=lib.eal -DRTE_COMPONENT_CLASS=lib -DRTE_COMPONENT_NAME=eal -DRTE_ANNOTATE_LOCKS -Wthread-safety -MD -MQ lib/librte_eal.a.p/eal_unix_eal_unix_sysfs.c.o -MF lib/librte_eal.a.p/eal_unix_eal_unix_sysfs.c.o.d -o lib/librte_eal.a.p/eal_unix_eal_unix_sysfs.c.o -c ../lib/eal/unix/eal_unix_sysfs.c
../lib/eal/unix/eal_unix_sysfs.c:27:38: error: format string is not a string literal [-Werror,-Wformat-nonliteral]
   27 |         len = vsnprintf(path, sizeof(path), format, ap);
      |                                             ^~~~~~
1 error generated.
[83/3682] Compiling C object lib/librte_eal.a.p/eal_unix_eal_firmware.c.o
[84/3682] Compiling C object lib/librte_eal.a.p/eal_unix_eal_unix_memory.c.o
[85/3682] Compiling C object lib/librte_eal.a.p/eal_linux_eal_cpuflags.c.o
[86/3682] Compiling C object lib/librte_eal.a.p/eal_unix_eal_filesystem.c.o
[87/3682] Compiling C object lib/librte_eal.a.p/eal_unix_eal_unix_timer.c.o
[88/3682] Compiling C object lib/librte_eal.a.p/eal_unix_eal_unix_thread.c.o
[89/3682] Compiling C object lib/librte_eal.a.p/eal_unix_rte_thread.c.o
[90/3682] Compiling C object lib/librte_eal.a.p/eal_linux_eal.c.o
[91/3682] Compiling C object lib/librte_eal.a.p/eal_linux_eal_alarm.c.o
ninja: build stopped


DPDK STV team


More information about the test-report mailing list