|FAILURE| pw169429-169429 Description: SUCCESS
al-sw-devops at alabs.net
al-sw-devops at alabs.net
Sat Sep 12 20:16:20 CEST 2026
Test-Name: DPDK Fast test suite
Test-Label: aws-unit-testing
Test-Status: FAILURE
_Unit Testing Build error encountered _
https://dpdk.org/patch/169429
Test Status Summary:
+--------------+------------------+
| Architecture | DPDK Unit Test |
+--------------+------------------+
| x86_64 | PASS |
+--------------+------------------+
| arm64 | FAILURE |
+--------------+------------------+
Test environment (aarch64):
Description: Build error encountered
OS : Ubuntu 24.04.1 LTS
Kernel : 7.0.0-1011-aws
NIC : Elastic Network Adapter
GCC : 13.3.0-6ubuntu2~24.04
Test last 100 lines (aarch64)
gpu/cuda: missing dependency, "cuda.h"
power/amd_uncore: missing dependency, "libe_smi"
Message: DPDK build config complete:
source path = "/root/dpdk-ci/tools/dpdk"
build path = "/root/dpdk-ci/tools/dpdk/build"
Build targets in project: 1065
Found ninja-1.11.1.git.kitware.jobserver-1 at /usr/local/bin/ninja
ninja: Entering directory `build'
[1/3243] Generating lib/rte_kvargs_map with a custom command
[2/3243] Generating lib/rte_argparse_map with a custom command
[3/3243] Generating lib/rte_log_map with a custom command
[4/3243] Generating lib/rte_telemetry_map with a custom command
[5/3243] Generating lib/rte_pmu_map with a custom command
[6/3243] Compiling C object lib/librte_eal.a.p/eal_common_eal_common_errno.c.o
[7/3243] Compiling C object lib/librte_pmu.a.p/pmu_pmu_arm64.c.o
[8/3243] Compiling C object lib/librte_log.a.p/log_log_syslog.c.o
[9/3243] Compiling C object lib/librte_eal.a.p/eal_common_eal_common_class.c.o
[10/3243] Compiling C object lib/librte_eal.a.p/eal_common_eal_common_debug.c.o
[11/3243] Compiling C object lib/librte_eal.a.p/eal_common_eal_common_hexdump.c.o
[12/3243] Compiling C object lib/librte_log.a.p/log_log_journal.c.o
[13/3243] Compiling C object lib/librte_eal.a.p/eal_common_eal_common_lcore_var.c.o
[14/3243] Compiling C object lib/librte_eal.a.p/eal_common_eal_common_config.c.o
[15/3243] Compiling C object lib/librte_log.a.p/log_log_color.c.o
[16/3243] Compiling C object lib/librte_kvargs.a.p/kvargs_rte_kvargs.c.o
[17/3243] Compiling C object lib/librte_eal.a.p/eal_common_eal_common_launch.c.o
[18/3243] Compiling C object lib/librte_log.a.p/log_log_timestamp.c.o
[19/3243] Linking static target lib/librte_kvargs.a
[20/3243] Compiling C object lib/librte_eal.a.p/eal_common_rte_bitset.c.o
[21/3243] Compiling C object lib/librte_eal.a.p/eal_common_eal_common_timer.c.o
[22/3243] Compiling C object lib/librte_telemetry.a.p/telemetry_telemetry_data.c.o
[23/3243] Compiling C object lib/librte_telemetry.a.p/telemetry_telemetry_legacy.c.o
[24/3243] Compiling C object lib/librte_eal.a.p/eal_common_eal_common_tailqs.c.o
[25/3243] Compiling C object lib/librte_eal.a.p/eal_common_rte_random.c.o
FAILED: lib/librte_eal.a.p/eal_common_rte_random.c.o
cc -Ilib/librte_eal.a.p -Ilib -I../lib -Ilib/eal/common -I../lib/eal/common -I. -I.. -Iconfig -I../config -Ilib/eal/include -I../lib/eal/include -Ilib/eal/linux/include -I../lib/eal/linux/include -Ilib/eal/arm/include -I../lib/eal/arm/include -I../kernel/linux -Ilib/eal -I../lib/eal -Ilib/kvargs -I../lib/kvargs -Ilib/log -I../lib/log -Ilib/metrics -I../lib/metrics -Ilib/telemetry -I../lib/telemetry -Ilib/argparse -I../lib/argparse -fdiagnostics-color=always -D_FILE_OFFSET_BITS=64 -Wall -Winvalid-pch -Wextra -std=c11 -O3 -include rte_config.h -Wvla -Wcast-qual -Wdeprecated -Wformat -Wformat-nonliteral -Wformat-security -Wmissing-declarations -Wmissing-prototypes -Wnested-externs -Wold-style-definition -Wpointer-arith -Wshadow -Wsign-compare -Wstrict-prototypes -Wundef -Wwrite-strings -Wno-packed-not-aligned -Wno-missing-field-initializers -D_GNU_SOURCE -fPIC -mcpu=neoverse-n1 -DALLOW_EXPERIMENTAL_API -DALLOW_INTERNAL_API '-DABI_VERSION="27.0"' -DRTE_EAL_PTHREAD_ATTR_SETAFFINITY_NP -DRTE_LOG_DEFAULT_LOGTYPE=lib.eal -DRTE_COMPONENT_CLASS=lib -DRTE_COMPONENT_NAME=eal -MD -MQ lib/librte_eal.a.p/eal_common_rte_random.c.o -MF lib/librte_eal.a.p/eal_common_rte_random.c.o.d -o lib/librte_eal.a.p/eal_common_rte_random.c.o -c ../lib/eal/common/rte_random.c
../lib/eal/common/rte_random.c: In function ‘eal_rand_init’:
../lib/eal/common/rte_random.c:250:27: warning: implicit declaration of function ‘getenv’ [-Wimplicit-function-declaration]
250 | const char *env = getenv("DPDK_RANDOM_SEED");
| ^~~~~~
../lib/eal/common/rte_random.c:21:1: note: ‘getenv’ is defined in header ‘<stdlib.h>’; did you forget to ‘#include <stdlib.h>’?
20 | #include "eal_private.h"
+++ |+#include <stdlib.h>
21 |
../lib/eal/common/rte_random.c:250:27: warning: nested extern declaration of ‘getenv’ [-Wnested-externs]
250 | const char *env = getenv("DPDK_RANDOM_SEED");
| ^~~~~~
../lib/eal/common/rte_random.c:250:27: warning: initialization of ‘const char *’ from ‘int’ makes pointer from integer without a cast [-Wint-conversion]
../lib/eal/common/rte_random.c:255:24: warning: implicit declaration of function ‘strtoull’; did you mean ‘strcoll’? [-Wimplicit-function-declaration]
255 | seed = strtoull(env, &end, 0);
| ^~~~~~~~
| strcoll
../lib/eal/common/rte_random.c:255:24: warning: nested extern declaration of ‘strtoull’ [-Wnested-externs]
../lib/eal/common/rte_random.c:257:34: error: ‘EXIT_FAILURE’ undeclared (first use in this function)
257 | rte_exit(EXIT_FAILURE,
| ^~~~~~~~~~~~
../lib/eal/common/rte_random.c:257:34: note: ‘EXIT_FAILURE’ is defined in header ‘<stdlib.h>’; did you forget to ‘#include <stdlib.h>’?
../lib/eal/common/rte_random.c:257:34: note: each undeclared identifier is reported only once for each function it appears in
[26/3243] Compiling C object lib/librte_eal.a.p/eal_common_rte_version.c.o
[27/3243] Compiling C object lib/librte_eal.a.p/eal_common_rte_reciprocal.c.o
[28/3243] Compiling C object lib/librte_eal.a.p/eal_common_eal_common_string_fns.c.o
[29/3243] Compiling C object lib/librte_eal.a.p/eal_common_eal_common_mcfg.c.o
[30/3243] Compiling C object lib/librte_eal.a.p/eal_common_eal_common_uuid.c.o
[31/3243] Compiling C object lib/librte_eal.a.p/eal_common_eal_common_hypervisor.c.o
[32/3243] Compiling C object lib/librte_eal.a.p/eal_common_eal_common_memalloc.c.o
[33/3243] Compiling C object lib/librte_eal.a.p/eal_common_eal_common_cpuflags.c.o
[34/3243] Compiling C object lib/librte_log.a.p/log_log.c.o
[35/3243] Compiling C object lib/librte_eal.a.p/eal_common_eal_common_devargs.c.o
[36/3243] Compiling C object lib/librte_eal.a.p/eal_common_eal_common_interrupts.c.o
[37/3243] Compiling C object lib/librte_eal.a.p/eal_common_eal_common_bus.c.o
[38/3243] Compiling C object lib/librte_pmu.a.p/pmu_pmu.c.o
[39/3243] Compiling C object lib/librte_eal.a.p/eal_common_eal_common_thread.c.o
[40/3243] Generating lib/kvargs.sym_chk with a custom command (wrapped by meson to capture output)
[41/3243] Compiling C object lib/librte_eal.a.p/eal_common_eal_common_dev.c.o
[42/3243] Compiling C object lib/librte_eal.a.p/eal_common_eal_common_trace_points.c.o
[43/3243] Compiling C object lib/librte_eal.a.p/eal_common_eal_common_memzone.c.o
[44/3243] Compiling C object lib/librte_eal.a.p/eal_common_malloc_elem.c.o
[45/3243] Compiling C object lib/librte_eal.a.p/eal_common_eal_common_lcore.c.o
[46/3243] Compiling C object lib/librte_eal.a.p/eal_common_eal_common_trace_ctf.c.o
[47/3243] Compiling C object lib/librte_eal.a.p/eal_common_eal_common_dynmem.c.o
[48/3243] Compiling C object lib/librte_argparse.a.p/argparse_rte_argparse.c.o
[49/3243] Compiling C object lib/librte_eal.a.p/eal_common_eal_common_trace_utils.c.o
[50/3243] Compiling C object lib/librte_eal.a.p/eal_common_eal_common_trace.c.o
[51/3243] Compiling C object lib/librte_eal.a.p/eal_common_rte_malloc.c.o
[52/3243] Compiling C object lib/librte_eal.a.p/eal_common_eal_common_memory.c.o
[53/3243] Compiling C object lib/librte_eal.a.p/eal_common_malloc_heap.c.o
[54/3243] Compiling C object lib/librte_eal.a.p/eal_common_eal_common_fbarray.c.o
[55/3243] Compiling C object lib/librte_eal.a.p/eal_common_eal_common_proc.c.o
[56/3243] Compiling C object lib/librte_eal.a.p/eal_common_rte_service.c.o
[57/3243] Compiling C object lib/librte_telemetry.a.p/telemetry_telemetry.c.o
[58/3243] Compiling C object lib/librte_eal.a.p/eal_common_eal_common_options.c.o
ninja: build stopped: subcommand failed.
Test build failed.
FAILURE
Test environment (x86_64):
Description: SUCCESS
OS : Ubuntu 24.04.3 LTS
Kernel : 7.0.0-1011-aws
NIC : Elastic Network Adapter
GCC : 13.3.0-6ubuntu2~24.04
Test last 100 lines (x86_64)
[3324/3423] Linking target drivers/librte_net_nbl.so.27.0
[3325/3423] Linking target drivers/librte_net_netvsc.so.27.0
[3326/3423] Linking target drivers/librte_net_ionic.so.27.0
[3327/3423] Linking static target drivers/net/rnp/base/librnp_base.a
[3328/3423] Linking target drivers/librte_net_ngbe.so.27.0
[3329/3423] Linking target drivers/librte_net_null.so.27.0
[3330/3423] Linking target drivers/librte_net_nfp.so.27.0
[3331/3423] Linking target drivers/librte_net_octeon_ep.so.27.0
[3332/3423] Linking static target drivers/net/sxe2/libsxe2_avx512_lib.a
[3333/3423] Linking static target drivers/net/sxe2/libsxe2_avx2_lib.a
[3334/3423] Linking target drivers/librte_net_pfe.so.27.0
[3335/3423] Linking target drivers/librte_net_ring.so.27.0
[3336/3423] Compiling C object app/dpdk-test.p/test_test_timer_secondary.c.o
[3337/3423] Linking target drivers/librte_net_qede.so.27.0
[3338/3423] Linking target drivers/librte_net_ntnic.so.27.0
[3339/3423] Linking static target drivers/librte_net_virtio_avx512_lib.a
[3340/3423] Linking target drivers/librte_net_r8169.so.27.0
[3341/3423] Linking target drivers/librte_net_softnic.so.27.0
[3342/3423] Linking target drivers/librte_net_rnp.so.27.0
[3343/3423] Linking target drivers/librte_net_tap.so.27.0
[3344/3423] Linking target drivers/librte_net_sfc.so.27.0
[3345/3423] Linking target drivers/librte_net_txgbe.so.27.0
[3346/3423] Linking target drivers/librte_net_vhost.so.27.0
[3347/3423] Linking target drivers/librte_net_virtio.so.27.0
[3348/3423] Linking target drivers/librte_net_xsc.so.27.0
[3349/3423] Linking target drivers/librte_net_thunderx.so.27.0
[3350/3423] Linking target drivers/librte_net_vdev_netvsc.so.27.0
[3351/3423] Linking target drivers/librte_net_vmxnet3.so.27.0
[3352/3423] Linking target drivers/librte_raw_cnxk_gpio.so.27.0
[3353/3423] Linking target drivers/librte_raw_cnxk_bphy.so.27.0
[3354/3423] Linking target drivers/librte_raw_gdtc.so.27.0
[3355/3423] Linking target drivers/librte_raw_cnxk_rvu_lf.so.27.0
[3356/3423] Linking target drivers/librte_net_zxdh.so.27.0
[3357/3423] Linking target drivers/librte_raw_ntb.so.27.0
[3358/3423] Linking target drivers/librte_raw_skeleton.so.27.0
[3359/3423] Linking target drivers/librte_net_sxe2.so.27.0
[3360/3423] Linking target drivers/librte_raw_dpaa2_cmdif.so.27.0
[3361/3423] Linking target drivers/librte_crypto_bcmfs.so.27.0
[3362/3423] Linking target drivers/librte_crypto_ionic.so.27.0
[3363/3423] Linking target drivers/librte_crypto_scheduler.so.27.0
[3364/3423] Linking target drivers/librte_crypto_null.so.27.0
[3365/3423] Linking target drivers/librte_crypto_caam_jr.so.27.0
[3366/3423] Linking static target drivers/librte_event_dlb2_avx512_lib.a
[3367/3423] Linking target drivers/librte_crypto_nitrox.so.27.0
[3368/3423] Linking target drivers/librte_crypto_virtio.so.27.0
[3369/3423] Linking target drivers/librte_compress_nitrox.so.27.0
[3370/3423] Linking target drivers/librte_compress_octeontx.so.27.0
[3371/3423] Linking target drivers/librte_ml_cnxk.so.27.0
[3372/3423] Linking target drivers/librte_regex_cn9k.so.27.0
[3373/3423] Linking target drivers/librte_vdpa_nfp.so.27.0
[3374/3423] Linking target drivers/librte_vdpa_sfc.so.27.0
[3375/3423] Linking target drivers/librte_vdpa_ifc.so.27.0
[3376/3423] Linking target drivers/librte_event_cnxk.so.27.0
[3377/3423] Linking target drivers/librte_event_dsw.so.27.0
[3378/3423] Linking target drivers/librte_event_dpaa2.so.27.0
[3379/3423] Linking target drivers/librte_event_dlb2.so.27.0
[3380/3423] Linking target drivers/librte_event_dpaa.so.27.0
[3381/3423] Linking target drivers/librte_event_opdl.so.27.0
[3382/3423] Linking target drivers/librte_event_octeontx.so.27.0
[3383/3423] Linking target drivers/librte_event_skeleton.so.27.0
[3384/3423] Linking target drivers/librte_baseband_acc.so.27.0
[3385/3423] Linking target drivers/librte_event_sw.so.27.0
[3386/3423] Linking target drivers/librte_baseband_fpga_lte_fec.so.27.0
[3387/3423] Linking target drivers/librte_baseband_la12xx.so.27.0
[3388/3423] Linking target drivers/librte_baseband_fpga_5gnr_fec.so.27.0
[3389/3423] Linking target drivers/librte_baseband_turbo_sw.so.27.0
[3390/3423] Linking target drivers/librte_power_acpi.so.27.0
[3391/3423] Linking target drivers/librte_power_cppc.so.27.0
[3392/3423] Linking target drivers/librte_power_amd_pstate.so.27.0
[3393/3423] Linking target drivers/librte_power_intel_pstate.so.27.0
[3394/3423] Linking target drivers/librte_baseband_null.so.27.0
[3395/3423] Linking target drivers/librte_power_intel_uncore.so.27.0
[3396/3423] Linking target drivers/librte_power_kvm_vm.so.27.0
[3397/3423] Compiling C object app/dpdk-test.p/test_test_table_combined.c.o
[3398/3423] Compiling C object app/dpdk-test.p/test_test_security_inline_macsec.c.o
[3399/3423] Linking target app/dpdk-graph
[3400/3423] Linking target app/dpdk-proc-info
[3401/3423] Linking target app/dpdk-test-cmdline
[3402/3423] Linking target app/dpdk-test-dma-perf
[3403/3423] Linking target app/dpdk-pdump
[3404/3423] Linking target app/dpdk-test-crypto-perf
[3405/3423] Generating app/test/test_symlink with a custom command
[3406/3423] Linking target app/dpdk-test-acl
[3407/3423] Linking target app/dpdk-test-flow-perf
[3408/3423] Linking target app/dpdk-test-eventdev
[3409/3423] Linking target app/dpdk-test-fib
[3410/3423] Linking target app/dpdk-test-compress-perf
[3411/3423] Linking target app/dpdk-test-bbdev
[3412/3423] Linking target app/dpdk-test-gpudev
[3413/3423] Linking target app/dpdk-testpmd
[3414/3423] Linking target app/dpdk-test-sad
[3415/3423] Linking target app/dpdk-test-security-perf
[3416/3423] Linking target app/dpdk-test-mldev
[3417/3423] Linking target app/dpdk-test-regex
[3418/3423] Linking target app/dpdk-test-pipeline
[3419/3423] Compiling C object app/dpdk-test.p/test_test_cryptodev.c.o
[3420/3423] Compiling C object app/dpdk-test.p/test_test_trace_perf.c.o
[3421/3423] Compiling C object app/dpdk-test.p/test_test_ring_perf.c.o
[3422/3423] Compiling C object app/dpdk-test.p/test_test_ring.c.o
[3423/3423] Linking target app/dpdk-test
More information about the test-report
mailing list