|FAILURE| pw169449 [PATCH] common/cnxk: fix NPA pool RANGE interrupt handling

qemudev at loongson.cn qemudev at loongson.cn
Sun Sep 13 06:31:26 CEST 2026


Test-Label: loongson-compile-loongarch-abi2
Test-Status: FAILURE
http://dpdk.org/patch/169449

_ninja build failure_

Submitter: Amiya Ranjan Mohakud <amiyaranjan.mohakud at gmail.com>
Date: Sun, 13 Sep 2026 09:38:00 +0530
DPDK git baseline: Repo:dpdk-next-net-mrvl
  Branch: next-net-mrvl-for-main
  CommitID: 775d5a6348c8dd6673bae5c1a7235d2593af06ca

169449 --> ninja build failed

Test environment and result as below:

+---------------------+----------------+
|     Environment     | compilation    |
+---------------------+----------------+
| Loongnix-Server 23.2 | FAIL           |
+---------------------+----------------+

Loongnix-Server 23.2
    Kernel: 6.6.52-1.10.lns23.loongarch64
    Compiler: gcc 12.3


Ninja build logs:
-------------------------------BEGIN LOGS----------------------------
FAILED: drivers/rte_common_cnxk.sym_chk
/usr/bin/meson --internal exe --capture drivers/rte_common_cnxk.sym_chk -- /home/loongson/.dpdk/dpdk/buildtools/check-symbols.sh /home/loongson/.dpdk/dpdk/build/drivers/common_cnxk_exports.map drivers/librte_common_cnxk.a
--- stderr ---
roc_npa_pool_range_int_enable is flagged as internal but is not exported as an internal symbol
Please add RTE_EXPORT_INTERNAL_SYMBOL to the definition of roc_npa_pool_range_int_enable

[1737/3223] Linking target drivers/librte_net_ionic.so.27.0
[1738/3223] Compiling C object drivers/libtmp_rte_net_mlx5.a.p/net_mlx5_mlx5.c.o
[1739/3223] Compiling C object drivers/librte_net_mlx4.a.p/meson-generated_.._rte_net_mlx4.pmd.c.o
[1740/3223] Generating drivers/rte_net_cpfl.sym_chk with a custom command (wrapped by meson to capture output)
[1741/3223] Compiling C object drivers/libtmp_rte_net_mlx5.a.p/net_mlx5_mlx5_hws_global_actions.c.o
[1742/3223] Compiling C object drivers/libtmp_rte_net_mlx5.a.p/net_mlx5_mlx5_rxtx_vec_null.c.o
[1743/3223] Generating drivers/rte_net_memif.pmd.c with a custom command
[1744/3223] Compiling C object drivers/libtmp_rte_net_mlx5.a.p/net_mlx5_mlx5_flow_quota.c.o
[1745/3223] Generating drivers/rte_net_iavf.sym_chk with a custom command (wrapped by meson to capture output)
[1746/3223] Compiling C object drivers/libtmp_rte_net_mlx5.a.p/net_mlx5_mlx5_trigger.c.o
[1747/3223] Compiling C object drivers/libtmp_rte_net_mlx5.a.p/net_mlx5_mlx5_nta_split.c.o
[1748/3223] Compiling C object drivers/libtmp_rte_net_mlx5.a.p/net_mlx5_mlx5_txq.c.o
[1749/3223] Compiling C object drivers/libtmp_rte_net_mlx5.a.p/net_mlx5_linux_mlx5_socket.c.o
[1750/3223] Compiling C object drivers/libtmp_rte_net_ixgbe.a.p/net_intel_ixgbe_ixgbe_ethdev.c.o
[1751/3223] Compiling C object drivers/libtmp_rte_net_mlx5.a.p/net_mlx5_mlx5_nta_sample.c.o
[1752/3223] Compiling C object drivers/libtmp_rte_net_mlx5.a.p/net_mlx5_mlx5_flow_verbs.c.o
[1753/3223] Compiling C object drivers/libtmp_rte_net_mlx5.a.p/net_mlx5_mlx5_utils.c.o
[1754/3223] Compiling C object drivers/libtmp_rte_net_mlx5.a.p/net_mlx5_mlx5_flow_meter.c.o
[1755/3223] Compiling C object drivers/libtmp_rte_net_ice.a.p/net_intel_ice_ice_rxtx.c.o
[1756/3223] Generating drivers/rte_net_idpf.sym_chk with a custom command (wrapped by meson to capture output)
[1757/3223] Compiling C object drivers/libtmp_rte_net_mlx5.a.p/net_mlx5_mlx5_rxq.c.o
[1758/3223] Compiling C object drivers/libtmp_rte_net_ixgbe.a.p/net_intel_ixgbe_ixgbe_rxtx.c.o
[1759/3223] Compiling C object drivers/libtmp_rte_net_mlx5.a.p/net_mlx5_linux_mlx5_ethdev_os.c.o
[1760/3223] Compiling C object drivers/libtmp_rte_net_mlx5.a.p/net_mlx5_mlx5_rx.c.o
[1761/3223] Compiling C object drivers/libtmp_rte_net_mlx5.a.p/net_mlx5_linux_mlx5_os.c.o
[1762/3223] Compiling C object drivers/libtmp_rte_net_mlx5.a.p/net_mlx5_mlx5_hws_cnt.c.o
[1763/3223] Compiling C object drivers/libtmp_rte_net_mlx5.a.p/net_mlx5_mlx5_tx_mpw.c.o
[1764/3223] Compiling C object drivers/libtmp_rte_net_mlx5.a.p/net_mlx5_mlx5_flow.c.o
[1765/3223] Compiling C object drivers/libtmp_rte_net_mlx5.a.p/net_mlx5_mlx5_flow_dv.c.o
[1766/3223] Compiling C object drivers/libtmp_rte_net_mlx5.a.p/net_mlx5_mlx5_tx_nompw.c.o
[1767/3223] Compiling C object drivers/libtmp_rte_net_mlx5.a.p/net_mlx5_mlx5_tx_empw.c.o
[1768/3223] Compiling C object drivers/libtmp_rte_net_mlx5.a.p/net_mlx5_mlx5_tx_txpp.c.o
[1769/3223] Compiling C object drivers/libtmp_rte_net_mlx5.a.p/net_mlx5_mlx5_flow_hw.c.o
ninja: build stopped: subcommand failed.
-------------------------------END LOGS------------------------------


More information about the test-report mailing list