compilation|FAILURE| pw(169449) sid(39244) job(PER_PATCH_BUILD20021)common/cnxk: fix NPA pool RANGE interrupt handling
sys_stv at intel.com
sys_stv at intel.com
Sun Sep 13 06:45:21 CEST 2026
Test-Label: Intel-compilation
Test-Status: FAILURE
http://dpdk.org/patch/169449
_Compilation issues_
Submitter: Amiya Ranjan Mohakud <amiyaranjan.mohakud at gmail.com>
Date: 2026-09-13 04:08:00
Reply_mail: <20260913040800.60274-1-amiyaranjan.mohakud at gmail.com>
DPDK git baseline: Repo:dpdk-next-net-mrvl, CommitID: 775d5a6348c8dd6673bae5c1a7235d2593af06ca
Meson Build Summary: 23 Builds Done, 5 Successful, 18 Failures, 0 Blocked
+-------------------+------------+--------------+------------+------------+-----------+----------+------------+
| os | gcc-static | clang-static | icc-static | gcc-shared | gcc-debug | document | gcc-16byte |
+-------------------+------------+--------------+------------+------------+-----------+----------+------------+
| OpenAnolis8.10-64 | fail | | | | | | |
| FreeBSD15-64 | pass | pass | | pass | pass | | |
| RHEL96-64 | fail | fail | | fail | fail | | |
| SUSE16-64 | fail | fail | | | | | |
| AzureLinux3.0-64 | fail | | | | | | |
| UB2604-32 | pass | | | | | | |
| RHEL10.1-64 | fail | | | | | | |
| UB2604-64 | fail | fail | | | | fail | fail |
| RHEL10-64RT | fail | | | | | | |
| UB2510-64 | fail | | | | | | |
| Fedora43-64 | fail | fail | | | | | |
| OpenEuler2404-64 | fail | | | | | | |
+-------------------+------------+--------------+------------+------------+-----------+----------+------------+
Comments:
Because of DPDK bug (https://bugs.dpdk.org/show_bug.cgi?id=928),
All the dpdk-next-* branch add `Ddisable_drivers=event/cnxk` option when build with ICC complier.
Test environment and configuration as below:
OS: OpenAnolis8.10-64
Kernel Version: 5.10.134-18.an8.x86_64
GCC Version: gcc (GCC) 8.5.0 20210514 (Anolis 8.5.0-24.0.1)
Clang Version: 18.1.8 (Red Hat 18.1.8-1.0.1.module+an8.9.0+11287+9d0292d3)
x86_64-native-linuxapp-gcc
OS: FreeBSD15-64
Kernel Version: 15.0-RELEASE
GCC Version: gcc (FreeBSD Ports Collection) 14.2.0
Clang Version: 19.1.7 (https://github.com/llvm/llvm-project.git llvmorg-19.1.7-0-gcd708029e0b2)
x86_64-native-bsdapp-gcc
x86_64-native-bsdapp-clang
x86_64-native-bsdapp-gcc+shared
x86_64-native-bsdapp-gcc+debug
OS: RHEL96-64
Kernel Version: 5.14.0-570.12.1.el9_6.x86_64
GCC Version: gcc (GCC) 11.5.0 20240719 (Red Hat 11.5.0-5)
Clang Version: 19.1.7 (Red Hat, Inc. 19.1.7-2.el9)
x86_64-native-linuxapp-gcc
x86_64-native-linuxapp-clang
x86_64-native-linuxapp-gcc+shared
x86_64-native-linuxapp-gcc+debug
OS: SUSE16-64
Kernel Version: 6.12.0-160000.26-default
GCC Version: gcc (SUSE Linux) 15.2.0
Clang Version: 19.1.7
x86_64-native-linuxapp-clang
x86_64-native-linuxapp-gcc
OS: AzureLinux3.0-64
Kernel Version: 6.6.47.1-1.azl3
GCC Version: gcc (GCC) 13.2.0
Clang Version: 18.1.2
x86_64-native-linuxapp-gcc
OS: UB2604-32
Kernel Version: 7.0.0-14-generic
GCC Version: gcc (Ubuntu 15.2.0-16ubuntu1) 15.2.0
Clang Version: 21.1.8 (6ubuntu1)
i686-native-linuxapp-gcc
OS: RHEL10.1-64
Kernel Version: 6.12.0-124.8.1.el10_1.x86_64
GCC Version: gcc (GCC) 14.3.1 20250617 (Red Hat 14.3.1-2)
Clang Version: 20.1.8 (Red Hat, Inc. 20.1.8-1.el10)
x86_64-native-linuxapp-gcc
OS: UB2604-64
Kernel Version: 7.0.0-14-generic
GCC Version: gcc (Ubuntu 15.2.0-16ubuntu1) 15.2.0
Clang Version: 21.1.8 (6ubuntu1)
x86_64-native-linuxapp-gcc+16byte
x86_64-native-linuxapp-gcc
x86_64-native-linuxapp-clang
x86_64-native-linuxapp-doc
OS: RHEL10-64RT
Kernel Version: 6.12.0-55.9.1.el10_0.x86_64+rt
GCC Version: gcc (GCC) 14.2.1 20250110 (Red Hat 14.2.1-7)
Clang Version: 19.1.7 (Red Hat, Inc. 19.1.7-2.el10)
x86_64-native-linuxapp-gcc
OS: UB2510-64
Kernel Version: 6.17.0-5-generic
GCC Version: gcc (Ubuntu 15.2.0-4ubuntu4) 15.2.0
Clang Version: NA
x86_64-native-linuxapp-gcc
OS: Fedora43-64
Kernel Version: 6.17.1-300.fc43.x86_64
GCC Version: gcc (GCC) 15.2.1 20250924 (Red Hat 15.2.1-2)
Clang Version: 21.1.8 (Fedora 21.1.8-4.fc43)
x86_64-native-linuxapp-gcc
x86_64-native-linuxapp-clang
OS: OpenEuler2404-64
Kernel Version: 6.6.0-132.0.0.111.oe2403sp3.x86_64
GCC Version: gcc (GCC) 12.3.1 (openEuler 12.3.1-105.oe2403sp3)
Clang Version: 17.0.6 ( 17.0.6-63.oe2403sp3)
x86_64-native-linuxapp-gcc
*Build Failed #1:
OS: OpenAnolis8.10-64
Target: x86_64-native-linuxapp-gcc
FAILED: drivers/rte_common_cnxk.sym_chk
/usr/local/bin/meson --internal exe --capture drivers/rte_common_cnxk.sym_chk -- /root/OpenAnolis8.10-64_K5.10.134_GCC8.5.0/x86_64-native-linuxapp-gcc/39244/dpdk/buildtools/check-symbols.sh /root/OpenAnolis8.10-64_K5.10.134_GCC8.5.0/x86_64-native-linuxapp-gcc/39244/dpdk/x86_64-native-linuxapp-gcc/drivers/common_cnxk_exports.map drivers/librte_common_cnxk.a
--- stderr ---
roc_npa_pool_range_int_enable is flagged as internal but is not exported as an internal symbol
Please add RTE_EXPORT_INTERNAL_SYMBOL to the definition of roc_npa_pool_range_int_enable
[1080/3759] Generating drivers/rte_mempool_octeontx.pmd.c with a custom command
[1081/3759] Compiling C object drivers/libtmp_rte_mempool_bucket.a.p/mempool_bucket_rte_mempool_bucket.c.o
[1082/3759] Generating drivers/rte_mempool_dpaa2.pmd.c with a custom command
[1083/3759] Compiling C object drivers/libtmp_rte_mempool_stack.a.p/mempool_stack_rte_mempool_stack.c.o
[1084/3759] Generating drivers/rte_mempool_cnxk.sym_chk with a custom command (wrapped by meson to capture output)
[1085/3759] Compiling C object drivers/libtmp_rte_mempool_ring.a.p/mempool_ring_rte_mempool_ring.c.o
[1086/3759] Generating drivers/rte_mempool_dpaa.sym_chk with a custom command (wrapped by meson to capture output)
[1087/3759] Compiling C object drivers/libtmp_rte_dma_cnxk.a.p/dma_cnxk_cnxk_dmadev.c.o
[1088/3759] Generating drivers/rte_common_sfc_efx.sym_chk with a custom command (wrapped by meson to capture output)
ninja: build stopped
*Build Failed #2:
OS: RHEL96-64
Target: x86_64-native-linuxapp-gcc
FAILED: drivers/rte_common_cnxk.sym_chk
/usr/local/bin/meson --internal exe --capture drivers/rte_common_cnxk.sym_chk -- /root/RHEL96-64_K5.14.0_GCC11.5.0/x86_64-native-linuxapp-gcc/39244/dpdk/buildtools/check-symbols.sh /root/RHEL96-64_K5.14.0_GCC11.5.0/x86_64-native-linuxapp-gcc/39244/dpdk/x86_64-native-linuxapp-gcc/drivers/common_cnxk_exports.map drivers/librte_common_cnxk.a
--- stderr ---
roc_npa_pool_range_int_enable is flagged as internal but is not exported as an internal symbol
Please add RTE_EXPORT_INTERNAL_SYMBOL to the definition of roc_npa_pool_range_int_enable
[1086/3700] Compiling C object drivers/librte_mempool_octeontx.so.27.0.p/meson-generated_.._rte_mempool_octeontx.pmd.c.o
[1087/3700] Generating drivers/rte_mempool_cnxk.sym_chk with a custom command (wrapped by meson to capture output)
[1088/3700] Compiling C object drivers/libtmp_rte_mempool_stack.a.p/mempool_stack_rte_mempool_stack.c.o
[1089/3700] Generating drivers/rte_mempool_dpaa.sym_chk with a custom command (wrapped by meson to capture output)
[1090/3700] Compiling C object drivers/libtmp_rte_mempool_bucket.a.p/mempool_bucket_rte_mempool_bucket.c.o
[1091/3700] Generating drivers/rte_mempool_dpaa2.sym_chk with a custom command (wrapped by meson to capture output)
[1092/3700] Compiling C object drivers/libtmp_rte_mempool_ring.a.p/mempool_ring_rte_mempool_ring.c.o
[1093/3700] Compiling C object drivers/libtmp_rte_dma_cnxk.a.p/dma_cnxk_cnxk_dmadev.c.o
[1094/3700] Generating drivers/rte_common_sfc_efx.sym_chk with a custom command (wrapped by meson to capture output)
ninja: build stopped
*Build Failed #3:
OS: RHEL96-64
Target: x86_64-native-linuxapp-clang
FAILED: drivers/rte_common_cnxk.sym_chk
/usr/local/bin/meson --internal exe --capture drivers/rte_common_cnxk.sym_chk -- /root/RHEL96-64_K5.14.0_Clang19.1.7/x86_64-native-linuxapp-clang/39244/dpdk/buildtools/check-symbols.sh /root/RHEL96-64_K5.14.0_Clang19.1.7/x86_64-native-linuxapp-clang/39244/dpdk/x86_64-native-linuxapp-clang/drivers/common_cnxk_exports.map drivers/librte_common_cnxk.a
--- stderr ---
roc_npa_pool_range_int_enable is flagged as internal but is not exported as an internal symbol
Please add RTE_EXPORT_INTERNAL_SYMBOL to the definition of roc_npa_pool_range_int_enable
[996/3659] Compiling C object drivers/librte_common_qat_base_lib.a.p/common_sfc_efx_base_medford2_nic.c.o
[997/3659] Compiling C object drivers/librte_common_qat_base_lib.a.p/common_sfc_efx_base_medford4_phy.c.o
[998/3659] Compiling C object drivers/librte_common_qat_base_lib.a.p/common_sfc_efx_base_medford4_mac.c.o
[999/3659] Compiling C object drivers/librte_common_qat_base_lib.a.p/common_sfc_efx_base_rhead_ev.c.o
[1000/3659] Compiling C object drivers/librte_common_qat_base_lib.a.p/common_sfc_efx_base_rhead_nic.c.o
[1001/3659] Compiling C object drivers/librte_common_qat_base_lib.a.p/common_sfc_efx_base_rhead_intr.c.o
[1002/3659] Compiling C object drivers/librte_common_qat_base_lib.a.p/common_sfc_efx_base_rhead_pci.c.o
[1003/3659] Compiling C object drivers/librte_common_qat_base_lib.a.p/common_sfc_efx_base_rhead_rx.c.o
[1004/3659] Compiling C object drivers/librte_common_qat_base_lib.a.p/common_sfc_efx_base_rhead_tunnel.c.o
ninja: build stopped
*Build Failed #4:
OS: RHEL96-64
Target: x86_64-native-linuxapp-gcc+shared
FAILED: drivers/rte_common_cnxk.sym_chk
/usr/local/bin/meson --internal exe --capture drivers/rte_common_cnxk.sym_chk -- /root/RHEL96-64_K5.14.0_GCC11.5.0/x86_64-native-linuxapp-gcc+shared/39244/dpdk/buildtools/check-symbols.sh /root/RHEL96-64_K5.14.0_GCC11.5.0/x86_64-native-linuxapp-gcc+shared/39244/dpdk/x86_64-native-linuxapp-gcc+shared/drivers/common_cnxk_exports.map drivers/librte_common_cnxk.a
--- stderr ---
roc_npa_pool_range_int_enable is flagged as internal but is not exported as an internal symbol
Please add RTE_EXPORT_INTERNAL_SYMBOL to the definition of roc_npa_pool_range_int_enable
[1108/3539] Generating drivers/rte_mempool_dpaa2.sym_chk with a custom command (wrapped by meson to capture output)
[1109/3539] Compiling C object drivers/librte_mempool_stack.a.p/meson-generated_.._rte_mempool_stack.pmd.c.o
[1110/3539] Compiling C object drivers/librte_mempool_bucket.so.27.0.p/meson-generated_.._rte_mempool_bucket.pmd.c.o
[1111/3539] Compiling C object drivers/librte_mempool_bucket.a.p/meson-generated_.._rte_mempool_bucket.pmd.c.o
[1112/3539] Compiling C object drivers/libtmp_rte_dma_cnxk.a.p/dma_cnxk_cnxk_dmadev.c.o
[1113/3539] Generating drivers/rte_mempool_octeontx.sym_chk with a custom command (wrapped by meson to capture output)
[1114/3539] Generating symbol file drivers/librte_mempool_dpaa.so.27.0.p/librte_mempool_dpaa.so.27.0.symbols
[1115/3539] Generating drivers/rte_common_sfc_efx.sym_chk with a custom command (wrapped by meson to capture output)
[1116/3539] Compiling C object drivers/libtmp_rte_dma_cnxk.a.p/dma_cnxk_cnxk_dmadev_fp.c.o
ninja: build stopped
*Build Failed #5:
OS: RHEL96-64
Target: x86_64-native-linuxapp-gcc+debug
FAILED: drivers/rte_common_cnxk.sym_chk
/usr/local/bin/meson --internal exe --capture drivers/rte_common_cnxk.sym_chk -- /root/RHEL96-64_K5.14.0_GCC11.5.0/x86_64-native-linuxapp-gcc+debug/39244/dpdk/buildtools/check-symbols.sh /root/RHEL96-64_K5.14.0_GCC11.5.0/x86_64-native-linuxapp-gcc+debug/39244/dpdk/x86_64-native-linuxapp-gcc+debug/drivers/common_cnxk_exports.map drivers/librte_common_cnxk.a
--- stderr ---
roc_npa_pool_range_int_enable is flagged as internal but is not exported as an internal symbol
Please add RTE_EXPORT_INTERNAL_SYMBOL to the definition of roc_npa_pool_range_int_enable
[1060/3700] Compiling C object drivers/libtmp_rte_mempool_cnxk.a.p/mempool_cnxk_cn20k_mempool_ops.c.o
[1061/3700] Compiling C object drivers/libtmp_rte_mempool_dpaa.a.p/mempool_dpaa_dpaa_mempool.c.o
[1062/3700] Compiling C object drivers/libtmp_rte_mempool_octeontx.a.p/mempool_octeontx_octeontx_fpavf.c.o
[1063/3700] Compiling C object drivers/libtmp_rte_mempool_octeontx.a.p/mempool_octeontx_rte_mempool_octeontx.c.o
[1064/3700] Compiling C object drivers/libtmp_rte_mempool_dpaa2.a.p/mempool_dpaa2_dpaa2_hw_mempool.c.o
[1065/3700] Compiling C object drivers/libtmp_rte_mempool_bucket.a.p/mempool_bucket_rte_mempool_bucket.c.o
[1066/3700] Compiling C object drivers/libtmp_rte_mempool_stack.a.p/mempool_stack_rte_mempool_stack.c.o
[1067/3700] Compiling C object drivers/libtmp_rte_mempool_ring.a.p/mempool_ring_rte_mempool_ring.c.o
[1068/3700] Generating drivers/rte_common_sfc_efx.sym_chk with a custom command (wrapped by meson to capture output)
ninja: build stopped
*Build Failed #6:
OS: SUSE16-64
Target: x86_64-native-linuxapp-clang
FAILED: drivers/rte_common_cnxk.sym_chk
/usr/local/bin/meson --internal exe --capture drivers/rte_common_cnxk.sym_chk -- /root/SUSE16-64_K6.12.0_Clang19.1.7/x86_64-native-linuxapp-clang/39244/dpdk/buildtools/check-symbols.sh /root/SUSE16-64_K6.12.0_Clang19.1.7/x86_64-native-linuxapp-clang/39244/dpdk/x86_64-native-linuxapp-clang/drivers/common_cnxk_exports.map drivers/librte_common_cnxk.a
--- stderr ---
roc_npa_pool_range_int_enable is flagged as internal but is not exported as an internal symbol
Please add RTE_EXPORT_INTERNAL_SYMBOL to the definition of roc_npa_pool_range_int_enable
[1004/3682] Compiling C object drivers/librte_common_qat_base_lib.a.p/common_sfc_efx_base_rhead_tx.c.o
[1005/3682] Compiling C object drivers/librte_common_qat_base_lib.a.p/common_sfc_efx_base_rhead_tunnel.c.o
[1006/3682] Compiling C object drivers/librte_common_qat_base_lib.a.p/common_sfc_efx_base_rhead_virtio.c.o
[1007/3682] Compiling C object drivers/libtmp_rte_common_sfc_efx.a.p/common_sfc_efx_sfc_efx_mcdi.c.o
[1008/3682] Compiling C object drivers/libtmp_rte_common_sfc_efx.a.p/common_sfc_efx_sfc_efx.c.o
[1009/3682] Compiling C object drivers/libtmp_rte_common_sxe2.a.p/common_sxe2_sxe2_ioctl_chnl.c.o
[1010/3682] Compiling C object drivers/librte_net_nfp_avx2_lib.a.p/net_nfp_nfp_rxtx_vec_avx2.c.o
[1011/3682] Compiling C object drivers/librte_net_nfp_avx2_lib.a.p/net_nfp_nfdk_nfp_nfdk_vec_avx2_dp.c.o
[1012/3682] Compiling C object drivers/libtmp_rte_net_nfp.a.p/net_nfp_flower_nfp_conntrack.c.o
ninja: build stopped
*Build Failed #7:
OS: SUSE16-64
Target: x86_64-native-linuxapp-gcc
FAILED: drivers/rte_common_cnxk.sym_chk
/usr/local/bin/meson --internal exe --capture drivers/rte_common_cnxk.sym_chk -- /root/SUSE16-64_K6.12.0_GCC15.2.0/x86_64-native-linuxapp-gcc/39244/dpdk/buildtools/check-symbols.sh /root/SUSE16-64_K6.12.0_GCC15.2.0/x86_64-native-linuxapp-gcc/39244/dpdk/x86_64-native-linuxapp-gcc/drivers/common_cnxk_exports.map drivers/librte_common_cnxk.a
--- stderr ---
roc_npa_pool_range_int_enable is flagged as internal but is not exported as an internal symbol
Please add RTE_EXPORT_INTERNAL_SYMBOL to the definition of roc_npa_pool_range_int_enable
[975/3682] Generating drivers/rte_common_qat.sym_chk with a custom command (wrapped by meson to capture output)
[976/3682] Compiling C object drivers/librte_common_qat_base_lib.a.p/common_sfc_efx_base_siena_vpd.c.o
[977/3682] Compiling C object drivers/librte_common_qat_base_lib.a.p/common_sfc_efx_base_ef10_ev.c.o
[978/3682] Compiling C object drivers/librte_common_qat_base_lib.a.p/common_sfc_efx_base_ef10_evb.c.o
[979/3682] Compiling C object drivers/librte_common_qat_base_lib.a.p/common_sfc_efx_base_ef10_image.c.o
[980/3682] Compiling C object drivers/librte_common_qat_base_lib.a.p/common_sfc_efx_base_ef10_intr.c.o
[981/3682] Compiling C object drivers/libtmp_rte_net_ionic.a.p/net_ionic_ionic_dev_vdev.c.o
[982/3682] Compiling C object drivers/librte_common_qat_base_lib.a.p/common_sfc_efx_base_ef10_mac.c.o
[983/3682] Compiling C object drivers/librte_common_qat_base_lib.a.p/common_sfc_efx_base_ef10_filter.c.o
ninja: build stopped
*Build Failed #8:
OS: AzureLinux3.0-64
Target: x86_64-native-linuxapp-gcc
FAILED: drivers/rte_common_cnxk.sym_chk
/usr/bin/meson --internal exe --capture drivers/rte_common_cnxk.sym_chk -- /root/AzureLinux3.0-64_6.6.47_GCC13.2.0/x86_64-native-linuxapp-gcc/39244/dpdk/buildtools/check-symbols.sh /root/AzureLinux3.0-64_6.6.47_GCC13.2.0/x86_64-native-linuxapp-gcc/39244/dpdk/x86_64-native-linuxapp-gcc/drivers/common_cnxk_exports.map drivers/librte_common_cnxk.a
--- stderr ---
roc_npa_pool_range_int_enable is flagged as internal but is not exported as an internal symbol
Please add RTE_EXPORT_INTERNAL_SYMBOL to the definition of roc_npa_pool_range_int_enable
[987/3765] Compiling C object drivers/librte_common_qat_base_lib.a.p/common_sfc_efx_base_ef10_proxy.c.o
[988/3765] Compiling C object drivers/librte_common_qat_base_lib.a.p/common_sfc_efx_base_ef10_phy.c.o
[989/3765] Compiling C object drivers/libtmp_rte_net_ixgbe.a.p/net_intel_ixgbe_base_ixgbe_x550.c.o
[990/3765] Compiling C object drivers/librte_common_qat_base_lib.a.p/common_sfc_efx_base_ef10_vpd.c.o
[991/3765] Compiling C object drivers/libtmp_rte_net_cpfl.a.p/net_intel_cpfl_cpfl_rxtx.c.o
[992/3765] Compiling C object drivers/librte_common_qat_base_lib.a.p/common_sfc_efx_base_hunt_nic.c.o
[993/3765] Compiling C object drivers/librte_common_qat_base_lib.a.p/common_sfc_efx_base_ef10_rx.c.o
[994/3765] Compiling C object drivers/librte_common_qat_base_lib.a.p/common_sfc_efx_base_ef10_tx.c.o
[995/3765] Compiling C object drivers/libtmp_rte_net_cpfl.a.p/net_intel_cpfl_cpfl_ethdev.c.o
ninja: build stopped
*Build Failed #9:
OS: RHEL10.1-64
Target: x86_64-native-linuxapp-gcc
FAILED: drivers/rte_common_cnxk.sym_chk
/usr/local/bin/meson --internal exe --capture drivers/rte_common_cnxk.sym_chk -- /root/RHEL10.1-64_K6.12.0_GCC14.3.1/x86_64-native-linuxapp-gcc/39244/dpdk/buildtools/check-symbols.sh /root/RHEL10.1-64_K6.12.0_GCC14.3.1/x86_64-native-linuxapp-gcc/39244/dpdk/x86_64-native-linuxapp-gcc/drivers/common_cnxk_exports.map drivers/librte_common_cnxk.a
--- stderr ---
roc_npa_pool_range_int_enable is flagged as internal but is not exported as an internal symbol
Please add RTE_EXPORT_INTERNAL_SYMBOL to the definition of roc_npa_pool_range_int_enable
[1031/3700] Compiling C object drivers/libtmp_rte_common_zsda.a.p/common_zsda_zsda_qp_common.c.o
[1032/3700] Compiling C object drivers/libtmp_rte_common_zsda.a.p/crypto_zsda_zsda_crypto.c.o
[1033/3700] Compiling C object drivers/libtmp_rte_net_nfp.a.p/net_nfp_flower_nfp_conntrack.c.o
[1034/3700] Compiling C object drivers/libtmp_rte_common_zsda.a.p/crypto_zsda_zsda_crypto_pmd.c.o
[1035/3700] Compiling C object drivers/libtmp_rte_common_zsda.a.p/compress_zsda_zsda_comp_pmd.c.o
[1036/3700] Generating drivers/rte_common_sxe2.sym_chk with a custom command (wrapped by meson to capture output)
[1037/3700] Compiling C object drivers/libtmp_rte_common_zsda.a.p/crypto_zsda_zsda_crypto_session.c.o
[1038/3700] Compiling C object drivers/libtmp_rte_mempool_bucket.a.p/mempool_bucket_rte_mempool_bucket.c.o
[1039/3700] Generating drivers/rte_common_sfc_efx.sym_chk with a custom command (wrapped by meson to capture output)
ninja: build stopped
*Build Failed #10:
OS: UB2604-64
Target: x86_64-native-linuxapp-gcc+16byte
FAILED: drivers/rte_common_cnxk.sym_chk
/usr/local/bin/meson --internal exe --capture drivers/rte_common_cnxk.sym_chk -- /root/UB2604-64_K7.0.0_GCC15.2.0/x86_64-native-linuxapp-gcc+16byte/39244/dpdk/buildtools/check-symbols.sh /root/UB2604-64_K7.0.0_GCC15.2.0/x86_64-native-linuxapp-gcc+16byte/39244/dpdk/x86_64-native-linuxapp-gcc+16byte/drivers/common_cnxk_exports.map drivers/librte_common_cnxk.a
--- stderr ---
roc_npa_pool_range_int_enable is flagged as internal but is not exported as an internal symbol
Please add RTE_EXPORT_INTERNAL_SYMBOL to the definition of roc_npa_pool_range_int_enable
[978/3941] Compiling C object drivers/libtmp_rte_net_ixgbe.a.p/net_intel_ixgbe_ixgbe_pf.c.o
[979/3941] Compiling C object drivers/libtmp_rte_net_ixgbe.a.p/net_intel_ixgbe_ixgbe_vf_representor.c.o
[980/3941] Compiling C object drivers/libtmp_rte_net_ixgbe.a.p/net_intel_ixgbe_ixgbe_ipsec.c.o
[981/3941] Compiling C object drivers/libtmp_rte_net_ixgbe.a.p/net_intel_ixgbe_ixgbe_tm.c.o
[982/3941] Compiling C object drivers/libtmp_rte_common_qat.a.p/crypto_qat_asym_qat_asym.c.o
[983/3941] Compiling C object drivers/libtmp_rte_net_ixgbe.a.p/net_intel_ixgbe_rte_pmd_ixgbe.c.o
[984/3941] Compiling C object drivers/libtmp_rte_net_ixgbe.a.p/net_intel_ixgbe_ixgbe_rxtx_vec_common.c.o
[985/3941] Compiling C object drivers/libtmp_rte_net_ixgbe.a.p/net_intel_ixgbe_ixgbe_rxtx_vec_sse.c.o
[986/3941] Compiling C object drivers/libtmp_rte_net_ixgbe.a.p/net_intel_ixgbe_ixgbe_rxtx.c.o
ninja: build stopped
*Build Failed #11:
OS: UB2604-64
Target: x86_64-native-linuxapp-gcc
FAILED: drivers/rte_common_cnxk.sym_chk
/usr/local/bin/meson --internal exe --capture drivers/rte_common_cnxk.sym_chk -- /root/UB2604-64_K7.0.0_GCC15.2.0/x86_64-native-linuxapp-gcc/39244/dpdk/buildtools/check-symbols.sh /root/UB2604-64_K7.0.0_GCC15.2.0/x86_64-native-linuxapp-gcc/39244/dpdk/x86_64-native-linuxapp-gcc/drivers/common_cnxk_exports.map drivers/librte_common_cnxk.a
--- stderr ---
roc_npa_pool_range_int_enable is flagged as internal but is not exported as an internal symbol
Please add RTE_EXPORT_INTERNAL_SYMBOL to the definition of roc_npa_pool_range_int_enable
[979/3941] Compiling C object drivers/libtmp_rte_net_ixgbe.a.p/net_intel_ixgbe_ixgbe_ipsec.c.o
[980/3941] Compiling C object drivers/libtmp_rte_net_ixgbe.a.p/net_intel_ixgbe_ixgbe_pf.c.o
[981/3941] Compiling C object drivers/libtmp_rte_net_ixgbe.a.p/net_intel_ixgbe_ixgbe_vf_representor.c.o
[982/3941] Compiling C object drivers/libtmp_rte_net_ixgbe.a.p/net_intel_ixgbe_ixgbe_tm.c.o
[983/3941] Compiling C object drivers/libtmp_rte_common_qat.a.p/crypto_qat_asym_qat_asym.c.o
[984/3941] Compiling C object drivers/libtmp_rte_net_ixgbe.a.p/net_intel_ixgbe_rte_pmd_ixgbe.c.o
[985/3941] Compiling C object drivers/libtmp_rte_net_ixgbe.a.p/net_intel_ixgbe_ixgbe_rxtx_vec_common.c.o
[986/3941] Compiling C object drivers/libtmp_rte_net_ixgbe.a.p/net_intel_ixgbe_ixgbe_rxtx_vec_sse.c.o
[987/3941] Compiling C object drivers/libtmp_rte_net_ixgbe.a.p/net_intel_ixgbe_ixgbe_rxtx.c.o
ninja: build stopped
*Build Failed #12:
OS: UB2604-64
Target: x86_64-native-linuxapp-clang
FAILED: drivers/rte_common_cnxk.sym_chk
/usr/local/bin/meson --internal exe --capture drivers/rte_common_cnxk.sym_chk -- /root/UB2604-64_K7.0.0_Clang21.1.8/x86_64-native-linuxapp-clang/39244/dpdk/buildtools/check-symbols.sh /root/UB2604-64_K7.0.0_Clang21.1.8/x86_64-native-linuxapp-clang/39244/dpdk/x86_64-native-linuxapp-clang/drivers/common_cnxk_exports.map drivers/librte_common_cnxk.a
--- stderr ---
roc_npa_pool_range_int_enable is flagged as internal but is not exported as an internal symbol
Please add RTE_EXPORT_INTERNAL_SYMBOL to the definition of roc_npa_pool_range_int_enable
[1004/3942] Compiling C object drivers/librte_common_qat_base_lib.a.p/common_sfc_efx_base_siena_vpd.c.o
[1005/3942] Compiling C object drivers/librte_common_qat_base_lib.a.p/common_sfc_efx_base_ef10_ev.c.o
[1006/3942] Compiling C object drivers/libtmp_rte_net_ixgbe.a.p/net_intel_ixgbe_ixgbe_rxtx.c.o
[1007/3942] Compiling C object drivers/librte_common_qat_base_lib.a.p/common_sfc_efx_base_ef10_image.c.o
[1008/3942] Compiling C object drivers/librte_common_qat_base_lib.a.p/common_sfc_efx_base_ef10_intr.c.o
[1009/3942] Compiling C object drivers/librte_common_qat_base_lib.a.p/common_sfc_efx_base_ef10_evb.c.o
[1010/3942] Compiling C object drivers/librte_common_qat_base_lib.a.p/common_sfc_efx_base_ef10_mcdi.c.o
[1011/3942] Compiling C object drivers/librte_common_qat_base_lib.a.p/common_sfc_efx_base_ef10_mac.c.o
[1012/3942] Compiling C object drivers/librte_common_qat_base_lib.a.p/common_sfc_efx_base_ef10_filter.c.o
ninja: build stopped
*Build Failed #13:
OS: UB2604-64
Target: x86_64-native-linuxapp-doc
FAILED: drivers/rte_common_cnxk.sym_chk
/usr/local/bin/meson --internal exe --capture drivers/rte_common_cnxk.sym_chk -- /root/UB2604-64_K7.0.0_GCC15.2.0/x86_64-native-linuxapp-doc/39244/dpdk/buildtools/check-symbols.sh /root/UB2604-64_K7.0.0_GCC15.2.0/x86_64-native-linuxapp-doc/39244/dpdk/x86_64-native-linuxapp-doc/drivers/common_cnxk_exports.map drivers/librte_common_cnxk.a
--- stderr ---
roc_npa_pool_range_int_enable is flagged as internal but is not exported as an internal symbol
Please add RTE_EXPORT_INTERNAL_SYMBOL to the definition of roc_npa_pool_range_int_enable
[998/3750] Compiling C object drivers/librte_common_qat_base_lib.a.p/common_sfc_efx_base_siena_nic.c.o
[999/3750] Compiling C object drivers/librte_common_qat_base_lib.a.p/common_sfc_efx_base_siena_mac.c.o
[1000/3750] Compiling C object drivers/librte_common_qat_base_lib.a.p/common_sfc_efx_base_siena_nvram.c.o
[1001/3750] Compiling C object drivers/librte_common_qat_base_lib.a.p/common_sfc_efx_base_siena_mcdi.c.o
[1002/3750] Compiling C object drivers/libtmp_rte_net_ixgbe.a.p/net_intel_ixgbe_ixgbe_rxtx_vec_sse.c.o
[1003/3750] Compiling C object drivers/librte_common_qat_base_lib.a.p/common_sfc_efx_base_siena_sram.c.o
[1004/3750] Compiling C object drivers/librte_common_qat_base_lib.a.p/common_sfc_efx_base_siena_phy.c.o
[1005/3750] Compiling C object drivers/librte_common_qat_base_lib.a.p/common_sfc_efx_base_siena_vpd.c.o
[1006/3750] Compiling C object drivers/libtmp_rte_net_ixgbe.a.p/net_intel_ixgbe_ixgbe_rxtx.c.o
ninja: build stopped
*Build Failed #14:
OS: RHEL10-64RT
Target: x86_64-native-linuxapp-gcc
FAILED: drivers/rte_common_cnxk.sym_chk
/usr/local/bin/meson --internal exe --capture drivers/rte_common_cnxk.sym_chk -- /root/RHEL10-64RT_K6.12.0_GCC14.2.1/x86_64-native-linuxapp-gcc/39244/dpdk/buildtools/check-symbols.sh /root/RHEL10-64RT_K6.12.0_GCC14.2.1/x86_64-native-linuxapp-gcc/39244/dpdk/x86_64-native-linuxapp-gcc/drivers/common_cnxk_exports.map drivers/librte_common_cnxk.a
--- stderr ---
roc_npa_pool_range_int_enable is flagged as internal but is not exported as an internal symbol
Please add RTE_EXPORT_INTERNAL_SYMBOL to the definition of roc_npa_pool_range_int_enable
[1048/3700] Generating drivers/rte_mempool_cnxk_map with a custom command
[1049/3700] Compiling C object drivers/libtmp_rte_mempool_cnxk.a.p/mempool_cnxk_cn9k_mempool_ops.c.o
[1050/3700] Generating symbol file drivers/librte_common_sxe2.so.27.0.p/librte_common_sxe2.so.27.0.symbols
[1051/3700] Compiling C object drivers/libtmp_rte_mempool_cnxk.a.p/mempool_cnxk_cn10k_mempool_ops.c.o
[1052/3700] Generating drivers/rte_common_zsda.sym_chk with a custom command (wrapped by meson to capture output)
[1053/3700] Compiling C object drivers/libtmp_rte_mempool_cnxk.a.p/mempool_cnxk_cn20k_mempool_ops.c.o
[1054/3700] Compiling C object drivers/libtmp_rte_mempool_cnxk.a.p/mempool_cnxk_cn10k_hwpool_ops.c.o
[1055/3700] Compiling C object drivers/libtmp_rte_mempool_bucket.a.p/mempool_bucket_rte_mempool_bucket.c.o
[1056/3700] Generating drivers/rte_common_sfc_efx.sym_chk with a custom command (wrapped by meson to capture output)
ninja: build stopped
*Build Failed #15:
OS: UB2510-64
Target: x86_64-native-linuxapp-gcc
FAILED: drivers/rte_common_cnxk.sym_chk
/usr/local/bin/meson --internal exe --capture drivers/rte_common_cnxk.sym_chk -- /root/UB2510-64_K6.14.0_GCC14.2.0/x86_64-native-linuxapp-gcc/39244/dpdk/buildtools/check-symbols.sh /root/UB2510-64_K6.14.0_GCC14.2.0/x86_64-native-linuxapp-gcc/39244/dpdk/x86_64-native-linuxapp-gcc/drivers/common_cnxk_exports.map drivers/librte_common_cnxk.a
--- stderr ---
roc_npa_pool_range_int_enable is flagged as internal but is not exported as an internal symbol
Please add RTE_EXPORT_INTERNAL_SYMBOL to the definition of roc_npa_pool_range_int_enable
[978/3937] Compiling C object drivers/librte_common_qat_base_lib.a.p/common_sfc_efx_base_efx_mcdi.c.o
[979/3937] Compiling C object drivers/librte_common_qat_base_lib.a.p/common_sfc_efx_base_efx_phy.c.o
[980/3937] Compiling C object drivers/libtmp_rte_common_qat.a.p/crypto_qat_asym_qat_asym.c.o
[981/3937] Compiling C object drivers/libtmp_rte_net_ixgbe.a.p/net_intel_ixgbe_ixgbe_tm.c.o
[982/3937] Compiling C object drivers/libtmp_rte_net_ixgbe.a.p/net_intel_ixgbe_ixgbe_ipsec.c.o
[983/3937] Compiling C object drivers/libtmp_rte_net_ixgbe.a.p/net_intel_ixgbe_ixgbe_vf_representor.c.o
[984/3937] Compiling C object drivers/libtmp_rte_net_ixgbe.a.p/net_intel_ixgbe_ixgbe_pf.c.o
[985/3937] Compiling C object drivers/libtmp_rte_net_ixgbe.a.p/net_intel_ixgbe_ixgbe_flow.c.o
[986/3937] Compiling C object drivers/libtmp_rte_net_ixgbe.a.p/net_intel_ixgbe_ixgbe_rxtx.c.o
ninja: build stopped
*Build Failed #16:
OS: Fedora43-64
Target: x86_64-native-linuxapp-gcc
FAILED: drivers/rte_common_cnxk.sym_chk
/usr/local/bin/meson --internal exe --capture drivers/rte_common_cnxk.sym_chk -- /root/Fedora43-64_K6.17.1_GCC15.2.1/x86_64-native-linuxapp-gcc/39244/dpdk/buildtools/check-symbols.sh /root/Fedora43-64_K6.17.1_GCC15.2.1/x86_64-native-linuxapp-gcc/39244/dpdk/x86_64-native-linuxapp-gcc/drivers/common_cnxk_exports.map drivers/librte_common_cnxk.a
--- stderr ---
roc_npa_pool_range_int_enable is flagged as internal but is not exported as an internal symbol
Please add RTE_EXPORT_INTERNAL_SYMBOL to the definition of roc_npa_pool_range_int_enable
[1007/3681] Linking static target drivers/librte_common_sfc_efx.a
[1008/3681] Compiling C object drivers/libtmp_rte_common_sxe2.a.p/common_sxe2_sxe2_common.c.o
[1009/3681] Compiling C object drivers/libtmp_rte_net_nfp.a.p/net_nfp_nfd3_nfp_nfd3_dp.c.o
[1010/3681] Compiling C object drivers/libtmp_rte_net_nfp.a.p/net_nfp_flower_nfp_flower.c.o
[1011/3681] Compiling C object drivers/libtmp_rte_net_nfp.a.p/net_nfp_flower_nfp_flower_service.c.o
[1012/3681] Compiling C object drivers/libtmp_rte_net_nfp.a.p/net_nfp_flower_nfp_flower_ctrl.c.o
[1013/3681] Compiling C object drivers/libtmp_rte_net_nfp.a.p/net_nfp_flower_nfp_flower_cmsg.c.o
[1014/3681] Compiling C object drivers/libtmp_rte_net_nfp.a.p/net_nfp_flower_nfp_flower_representor.c.o
[1015/3681] Compiling C object drivers/libtmp_rte_net_nfp.a.p/net_nfp_flower_nfp_flower_flow.c.o
ninja: build stopped
*Build Failed #17:
OS: Fedora43-64
Target: x86_64-native-linuxapp-clang
FAILED: drivers/rte_common_cnxk.sym_chk
/usr/local/bin/meson --internal exe --capture drivers/rte_common_cnxk.sym_chk -- /root/Fedora43-64_K6.17.1_Clang21.1.8/x86_64-native-linuxapp-clang/39244/dpdk/buildtools/check-symbols.sh /root/Fedora43-64_K6.17.1_Clang21.1.8/x86_64-native-linuxapp-clang/39244/dpdk/x86_64-native-linuxapp-clang/drivers/common_cnxk_exports.map drivers/librte_common_cnxk.a
--- stderr ---
roc_npa_pool_range_int_enable is flagged as internal but is not exported as an internal symbol
Please add RTE_EXPORT_INTERNAL_SYMBOL to the definition of roc_npa_pool_range_int_enable
[1136/3681] Compiling C object drivers/librte_dma_hisi_pciep.so.27.0.p/meson-generated_.._rte_dma_hisi_pciep.pmd.c.o
[1137/3681] Generating drivers/rte_common_sfc_efx.sym_chk with a custom command (wrapped by meson to capture output)
[1138/3681] Generating drivers/rte_dma_cnxk.pmd.c with a custom command
[1139/3681] Generating drivers/rte_dma_hisi_acc.sym_chk with a custom command (wrapped by meson to capture output)
[1140/3681] Generating drivers/rte_dma_idxd.pmd.c with a custom command
[1141/3681] Compiling C object drivers/libtmp_rte_dma_ioat.a.p/dma_ioat_ioat_dmadev.c.o
[1142/3681] Generating drivers/rte_dma_dpaa2.pmd.c with a custom command
[1143/3681] Compiling C object drivers/libtmp_rte_dma_dpaa.a.p/dma_dpaa_dpaa_qdma.c.o
[1144/3681] Compiling C object drivers/libtmp_rte_dma_odm.a.p/dma_odm_odm_dmadev.c.o
ninja: build stopped
*Build Failed #18:
OS: OpenEuler2404-64
Target: x86_64-native-linuxapp-gcc
FAILED: drivers/rte_common_cnxk.sym_chk
/usr/local/bin/meson --internal exe --capture drivers/rte_common_cnxk.sym_chk -- /root/OpenEuler2404-64_K6.6.0_GCC12.3.1/x86_64-native-linuxapp-gcc/39244/dpdk/buildtools/check-symbols.sh /root/OpenEuler2404-64_K6.6.0_GCC12.3.1/x86_64-native-linuxapp-gcc/39244/dpdk/x86_64-native-linuxapp-gcc/drivers/common_cnxk_exports.map drivers/librte_common_cnxk.a
--- stderr ---
roc_npa_pool_range_int_enable is flagged as internal but is not exported as an internal symbol
Please add RTE_EXPORT_INTERNAL_SYMBOL to the definition of roc_npa_pool_range_int_enable
[979/3700] Compiling C object drivers/librte_common_qat_base_lib.a.p/common_sfc_efx_base_ef10_evb.c.o
[980/3700] Compiling C object drivers/librte_common_qat_base_lib.a.p/common_sfc_efx_base_ef10_image.c.o
[981/3700] Compiling C object drivers/libtmp_rte_net_ionic.a.p/net_ionic_ionic_dev_vdev.c.o
[982/3700] Compiling C object drivers/libtmp_rte_net_ionic.a.p/net_ionic_ionic_dev_pci.c.o
[983/3700] Compiling C object drivers/librte_common_qat_base_lib.a.p/common_sfc_efx_base_ef10_filter.c.o
[984/3700] Compiling C object drivers/libtmp_rte_net_ionic.a.p/net_ionic_ionic_mac_api.c.o
[985/3700] Compiling C object drivers/libtmp_rte_net_ionic.a.p/net_ionic_ionic_dev.c.o
[986/3700] Compiling C object drivers/libtmp_rte_net_ionic.a.p/net_ionic_ionic_ethdev.c.o
[987/3700] Compiling C object drivers/libtmp_rte_net_ionic.a.p/net_ionic_ionic_lif.c.o
ninja: build stopped
DPDK STV team
More information about the test-report
mailing list