|FAILURE| pw169449-169449 Description: Build error encountered

al-sw-devops at alabs.net al-sw-devops at alabs.net
Sun Sep 13 20:10:19 CEST 2026


Test-Name: DPDK Fast test suite
Test-Label: aws-unit-testing
Test-Status: FAILURE
_Unit Testing Build error encountered _
https://dpdk.org/patch/169449

Test Status Summary:

+--------------+------------------+
| Architecture | DPDK Unit Test   |
+--------------+------------------+
| x86_64       | FAILURE           |
+--------------+------------------+
| arm64        | FAILURE           |
+--------------+------------------+


Test environment (aarch64):
Description: Build error encountered
OS : Ubuntu 24.04.1 LTS
Kernel : 7.0.0-1011-aws
NIC : Elastic Network Adapter
GCC : 13.3.0-6ubuntu2~24.04

Test last 100 lines (aarch64)
[1637/3243] Compiling C object drivers/libtmp_rte_net_fm10k.a.p/net_intel_fm10k_base_fm10k_mbx.c.o
[1638/3243] Compiling C object drivers/libtmp_rte_net_e1000.a.p/net_intel_e1000_base_e1000_82575.c.o
[1639/3243] Compiling C object drivers/libtmp_rte_net_i40e.a.p/net_intel_i40e_base_i40e_hmc.c.o
[1640/3243] Generating drivers/rte_net_i40e_map with a custom command
[1641/3243] Generating drivers/rte_net_dpaa2.pmd.c with a custom command
[1642/3243] Compiling C object drivers/libtmp_rte_net_i40e.a.p/net_intel_i40e_base_i40e_adminq.c.o
[1643/3243] Compiling C object drivers/libtmp_rte_net_fm10k.a.p/net_intel_fm10k_base_fm10k_pf.c.o
[1644/3243] Compiling C object drivers/libtmp_rte_net_iavf.a.p/net_intel_iavf_iavf_base_symbols.c.o
[1645/3243] Compiling C object drivers/libtmp_rte_net_i40e.a.p/net_intel_i40e_base_i40e_dcb.c.o
[1646/3243] Compiling C object drivers/libtmp_rte_net_iavf.a.p/net_intel_iavf_base_iavf_impl.c.o
[1647/3243] Compiling C object drivers/librte_net_dpaa2.a.p/meson-generated_.._rte_net_dpaa2.pmd.c.o
[1648/3243] Compiling C object drivers/librte_net_dpaa2.so.27.0.p/meson-generated_.._rte_net_dpaa2.pmd.c.o
[1649/3243] Linking static target drivers/librte_net_dpaa2.a
[1650/3243] Compiling C object drivers/libtmp_rte_net_fm10k.a.p/net_intel_fm10k_fm10k_rxtx.c.o
[1651/3243] Compiling C object drivers/libtmp_rte_net_i40e.a.p/net_intel_i40e_i40e_vf_representor.c.o
[1652/3243] Compiling C object drivers/libtmp_rte_net_i40e.a.p/net_intel_i40e_i40e_recycle_mbufs_vec_common.c.o
[1653/3243] Compiling C object drivers/libtmp_rte_net_i40e.a.p/net_intel_i40e_i40e_tm.c.o
[1654/3243] Compiling C object drivers/libtmp_rte_net_i40e.a.p/net_intel_i40e_base_i40e_lan_hmc.c.o
[1655/3243] Compiling C object drivers/libtmp_rte_net_iavf.a.p/net_intel_iavf_base_iavf_common.c.o
[1656/3243] Compiling C object drivers/libtmp_rte_net_iavf.a.p/net_intel_iavf_base_iavf_adminq.c.o
[1657/3243] Compiling C object drivers/libtmp_rte_net_e1000.a.p/net_intel_e1000_base_e1000_phy.c.o
[1658/3243] Compiling C object drivers/libtmp_rte_net_e1000.a.p/net_intel_e1000_igb_rxtx.c.o
[1659/3243] Generating drivers/rte_net_iavf_map with a custom command
[1660/3243] Compiling C object drivers/libtmp_rte_net_e1000.a.p/net_intel_e1000_igc_txrx.c.o
[1661/3243] Compiling C object drivers/libtmp_rte_net_i40e.a.p/net_intel_i40e_base_i40e_nvm.c.o
[1662/3243] Compiling C object lib/librte_vhost.a.p/vhost_virtio_net.c.o
[1663/3243] Generating drivers/rte_net_dpaa2.sym_chk with a custom command (wrapped by meson to capture output)
[1664/3243] Linking static target lib/librte_vhost.a
[1665/3243] Linking target drivers/librte_net_dpaa2.so.27.0
[1666/3243] Compiling C object drivers/libtmp_rte_net_i40e.a.p/net_intel_i40e_i40e_pf.c.o
[1667/3243] Compiling C object drivers/libtmp_rte_net_i40e.a.p/net_intel_i40e_i40e_hash.c.o
[1668/3243] Compiling C object drivers/libtmp_rte_net_iavf.a.p/net_intel_iavf_iavf_tm.c.o
[1669/3243] Compiling C object drivers/libtmp_rte_net_iavf.a.p/net_intel_iavf_iavf_generic_flow.c.o
[1670/3243] Compiling C object drivers/libtmp_rte_net_e1000.a.p/net_intel_e1000_igb_ethdev.c.o
[1671/3243] Compiling C object drivers/libtmp_rte_net_hns3.a.p/net_hns3_hns3_ethdev.c.o
[1672/3243] Generating symbol file drivers/librte_net_dpaa2.so.27.0.p/librte_net_dpaa2.so.27.0.symbols
[1673/3243] Compiling C object drivers/libtmp_rte_net_e1000.a.p/net_intel_e1000_base_e1000_ich8lan.c.o
[1674/3243] Linking static target drivers/libtmp_rte_net_e1000.a
[1675/3243] Compiling C object drivers/libtmp_rte_net_iavf.a.p/net_intel_iavf_iavf_hash.c.o
[1676/3243] Compiling C object drivers/libtmp_rte_net_iavf.a.p/net_intel_iavf_iavf_fsub.c.o
[1677/3243] Compiling C object drivers/librte_net_iavf_base_lib.a.p/net_intel_ice_base_ice_controlq.c.o
[1678/3243] Compiling C object drivers/libtmp_rte_net_i40e.a.p/net_intel_i40e_i40e_fdir.c.o
[1679/3243] Compiling C object drivers/librte_net_iavf_base_lib.a.p/net_intel_ice_base_ice_acl.c.o
[1680/3243] Compiling C object drivers/libtmp_rte_net_i40e.a.p/net_intel_i40e_i40e_rxtx_vec_neon.c.o
[1681/3243] Compiling C object drivers/librte_net_iavf_base_lib.a.p/net_intel_ice_base_ice_vlan_mode.c.o
[1682/3243] Generating lib/vhost.sym_chk with a custom command (wrapped by meson to capture output)
[1683/3243] Compiling C object drivers/libtmp_rte_net_fm10k.a.p/net_intel_fm10k_fm10k_ethdev.c.o
[1684/3243] Compiling C object drivers/librte_net_iavf_base_lib.a.p/net_intel_ice_base_ice_metainit.c.o
[1685/3243] Linking static target drivers/libtmp_rte_net_fm10k.a
[1686/3243] Compiling C object drivers/librte_net_iavf_base_lib.a.p/net_intel_ice_base_ice_nvm.c.o
[1687/3243] Compiling C object drivers/librte_net_iavf_base_lib.a.p/net_intel_ice_base_ice_imem.c.o
[1688/3243] Linking target lib/librte_vhost.so.27.0
[1689/3243] Compiling C object drivers/librte_net_iavf_base_lib.a.p/net_intel_ice_base_ice_dcb.c.o
[1690/3243] Compiling C object drivers/libtmp_rte_net_i40e.a.p/net_intel_i40e_i40e_flow.c.o
[1691/3243] Generating drivers/rte_common_cnxk.sym_chk with a custom command (wrapped by meson to capture output)
FAILED: drivers/rte_common_cnxk.sym_chk 
/usr/local/bin/meson --internal exe --capture drivers/rte_common_cnxk.sym_chk -- /root/dpdk-ci/tools/dpdk/buildtools/check-symbols.sh /root/dpdk-ci/tools/dpdk/build/drivers/common_cnxk_exports.map drivers/librte_common_cnxk.a
--- stderr ---
roc_npa_pool_range_int_enable is flagged as internal but is not exported as an internal symbol
Please add RTE_EXPORT_INTERNAL_SYMBOL to the definition of roc_npa_pool_range_int_enable

[1692/3243] Compiling C object drivers/librte_net_iavf_base_lib.a.p/net_intel_ice_base_ice_pg_cam.c.o
[1693/3243] Compiling C object drivers/librte_net_iavf_base_lib.a.p/net_intel_ice_base_ice_mk_grp.c.o
[1694/3243] Compiling C object drivers/librte_net_iavf_base_lib.a.p/net_intel_ice_base_ice_parser.c.o
[1695/3243] Compiling C object drivers/libtmp_rte_net_iavf.a.p/net_intel_iavf_iavf_ipsec_crypto.c.o
[1696/3243] Compiling C object drivers/librte_net_iavf_base_lib.a.p/net_intel_ice_base_ice_proto_grp.c.o
[1697/3243] Compiling C object drivers/libtmp_rte_net_iavf.a.p/net_intel_iavf_iavf_fdir.c.o
[1698/3243] Compiling C object drivers/librte_net_iavf_base_lib.a.p/net_intel_ice_base_ice_ptype_mk.c.o
[1699/3243] Compiling C object drivers/librte_net_iavf_base_lib.a.p/net_intel_ice_base_ice_flg_rd.c.o
[1700/3243] Generating symbol file lib/librte_vhost.so.27.0.p/librte_vhost.so.27.0.symbols
[1701/3243] Compiling C object drivers/librte_net_iavf_base_lib.a.p/net_intel_ice_base_ice_acl_ctrl.c.o
[1702/3243] Generating drivers/rte_net_e1000.pmd.c with a custom command
[1703/3243] Compiling C object drivers/librte_net_iavf_base_lib.a.p/net_intel_ice_base_ice_fdir.c.o
[1704/3243] Compiling C object drivers/librte_net_iavf_base_lib.a.p/net_intel_ice_base_ice_bst_tcam.c.o
[1705/3243] Compiling C object drivers/libtmp_rte_net_i40e.a.p/net_intel_i40e_rte_pmd_i40e.c.o
[1706/3243] Compiling C object drivers/librte_net_iavf_base_lib.a.p/net_intel_ice_base_ice_xlt_kb.c.o
[1707/3243] Generating drivers/rte_net_fm10k.pmd.c with a custom command
[1708/3243] Compiling C object drivers/libtmp_rte_net_iavf.a.p/net_intel_iavf_iavf_vchnl.c.o
[1709/3243] Compiling C object drivers/libtmp_rte_net_i40e.a.p/net_intel_i40e_base_i40e_common.c.o
[1710/3243] Compiling C object drivers/libtmp_rte_net_hns3.a.p/net_hns3_hns3_rxtx.c.o
[1711/3243] Compiling C object drivers/libtmp_rte_net_iavf.a.p/net_intel_iavf_iavf_ethdev.c.o
[1712/3243] Compiling C object drivers/librte_net_iavf_base_lib.a.p/net_intel_ice_base_ice_ddp.c.o
[1713/3243] Compiling C object drivers/librte_net_iavf_base_lib.a.p/net_intel_ice_base_ice_parser_rt.c.o
[1714/3243] Compiling C object drivers/libtmp_rte_net_iavf.a.p/net_intel_iavf_iavf_rxtx_vec_neon.c.o
[1715/3243] Compiling C object drivers/librte_net_iavf_base_lib.a.p/net_intel_ice_base_ice_flex_pipe.c.o
[1716/3243] Compiling C object drivers/librte_net_iavf_base_lib.a.p/net_intel_ice_base_ice_common.c.o
[1717/3243] Compiling C object drivers/librte_net_iavf_base_lib.a.p/net_intel_ice_base_ice_ptp_hw.c.o
[1718/3243] Compiling C object drivers/librte_net_iavf_base_lib.a.p/net_intel_ice_base_ice_flow.c.o
[1719/3243] Compiling C object drivers/librte_net_iavf_base_lib.a.p/net_intel_ice_base_ice_sched.c.o
[1720/3243] Compiling C object drivers/libtmp_rte_net_cnxk.a.p/net_cnxk_tx_cn10k_tx_all_offload.c.o
[1721/3243] Compiling C object drivers/libtmp_rte_net_i40e.a.p/net_intel_i40e_i40e_rxtx.c.o
[1722/3243] Compiling C object drivers/librte_net_iavf_base_lib.a.p/net_intel_ice_base_ice_switch.c.o
[1723/3243] Compiling C object drivers/libtmp_rte_net_iavf.a.p/net_intel_iavf_iavf_rxtx.c.o
[1724/3243] Compiling C object drivers/libtmp_rte_net_i40e.a.p/net_intel_i40e_i40e_ethdev.c.o
ninja: build stopped: subcommand failed.



Test build failed.
FAILURE


Test environment (x86_64):
Description: Build error encountered
OS : Ubuntu 24.04.3 LTS
Kernel : 7.0.0-1011-aws
NIC : Elastic Network Adapter
GCC : 13.3.0-6ubuntu2~24.04

Test last 100 lines (x86_64)
[772/3423] Compiling C object drivers/libtmp_rte_net_bnxt.a.p/net_bnxt_bnxt_txq.c.o
[773/3423] Compiling C object drivers/libtmp_rte_net_bnxt.a.p/net_bnxt_bnxt_util.c.o
[774/3423] Compiling C object drivers/libtmp_rte_net_bnxt.a.p/net_bnxt_bnxt_ring.c.o
[775/3423] Compiling C object drivers/libtmp_rte_net_bnxt.a.p/net_bnxt_bnxt_rxq.c.o
[776/3423] Compiling C object drivers/libtmp_rte_net_bnxt.a.p/net_bnxt_bnxt_rxr.c.o
[777/3423] Compiling C object drivers/libtmp_rte_net_bnxt.a.p/net_bnxt_rte_pmd_bnxt.c.o
[778/3423] Compiling C object drivers/libtmp_rte_net_bnxt.a.p/net_bnxt_bnxt_vnic.c.o
[779/3423] Compiling C object drivers/libtmp_rte_net_bnxt.a.p/net_bnxt_bnxt_reps.c.o
[780/3423] Compiling C object drivers/libtmp_rte_net_bnxt.a.p/net_bnxt_tf_ulp_bnxt_tf_pmd_shim.c.o
[781/3423] Compiling C object drivers/libtmp_rte_net_bnxt.a.p/net_bnxt_tf_ulp_bnxt_ulp.c.o
[782/3423] Compiling C object drivers/libtmp_rte_net_bnxt.a.p/net_bnxt_bnxt_txr.c.o
[783/3423] Compiling C object drivers/libtmp_rte_net_bnxt.a.p/net_bnxt_tf_ulp_ulp_def_rules.c.o
[784/3423] Compiling C object drivers/libtmp_rte_net_bnxt.a.p/net_bnxt_tf_ulp_bnxt_ulp_flow.c.o
[785/3423] Compiling C object drivers/libtmp_rte_net_bnxt.a.p/net_bnxt_tf_ulp_bnxt_ulp_meter.c.o
[786/3423] Compiling C object drivers/libtmp_rte_net_bnxt.a.p/net_bnxt_tf_ulp_ulp_fc_mgr.c.o
[787/3423] Compiling C object drivers/libtmp_rte_net_bnxt.a.p/net_bnxt_bnxt_ethdev.c.o
[788/3423] Compiling C object drivers/libtmp_rte_net_bnxt.a.p/net_bnxt_tf_ulp_ulp_gen_hash.c.o
[789/3423] Compiling C object drivers/libtmp_rte_net_bnxt.a.p/net_bnxt_tf_ulp_ulp_gen_tbl.c.o
[790/3423] Compiling C object drivers/libtmp_rte_net_bnxt.a.p/net_bnxt_tf_ulp_ulp_ha_mgr.c.o
[791/3423] Compiling C object drivers/libtmp_rte_net_bnxt.a.p/net_bnxt_tf_ulp_ulp_flow_db.c.o
[792/3423] Compiling C object drivers/libtmp_rte_net_bnxt.a.p/net_bnxt_tf_ulp_ulp_mark_mgr.c.o
[793/3423] Compiling C object drivers/libtmp_rte_net_bnxt.a.p/net_bnxt_tf_ulp_ulp_rte_handler_tbl.c.o
[794/3423] Compiling C object drivers/libtmp_rte_net_bnxt.a.p/net_bnxt_tf_ulp_ulp_tun.c.o
[795/3423] Compiling C object drivers/libtmp_rte_net_bnxt.a.p/net_bnxt_tf_ulp_ulp_matcher.c.o
[796/3423] Compiling C object drivers/libtmp_rte_net_bnxt.a.p/net_bnxt_tf_ulp_ulp_port_db.c.o
[797/3423] Compiling C object drivers/libtmp_rte_net_bnxt.a.p/net_bnxt_tf_ulp_ulp_mapper_tf.c.o
[798/3423] Compiling C object drivers/libtmp_rte_net_bnxt.a.p/net_bnxt_tf_ulp_ulp_fc_mgr_tf.c.o
[799/3423] Compiling C object drivers/libtmp_rte_net_bnxt.a.p/net_bnxt_tf_ulp_bnxt_ulp_tf.c.o
[800/3423] Compiling C object drivers/libtmp_rte_net_bnxt.a.p/net_bnxt_tf_ulp_ulp_fc_mgr_tfc.c.o
[801/3423] Compiling C object drivers/libtmp_rte_net_bnxt.a.p/net_bnxt_tf_ulp_ulp_alloc_tbl.c.o
[802/3423] Compiling C object drivers/libtmp_rte_net_bnxt.a.p/net_bnxt_tf_ulp_ulp_sc_mgr_tfc.c.o
[803/3423] Compiling C object drivers/libtmp_rte_net_bnxt.a.p/net_bnxt_tf_ulp_ulp_tfc_ha_mgr.c.o
[804/3423] Compiling C object drivers/libtmp_rte_net_bnxt.a.p/net_bnxt_tf_ulp_ulp_sc_mgr.c.o
[805/3423] Compiling C object drivers/libtmp_rte_net_bnxt.a.p/net_bnxt_tf_ulp_bnxt_ulp_tfc.c.o
[806/3423] Compiling C object drivers/libtmp_rte_net_bnxt.a.p/net_bnxt_tf_ulp_ulp_mapper_tfc.c.o
[807/3423] Compiling C object drivers/libtmp_rte_net_bnxt.a.p/net_bnxt_tf_ulp_generic_templates_ulp_template_db_class.c.o
[808/3423] Compiling C object drivers/libtmp_rte_net_bnxt.a.p/net_bnxt_tf_ulp_generic_templates_ulp_template_db_tbl.c.o
[809/3423] Compiling C object drivers/libtmp_rte_net_bnxt.a.p/net_bnxt_tf_ulp_generic_templates_ulp_template_db_act.c.o
[810/3423] Compiling C object drivers/libtmp_rte_crypto_octeontx.a.p/crypto_octeontx_otx_cryptodev_ops.c.o
[811/3423] Linking static target drivers/libtmp_rte_crypto_octeontx.a
[812/3423] Compiling C object drivers/libtmp_rte_net_bnxt.a.p/net_bnxt_tf_core_bitalloc.c.o
[813/3423] Compiling C object drivers/libtmp_rte_net_bnxt.a.p/net_bnxt_tf_ulp_generic_templates_ulp_template_db_wh_plus_act.c.o
[814/3423] Compiling C object drivers/libtmp_rte_net_bnxt.a.p/net_bnxt_tf_ulp_generic_templates_ulp_template_db_thor_act.c.o
[815/3423] Compiling C object drivers/libtmp_rte_net_bnxt.a.p/net_bnxt_tf_core_ll.c.o
[816/3423] Compiling C object drivers/libtmp_rte_net_bnxt.a.p/net_bnxt_tf_core_rand.c.o
[817/3423] Compiling C object drivers/libtmp_rte_net_bnxt.a.p/net_bnxt_tf_ulp_generic_templates_ulp_template_db_thor2_act.c.o
[818/3423] Compiling C object drivers/libtmp_rte_net_bnxt.a.p/net_bnxt_tf_ulp_generic_templates_ulp_template_db_wh_plus_class.c.o
[819/3423] Compiling C object drivers/libtmp_rte_net_bnxt.a.p/net_bnxt_tf_core_stack.c.o
[820/3423] Compiling C object drivers/libtmp_rte_net_bnxt.a.p/net_bnxt_tf_ulp_ulp_mapper.c.o
[821/3423] Compiling C object drivers/libtmp_rte_net_bnxt.a.p/net_bnxt_tf_ulp_generic_templates_ulp_template_db_thor_class.c.o
[822/3423] Compiling C object drivers/libtmp_rte_net_bnxt.a.p/net_bnxt_tf_ulp_generic_templates_ulp_template_db_thor2_class.c.o
[823/3423] Compiling C object drivers/libtmp_rte_net_bnxt.a.p/net_bnxt_bnxt_hwrm.c.o
[824/3423] Compiling C object drivers/libtmp_rte_net_bnxt.a.p/net_bnxt_tf_core_cfa_tcam_mgr_hwop_msg.c.o
[825/3423] Compiling C object drivers/libtmp_rte_net_bnxt.a.p/net_bnxt_tf_ulp_ulp_rte_parser.c.o
[826/3423] Compiling C object drivers/libtmp_rte_net_bnxt.a.p/net_bnxt_tf_core_cfa_tcam_mgr_p4.c.o
[827/3423] Compiling C object drivers/libtmp_rte_net_bnxt.a.p/net_bnxt_tf_core_tf_hash.c.o
[828/3423] Compiling C object drivers/libtmp_rte_net_bnxt.a.p/net_bnxt_tf_core_dpool.c.o
[829/3423] Compiling C object drivers/libtmp_rte_net_bnxt.a.p/net_bnxt_tf_core_cfa_tcam_mgr_p58.c.o
[830/3423] Compiling C object drivers/libtmp_rte_net_bnxt.a.p/net_bnxt_tf_core_tf_device_p4.c.o
[831/3423] Compiling C object drivers/libtmp_rte_net_bnxt.a.p/net_bnxt_tf_core_tf_device_p58.c.o
[832/3423] Compiling C object drivers/libtmp_rte_net_bnxt.a.p/net_bnxt_tf_core_tf_device.c.o
[833/3423] Compiling C object drivers/libtmp_rte_net_bnxt.a.p/net_bnxt_tf_core_tf_global_cfg.c.o
[834/3423] Compiling C object drivers/libtmp_rte_net_bnxt.a.p/net_bnxt_tf_core_tf_em_internal.c.o
[835/3423] Compiling C object drivers/libtmp_rte_net_bnxt.a.p/net_bnxt_tf_core_tf_em_hash_internal.c.o
[836/3423] Compiling C object drivers/libtmp_rte_net_bnxt.a.p/net_bnxt_tf_core_cfa_tcam_mgr.c.o
[837/3423] Compiling C object drivers/libtmp_rte_net_bnxt.a.p/net_bnxt_tf_core_tf_if_tbl.c.o
[838/3423] Compiling C object drivers/libtmp_rte_net_bnxt.a.p/net_bnxt_tf_core_tf_identifier.c.o
[839/3423] Compiling C object drivers/libtmp_rte_net_bnxt.a.p/net_bnxt_tf_core_tfp.c.o
[840/3423] Compiling C object drivers/libtmp_rte_net_bnxt.a.p/net_bnxt_tf_core_tf_resources.c.o
[841/3423] Compiling C object drivers/libtmp_rte_net_bnxt.a.p/net_bnxt_tf_core_tf_util.c.o
[842/3423] Generating drivers/rte_common_cnxk.sym_chk with a custom command (wrapped by meson to capture output)
FAILED: [code=1] drivers/rte_common_cnxk.sym_chk 
/usr/local/bin/meson --internal exe --capture drivers/rte_common_cnxk.sym_chk -- /root/dpdk-ci/tools/dpdk/buildtools/check-symbols.sh /root/dpdk-ci/tools/dpdk/build/drivers/common_cnxk_exports.map drivers/librte_common_cnxk.a
--- stderr ---
roc_npa_pool_range_int_enable is flagged as internal but is not exported as an internal symbol
Please add RTE_EXPORT_INTERNAL_SYMBOL to the definition of roc_npa_pool_range_int_enable

[843/3423] Compiling C object drivers/libtmp_rte_net_bnxt.a.p/net_bnxt_tf_core_tf_core.c.o
[844/3423] Compiling C object drivers/libtmp_rte_net_bnxt.a.p/net_bnxt_tf_core_tf_rm.c.o
[845/3423] Compiling C object drivers/libtmp_rte_net_bnxt.a.p/net_bnxt_tf_core_tf_sram_mgr.c.o
[846/3423] Compiling C object drivers/libtmp_rte_net_bnxt.a.p/net_bnxt_tf_core_tf_tbl_sram.c.o
[847/3423] Compiling C object drivers/libtmp_rte_net_bnxt.a.p/net_bnxt_tf_core_tf_session.c.o
[848/3423] Compiling C object drivers/libtmp_rte_crypto_cnxk.a.p/crypto_cnxk_cn9k_cryptodev_ops.c.o
[849/3423] Compiling C object drivers/libtmp_rte_net_bnxt.a.p/net_bnxt_tf_core_tf_tbl.c.o
[850/3423] Compiling C object drivers/libtmp_rte_net_bnxt.a.p/net_bnxt_tf_core_v3_tfc_global_id.c.o
[851/3423] Compiling C object drivers/libtmp_rte_net_bnxt.a.p/net_bnxt_tf_core_tf_msg.c.o
[852/3423] Compiling C object drivers/libtmp_rte_net_bnxt.a.p/net_bnxt_tf_core_v3_tfc_cpm.c.o
[853/3423] Compiling C object drivers/libtmp_rte_net_bnxt.a.p/net_bnxt_tf_core_tf_tcam_mgr_msg.c.o
[854/3423] Compiling C object drivers/libtmp_rte_net_bnxt.a.p/net_bnxt_tf_core_tf_tcam_shared.c.o
[855/3423] Compiling C object drivers/libtmp_rte_net_bnxt.a.p/net_bnxt_tf_core_tf_tcam.c.o
[856/3423] Compiling C object drivers/libtmp_rte_net_bnxt.a.p/net_bnxt_tf_core_v3_tfc_act.c.o
[857/3423] Compiling C object drivers/libtmp_rte_net_bnxt.a.p/net_bnxt_tf_core_v3_tfc_em.c.o
[858/3423] Compiling C object drivers/libtmp_rte_crypto_cnxk.a.p/crypto_cnxk_cn20k_cryptodev_ops.c.o
[859/3423] Compiling C object drivers/libtmp_rte_crypto_cnxk.a.p/crypto_cnxk_cn10k_cryptodev_ops.c.o
ninja: build stopped: subcommand failed.



Test build failed.
FAILURE


More information about the test-report mailing list