compilation|FAILURE| pw(169564) sid(39273) job(PER_PATCH_BUILD20051)net/bnxt: add debug log for ulp_regfile_write failure
sys_stv at intel.com
sys_stv at intel.com
Tue Sep 15 11:24:12 CEST 2026
Test-Label: Intel-compilation
Test-Status: FAILURE
http://dpdk.org/patch/169564
_Compilation issues_
Submitter: Evgeny Sokolov <Evgeny.Sokolov at infotecs.ru>
Date: 2026-09-15 08:42:30
Reply_mail: <20260915084230.430706-1-Evgeny.Sokolov at infotecs.ru>
DPDK git baseline: Repo:dpdk-next-net-brcm, CommitID: 18612f9f5ccdfced0a2d4826309726ba73113b4e
Meson Build Summary: 23 Builds Done, 0 Successful, 23 Failures, 0 Blocked
+-------------------+------------+--------------+------------+------------+-----------+----------+------------+
| os | gcc-static | clang-static | icc-static | gcc-shared | gcc-debug | document | gcc-16byte |
+-------------------+------------+--------------+------------+------------+-----------+----------+------------+
| OpenAnolis8.10-64 | fail | | | | | | |
| FreeBSD15-64 | fail | fail | | fail | fail | | |
| RHEL96-64 | fail | fail | | fail | fail | | |
| SUSE16-64 | fail | fail | | | | | |
| AzureLinux3.0-64 | fail | | | | | | |
| UB2604-32 | fail | | | | | | |
| RHEL10.1-64 | fail | | | | | | |
| UB2604-64 | fail | fail | | | | fail | fail |
| RHEL10-64RT | fail | | | | | | |
| UB2510-64 | fail | | | | | | |
| Fedora43-64 | fail | fail | | | | | |
| OpenEuler2404-64 | fail | | | | | | |
+-------------------+------------+--------------+------------+------------+-----------+----------+------------+
Comments:
Because of DPDK bug (https://bugs.dpdk.org/show_bug.cgi?id=928),
All the dpdk-next-* branch add `Ddisable_drivers=event/cnxk` option when build with ICC complier.
Test environment and configuration as below:
OS: OpenAnolis8.10-64
Kernel Version: 5.10.134-18.an8.x86_64
GCC Version: gcc (GCC) 8.5.0 20210514 (Anolis 8.5.0-24.0.1)
Clang Version: 18.1.8 (Red Hat 18.1.8-1.0.1.module+an8.9.0+11287+9d0292d3)
x86_64-native-linuxapp-gcc
OS: FreeBSD15-64
Kernel Version: 15.0-RELEASE
GCC Version: gcc (FreeBSD Ports Collection) 14.2.0
Clang Version: 19.1.7 (https://github.com/llvm/llvm-project.git llvmorg-19.1.7-0-gcd708029e0b2)
x86_64-native-bsdapp-gcc
x86_64-native-bsdapp-clang
x86_64-native-bsdapp-gcc+shared
x86_64-native-bsdapp-gcc+debug
OS: RHEL96-64
Kernel Version: 5.14.0-570.12.1.el9_6.x86_64
GCC Version: gcc (GCC) 11.5.0 20240719 (Red Hat 11.5.0-5)
Clang Version: 19.1.7 (Red Hat, Inc. 19.1.7-2.el9)
x86_64-native-linuxapp-gcc
x86_64-native-linuxapp-clang
x86_64-native-linuxapp-gcc+shared
x86_64-native-linuxapp-gcc+debug
OS: SUSE16-64
Kernel Version: 6.12.0-160000.26-default
GCC Version: gcc (SUSE Linux) 15.2.0
Clang Version: 19.1.7
x86_64-native-linuxapp-clang
x86_64-native-linuxapp-gcc
OS: AzureLinux3.0-64
Kernel Version: 6.6.47.1-1.azl3
GCC Version: gcc (GCC) 13.2.0
Clang Version: 18.1.2
x86_64-native-linuxapp-gcc
OS: UB2604-32
Kernel Version: 7.0.0-14-generic
GCC Version: gcc (Ubuntu 15.2.0-16ubuntu1) 15.2.0
Clang Version: 21.1.8 (6ubuntu1)
i686-native-linuxapp-gcc
OS: RHEL10.1-64
Kernel Version: 6.12.0-124.8.1.el10_1.x86_64
GCC Version: gcc (GCC) 14.3.1 20250617 (Red Hat 14.3.1-2)
Clang Version: 20.1.8 (Red Hat, Inc. 20.1.8-1.el10)
x86_64-native-linuxapp-gcc
OS: UB2604-64
Kernel Version: 7.0.0-14-generic
GCC Version: gcc (Ubuntu 15.2.0-16ubuntu1) 15.2.0
Clang Version: 21.1.8 (6ubuntu1)
x86_64-native-linuxapp-gcc+16byte
x86_64-native-linuxapp-gcc
x86_64-native-linuxapp-clang
x86_64-native-linuxapp-doc
OS: RHEL10-64RT
Kernel Version: 6.12.0-55.9.1.el10_0.x86_64+rt
GCC Version: gcc (GCC) 14.2.1 20250110 (Red Hat 14.2.1-7)
Clang Version: 19.1.7 (Red Hat, Inc. 19.1.7-2.el10)
x86_64-native-linuxapp-gcc
OS: UB2510-64
Kernel Version: 6.17.0-5-generic
GCC Version: gcc (Ubuntu 15.2.0-4ubuntu4) 15.2.0
Clang Version: NA
x86_64-native-linuxapp-gcc
OS: Fedora43-64
Kernel Version: 6.17.1-300.fc43.x86_64
GCC Version: gcc (GCC) 15.2.1 20250924 (Red Hat 15.2.1-2)
Clang Version: 21.1.8 (Fedora 21.1.8-4.fc43)
x86_64-native-linuxapp-gcc
x86_64-native-linuxapp-clang
OS: OpenEuler2404-64
Kernel Version: 6.6.0-132.0.0.111.oe2403sp3.x86_64
GCC Version: gcc (GCC) 12.3.1 (openEuler 12.3.1-105.oe2403sp3)
Clang Version: 17.0.6 ( 17.0.6-63.oe2403sp3)
x86_64-native-linuxapp-gcc
*Build Failed #1:
OS: OpenAnolis8.10-64
Target: x86_64-native-linuxapp-gcc
FAILED: drivers/libtmp_rte_net_bnxt.a.p/net_bnxt_tf_ulp_ulp_mapper_tfc.c.o
gcc -Idrivers/libtmp_rte_net_bnxt.a.p -Idrivers -I../drivers -Idrivers/net/bnxt -I../drivers/net/bnxt -Idrivers/net/bnxt/tf_ulp -I../drivers/net/bnxt/tf_ulp -Idrivers/net/bnxt/tf_ulp/generic_templates -I../drivers/net/bnxt/tf_ulp/generic_templates -Idrivers/net/bnxt/tf_core -I../drivers/net/bnxt/tf_core -Idrivers/net/bnxt/tf_core/v3 -I../drivers/net/bnxt/tf_core/v3 -Idrivers/net/bnxt/hcapi/cfa -I../drivers/net/bnxt/hcapi/cfa -Idrivers/net/bnxt/hcapi/cfa_v3 -I../drivers/net/bnxt/hcapi/cfa_v3 -I../drivers/net/bnxt/hcapi/cfa_v3/include -I../drivers/net/bnxt/hcapi/cfa_v3/include/platform/dpdk -I../drivers/net/bnxt/hcapi/cfa_v3/bld/p70 -I../drivers/net/bnxt/hcapi/cfa_v3/bld/p70/host -I../drivers/net/bnxt/hcapi/cfa_v3/bld/include -I../drivers/net/bnxt/hcapi/cfa_v3/bld/include/host -I../drivers/net/bnxt/hcapi/cfa_v3/bld/include/p70 -I../drivers/net/bnxt/hcapi/cfa_v3/mm/include -I../drivers/net/bnxt/hcapi/cfa_v3/tim/include -I../drivers/net/bnxt/hcapi/cfa_v3/tpm/include -Ilib/ethdev -I../lib/ethdev -Ilib/eal/common -I../lib/eal/common -I. -I.. -Iconfig -I../config -Ilib/eal/include -I../lib/eal/include -Ilib/eal/linux/include -I../lib/eal/linux/include -Ilib/eal/x86/include -I../lib/eal/x86/include -I../kernel/linux -Ilib/eal -I../lib/eal -Ilib/kvargs -I../lib/kvargs -Ilib/log -I../lib/log -Ilib/metrics -I../lib/metrics -Ilib/telemetry -I../lib/telemetry -Ilib/argparse -I../lib/argparse -Ilib/net -I../lib/net -Ilib/mbuf -I../lib/mbuf -Ilib/mempool -I../lib/mempool -Ilib/ring -I../lib/ring -Ilib/meter -I../lib/meter -Idrivers/bus/pci -I../drivers/bus/pci -I../drivers/bus/pci/linux -Ilib/pci -I../lib/pci -Idrivers/bus/vdev -I../drivers/bus/vdev -Ilib/hash -I../lib/hash -Ilib/rcu -I../lib/rcu -fdiagnostics-color=always -D_FILE_OFFSET_BITS=64 -Wall -Winvalid-pch -Wextra -Werror -std=c11 -O3 -include rte_config.h -Wvla -Wcast-qual -Wdeprecated -Wformat -Wformat-nonliteral -Wformat-security -Wmissing-declarations -Wmissing-prototypes -Wnested-externs -Wold-style-definition -Wpointer-arith -Wshadow -Wsign-compare -Wstrict-prototypes -Wundef -Wwrite-strings -Wno-packed-not-aligned -Wno-missing-field-initializers -D_GNU_SOURCE -fPIC -march=native -mrtm -DALLOW_EXPERIMENTAL_API -DALLOW_INTERNAL_API -Wno-format-truncation -Wno-vla -Wno-shadow -DBNXT_TF_APP_ID=0 -DSUPPORT_CFA_HW_P70=1 -DCFA_BLD_PRINT_OBJ=1 -DRTE_COMPONENT_CLASS=pmd_net -DRTE_COMPONENT_NAME=bnxt -DRTE_LOG_DEFAULT_LOGTYPE=pmd.net.bnxt -MD -MQ drivers/libtmp_rte_net_bnxt.a.p/net_bnxt_tf_ulp_ulp_mapper_tfc.c.o -MF drivers/libtmp_rte_net_bnxt.a.p/net_bnxt_tf_ulp_ulp_mapper_tfc.c.o.d -o drivers/libtmp_rte_net_bnxt.a.p/net_bnxt_tf_ulp_ulp_mapper_tfc.c.o -c ../drivers/net/bnxt/tf_ulp/ulp_mapper_tfc.c
../drivers/net/bnxt/tf_ulp/ulp_mapper_tfc.c: In function ‘ulp_mapper_tfc_em_tbl_process’:
../drivers/net/bnxt/tf_ulp/ulp_mapper_tfc.c:659:1: error: invalid storage class for function ‘ulp_mapper_tfc_em_entry_free’
ulp_mapper_tfc_em_entry_free(struct bnxt_ulp_context *ulp,
^~~~~~~~~~~~~~~~~~~~~~~~~~~~
../drivers/net/bnxt/tf_ulp/ulp_mapper_tfc.c:708:1: error: invalid storage class for function ‘ulp_mapper_tfc_dyn_blob_size_get’
ulp_mapper_tfc_dyn_blob_size_get(struct bnxt_ulp_mapper_parms *mparms,
^~~~~~~~~~~~~~~~~~~~~~~~~~~~~~~~
../drivers/net/bnxt/tf_ulp/ulp_mapper_tfc.c:731:1: error: invalid storage class for function ‘ulp_mapper_tfc_index_tbl_process’
ulp_mapper_tfc_index_tbl_process(struct bnxt_ulp_mapper_parms *parms,
^~~~~~~~~~~~~~~~~~~~~~~~~~~~~~~~
../drivers/net/bnxt/tf_ulp/ulp_mapper_tfc.c:1029:1: error: invalid storage class for function ‘ulp_mapper_tfc_index_entry_free’
ulp_mapper_tfc_index_entry_free(struct bnxt_ulp_context *ulp_ctx,
^~~~~~~~~~~~~~~~~~~~~~~~~~~~~~~
../drivers/net/bnxt/tf_ulp/ulp_mapper_tfc.c:1060:1: error: invalid storage class for function ‘ulp_mapper_tfc_cmm_tbl_process’
ulp_mapper_tfc_cmm_tbl_process(struct bnxt_ulp_mapper_parms *parms,
^~~~~~~~~~~~~~~~~~~~~~~~~~~~~~
../drivers/net/bnxt/tf_ulp/ulp_mapper_tfc.c:1368:1: error: invalid storage class for function ‘ulp_mapper_tfc_cmm_entry_free’
ulp_mapper_tfc_cmm_entry_free(struct bnxt_ulp_context *ulp_ctx,
^~~~~~~~~~~~~~~~~~~~~~~~~~~~~
../drivers/net/bnxt/tf_ulp/ulp_mapper_tfc.c:1418:1: error: invalid storage class for function ‘ulp_mapper_tfc_if_tbl_process’
ulp_mapper_tfc_if_tbl_process(struct bnxt_ulp_mapper_parms *parms,
^~~~~~~~~~~~~~~~~~~~~~~~~~~~~
../drivers/net/bnxt/tf_ulp/ulp_mapper_tfc.c:1519:1: error: invalid storage class for function ‘ulp_mapper_tfc_ident_alloc’
ulp_mapper_tfc_ident_alloc(struct bnxt_ulp_context *ulp_ctx,
^~~~~~~~~~~~~~~~~~~~~~~~~~
../drivers/net/bnxt/tf_ulp/ulp_mapper_tfc.c:1556:1: error: invalid storage class for function ‘ulp_mapper_tfc_ident_free’
ulp_mapper_tfc_ident_free(struct bnxt_ulp_context *ulp_ctx,
^~~~~~~~~~~~~~~~~~~~~~~~~
../drivers/net/bnxt/tf_ulp/ulp_mapper_tfc.c:1589:1: error: invalid storage class for function ‘ulp_mapper_tfc_global_ident_alloc’
ulp_mapper_tfc_global_ident_alloc(struct bnxt_ulp_context *ulp_ctx,
^~~~~~~~~~~~~~~~~~~~~~~~~~~~~~~~~
../drivers/net/bnxt/tf_ulp/ulp_mapper_tfc.c:1631:1: error: invalid storage class for function ‘ulp_mapper_tfc_global_ident_free’
ulp_mapper_tfc_global_ident_free(struct bnxt_ulp_context *ulp_ctx,
^~~~~~~~~~~~~~~~~~~~~~~~~~~~~~~~
../drivers/net/bnxt/tf_ulp/ulp_mapper_tfc.c:1665:1: error: invalid storage class for function ‘ulp_mapper_tfc_tcam_entry_free’
ulp_mapper_tfc_tcam_entry_free(struct bnxt_ulp_context *ulp,
^~~~~~~~~~~~~~~~~~~~~~~~~~~~~~
../drivers/net/bnxt/tf_ulp/ulp_mapper_tfc.c:1695:1: error: invalid storage class for function ‘ulp_mapper_tfc_dyn_tbl_type_get’
ulp_mapper_tfc_dyn_tbl_type_get(struct bnxt_ulp_mapper_parms *parm __rte_unused,
^~~~~~~~~~~~~~~~~~~~~~~~~~~~~~~
../drivers/net/bnxt/tf_ulp/ulp_mapper_tfc.c:1715:1: error: invalid storage class for function ‘ulp_mapper_tfc_index_tbl_alloc_process’
ulp_mapper_tfc_index_tbl_alloc_process(struct bnxt_ulp_context *ulp,
^~~~~~~~~~~~~~~~~~~~~~~~~~~~~~~~~~~~~~
../drivers/net/bnxt/tf_ulp/ulp_mapper_tfc.c:1753:1: error: invalid storage class for function ‘ulp_mapper_tfc_app_glb_resource_info_init’
ulp_mapper_tfc_app_glb_resource_info_init(struct bnxt_ulp_context
^~~~~~~~~~~~~~~~~~~~~~~~~~~~~~~~~~~~~~~~~
../drivers/net/bnxt/tf_ulp/ulp_mapper_tfc.c:1763:1: error: invalid storage class for function ‘ulp_mapper_tfc_handle_to_offset’
ulp_mapper_tfc_handle_to_offset(struct bnxt_ulp_mapper_parms *parms __rte_unused,
^~~~~~~~~~~~~~~~~~~~~~~~~~~~~~~
../drivers/net/bnxt/tf_ulp/ulp_mapper_tfc.c:1797:1: error: invalid storage class for function ‘ulp_mapper_tfc_mpc_batch_start’
ulp_mapper_tfc_mpc_batch_start(struct tfc_mpc_batch_info_t *batch_info)
^~~~~~~~~~~~~~~~~~~~~~~~~~~~~~
../drivers/net/bnxt/tf_ulp/ulp_mapper_tfc.c:1803:1: error: invalid storage class for function ‘ulp_mapper_tfc_mtr_stats_hndl_set’
ulp_mapper_tfc_mtr_stats_hndl_set(struct bnxt_ulp_mapper_parms *parms __rte_unused,
^~~~~~~~~~~~~~~~~~~~~~~~~~~~~~~~~
../drivers/net/bnxt/tf_ulp/ulp_mapper_tfc.c:1821:1: error: invalid storage class for function ‘ulp_mapper_tfc_mtr_stats_hndl_get’
ulp_mapper_tfc_mtr_stats_hndl_get(uint32_t mtr_id, uint64_t *stats_hndl)
^~~~~~~~~~~~~~~~~~~~~~~~~~~~~~~~~
../drivers/net/bnxt/tf_ulp/ulp_mapper_tfc.c:1837:1: error: invalid storage class for function ‘ulp_mapper_tfc_mtr_stats_hndl_del’
ulp_mapper_tfc_mtr_stats_hndl_del(uint32_t mtr_id)
^~~~~~~~~~~~~~~~~~~~~~~~~~~~~~~~~
../drivers/net/bnxt/tf_ulp/ulp_mapper_tfc.c:1852:1: error: invalid storage class for function ‘ulp_mapper_tfc_glb_idx_tbl_alloc’
ulp_mapper_tfc_glb_idx_tbl_alloc(struct bnxt_ulp_context *ulp_ctx,
^~~~~~~~~~~~~~~~~~~~~~~~~~~~~~~~
../drivers/net/bnxt/tf_ulp/ulp_mapper_tfc.c:1892:1: error: invalid storage class for function ‘ulp_mapper_tfc_glb_idx_tbl_free’
ulp_mapper_tfc_glb_idx_tbl_free(struct bnxt_ulp_context *ulp_ctx,
^~~~~~~~~~~~~~~~~~~~~~~~~~~~~~~
../drivers/net/bnxt/tf_ulp/ulp_mapper_tfc.c:1926:1: error: invalid storage class for function ‘ulp_mapper_tfc_tcam_prio_update’
ulp_mapper_tfc_tcam_prio_update(struct bnxt_ulp_mapper_parms *parms,
^~~~~~~~~~~~~~~~~~~~~~~~~~~~~~~
../drivers/net/bnxt/tf_ulp/ulp_mapper_tfc.c:1990:1: error: expected declaration or statement at end of input
};
^
../drivers/net/bnxt/tf_ulp/ulp_mapper_tfc.c:1961:34: error: unused variable ‘ulp_mapper_tfc_core_ops’ [-Werror=unused-variable]
const struct ulp_mapper_core_ops ulp_mapper_tfc_core_ops = {
^~~~~~~~~~~~~~~~~~~~~~~
At top level:
../drivers/net/bnxt/tf_ulp/ulp_mapper_tfc.c:457:1: error: ‘ulp_mapper_tfc_em_tbl_process’ defined but not used [-Werror=unused-function]
ulp_mapper_tfc_em_tbl_process(struct bnxt_ulp_mapper_parms *parms,
^~~~~~~~~~~~~~~~~~~~~~~~~~~~~
cc1: all warnings being treated as errors
[1331/3759] Compiling C object drivers/libtmp_rte_net_bnxt.a.p/net_bnxt_tf_ulp_ulp_fc_mgr_tfc.c.o
[1332/3759] Compiling C object drivers/libtmp_rte_net_bnxt.a.p/net_bnxt_tf_ulp_ulp_sc_mgr.c.o
[1333/3759] Compiling C object drivers/libtmp_rte_net_bnxt.a.p/net_bnxt_tf_ulp_ulp_fc_mgr_tf.c.o
[1334/3759] Compiling C object drivers/libtmp_rte_net_bnxt.a.p/net_bnxt_tf_ulp_ulp_alloc_tbl.c.o
[1335/3759] Compiling C object drivers/libtmp_rte_net_bnxt.a.p/net_bnxt_tf_ulp_ulp_mapper_tf.c.o
[1336/3759] Compiling C object drivers/libtmp_rte_net_bnxt.a.p/net_bnxt_tf_ulp_bnxt_ulp_tfc.c.o
[1337/3759] Compiling C object drivers/libtmp_rte_net_bnxt.a.p/net_bnxt_tf_ulp_bnxt_ulp_tf.c.o
[1338/3759] Compiling C object drivers/libtmp_rte_net_bnxt.a.p/net_bnxt_tf_ulp_ulp_mapper.c.o
[1339/3759] Compiling C object drivers/libtmp_rte_net_bnxt.a.p/net_bnxt_tf_ulp_ulp_rte_parser.c.o
ninja: build stopped
*Build Failed #2:
OS: FreeBSD15-64
Target: x86_64-native-bsdapp-gcc
FAILED: drivers/libtmp_rte_net_bnxt.a.p/net_bnxt_tf_ulp_ulp_mapper_tfc.c.o
gcc -Idrivers/libtmp_rte_net_bnxt.a.p -Idrivers -I../drivers -Idrivers/net/bnxt -I../drivers/net/bnxt -Idrivers/net/bnxt/tf_ulp -I../drivers/net/bnxt/tf_ulp -Idrivers/net/bnxt/tf_ulp/generic_templates -I../drivers/net/bnxt/tf_ulp/generic_templates -Idrivers/net/bnxt/tf_core -I../drivers/net/bnxt/tf_core -Idrivers/net/bnxt/tf_core/v3 -I../drivers/net/bnxt/tf_core/v3 -Idrivers/net/bnxt/hcapi/cfa -I../drivers/net/bnxt/hcapi/cfa -Idrivers/net/bnxt/hcapi/cfa_v3 -I../drivers/net/bnxt/hcapi/cfa_v3 -I../drivers/net/bnxt/hcapi/cfa_v3/include -I../drivers/net/bnxt/hcapi/cfa_v3/include/platform/dpdk -I../drivers/net/bnxt/hcapi/cfa_v3/bld/p70 -I../drivers/net/bnxt/hcapi/cfa_v3/bld/p70/host -I../drivers/net/bnxt/hcapi/cfa_v3/bld/include -I../drivers/net/bnxt/hcapi/cfa_v3/bld/include/host -I../drivers/net/bnxt/hcapi/cfa_v3/bld/include/p70 -I../drivers/net/bnxt/hcapi/cfa_v3/mm/include -I../drivers/net/bnxt/hcapi/cfa_v3/tim/include -I../drivers/net/bnxt/hcapi/cfa_v3/tpm/include -Ilib/ethdev -I../lib/ethdev -Ilib/eal/common -I../lib/eal/common -I. -I.. -Iconfig -I../config -Ilib/eal/include -I../lib/eal/include -Ilib/eal/freebsd/include -I../lib/eal/freebsd/include -Ilib/eal/x86/include -I../lib/eal/x86/include -Ilib/eal -I../lib/eal -Ilib/kvargs -I../lib/kvargs -Ilib/log -I../lib/log -Ilib/metrics -I../lib/metrics -Ilib/telemetry -I../lib/telemetry -Ilib/argparse -I../lib/argparse -Ilib/net -I../lib/net -Ilib/mbuf -I../lib/mbuf -Ilib/mempool -I../lib/mempool -Ilib/ring -I../lib/ring -Ilib/meter -I../lib/meter -Idrivers/bus/pci -I../drivers/bus/pci -I../drivers/bus/pci/bsd -Ilib/pci -I../lib/pci -Idrivers/bus/vdev -I../drivers/bus/vdev -Ilib/hash -I../lib/hash -Ilib/rcu -I../lib/rcu -fdiagnostics-color=always -D_FILE_OFFSET_BITS=64 -Wall -Winvalid-pch -Wextra -Werror -std=c11 -O3 -include rte_config.h -Wvla -Wcast-qual -Wdeprecated -Wformat -Wformat-nonliteral -Wformat-security -Wmissing-declarations -Wmissing-prototypes -Wnested-externs -Wold-style-definition -Wpointer-arith -Wshadow -Wsign-compare -Wstrict-prototypes -Wundef -Wwrite-strings -Wno-packed-not-aligned -Wno-missing-field-initializers -D_GNU_SOURCE -D__BSD_VISIBLE -fPIC -march=native -mno-avx512f -mrtm -DALLOW_EXPERIMENTAL_API -DALLOW_INTERNAL_API -Wno-format-truncation -Wno-address-of-packed-member -Wno-vla -Wno-shadow -DBNXT_TF_APP_ID=0 -DSUPPORT_CFA_HW_P70=1 -DCFA_BLD_PRINT_OBJ=1 -DRTE_COMPONENT_CLASS=pmd_net -DRTE_COMPONENT_NAME=bnxt -DRTE_LOG_DEFAULT_LOGTYPE=pmd.net.bnxt -MD -MQ drivers/libtmp_rte_net_bnxt.a.p/net_bnxt_tf_ulp_ulp_mapper_tfc.c.o -MF drivers/libtmp_rte_net_bnxt.a.p/net_bnxt_tf_ulp_ulp_mapper_tfc.c.o.d -o drivers/libtmp_rte_net_bnxt.a.p/net_bnxt_tf_ulp_ulp_mapper_tfc.c.o -c ../drivers/net/bnxt/tf_ulp/ulp_mapper_tfc.c
../drivers/net/bnxt/tf_ulp/ulp_mapper_tfc.c: In function 'ulp_mapper_tfc_em_tbl_process':
../drivers/net/bnxt/tf_ulp/ulp_mapper_tfc.c:659:1: error: invalid storage class for function 'ulp_mapper_tfc_em_entry_free'
659 | ulp_mapper_tfc_em_entry_free(struct bnxt_ulp_context *ulp,
| ^~~~~~~~~~~~~~~~~~~~~~~~~~~~
../drivers/net/bnxt/tf_ulp/ulp_mapper_tfc.c:708:1: error: invalid storage class for function 'ulp_mapper_tfc_dyn_blob_size_get'
708 | ulp_mapper_tfc_dyn_blob_size_get(struct bnxt_ulp_mapper_parms *mparms,
| ^~~~~~~~~~~~~~~~~~~~~~~~~~~~~~~~
../drivers/net/bnxt/tf_ulp/ulp_mapper_tfc.c:731:1: error: invalid storage class for function 'ulp_mapper_tfc_index_tbl_process'
731 | ulp_mapper_tfc_index_tbl_process(struct bnxt_ulp_mapper_parms *parms,
| ^~~~~~~~~~~~~~~~~~~~~~~~~~~~~~~~
../drivers/net/bnxt/tf_ulp/ulp_mapper_tfc.c:1029:1: error: invalid storage class for function 'ulp_mapper_tfc_index_entry_free'
1029 | ulp_mapper_tfc_index_entry_free(struct bnxt_ulp_context *ulp_ctx,
| ^~~~~~~~~~~~~~~~~~~~~~~~~~~~~~~
../drivers/net/bnxt/tf_ulp/ulp_mapper_tfc.c:1060:1: error: invalid storage class for function 'ulp_mapper_tfc_cmm_tbl_process'
1060 | ulp_mapper_tfc_cmm_tbl_process(struct bnxt_ulp_mapper_parms *parms,
| ^~~~~~~~~~~~~~~~~~~~~~~~~~~~~~
../drivers/net/bnxt/tf_ulp/ulp_mapper_tfc.c:1368:1: error: invalid storage class for function 'ulp_mapper_tfc_cmm_entry_free'
1368 | ulp_mapper_tfc_cmm_entry_free(struct bnxt_ulp_context *ulp_ctx,
| ^~~~~~~~~~~~~~~~~~~~~~~~~~~~~
../drivers/net/bnxt/tf_ulp/ulp_mapper_tfc.c:1418:1: error: invalid storage class for function 'ulp_mapper_tfc_if_tbl_process'
1418 | ulp_mapper_tfc_if_tbl_process(struct bnxt_ulp_mapper_parms *parms,
| ^~~~~~~~~~~~~~~~~~~~~~~~~~~~~
../drivers/net/bnxt/tf_ulp/ulp_mapper_tfc.c:1519:1: error: invalid storage class for function 'ulp_mapper_tfc_ident_alloc'
1519 | ulp_mapper_tfc_ident_alloc(struct bnxt_ulp_context *ulp_ctx,
| ^~~~~~~~~~~~~~~~~~~~~~~~~~
../drivers/net/bnxt/tf_ulp/ulp_mapper_tfc.c:1556:1: error: invalid storage class for function 'ulp_mapper_tfc_ident_free'
1556 | ulp_mapper_tfc_ident_free(struct bnxt_ulp_context *ulp_ctx,
| ^~~~~~~~~~~~~~~~~~~~~~~~~
../drivers/net/bnxt/tf_ulp/ulp_mapper_tfc.c:1589:1: error: invalid storage class for function 'ulp_mapper_tfc_global_ident_alloc'
1589 | ulp_mapper_tfc_global_ident_alloc(struct bnxt_ulp_context *ulp_ctx,
| ^~~~~~~~~~~~~~~~~~~~~~~~~~~~~~~~~
../drivers/net/bnxt/tf_ulp/ulp_mapper_tfc.c:1631:1: error: invalid storage class for function 'ulp_mapper_tfc_global_ident_free'
1631 | ulp_mapper_tfc_global_ident_free(struct bnxt_ulp_context *ulp_ctx,
| ^~~~~~~~~~~~~~~~~~~~~~~~~~~~~~~~
../drivers/net/bnxt/tf_ulp/ulp_mapper_tfc.c:1665:1: error: invalid storage class for function 'ulp_mapper_tfc_tcam_entry_free'
1665 | ulp_mapper_tfc_tcam_entry_free(struct bnxt_ulp_context *ulp,
| ^~~~~~~~~~~~~~~~~~~~~~~~~~~~~~
../drivers/net/bnxt/tf_ulp/ulp_mapper_tfc.c:1695:1: error: invalid storage class for function 'ulp_mapper_tfc_dyn_tbl_type_get'
1695 | ulp_mapper_tfc_dyn_tbl_type_get(struct bnxt_ulp_mapper_parms *parm __rte_unused,
| ^~~~~~~~~~~~~~~~~~~~~~~~~~~~~~~
../drivers/net/bnxt/tf_ulp/ulp_mapper_tfc.c:1715:1: error: invalid storage class for function 'ulp_mapper_tfc_index_tbl_alloc_process'
1715 | ulp_mapper_tfc_index_tbl_alloc_process(struct bnxt_ulp_context *ulp,
| ^~~~~~~~~~~~~~~~~~~~~~~~~~~~~~~~~~~~~~
../drivers/net/bnxt/tf_ulp/ulp_mapper_tfc.c:1753:1: error: invalid storage class for function 'ulp_mapper_tfc_app_glb_resource_info_init'
1753 | ulp_mapper_tfc_app_glb_resource_info_init(struct bnxt_ulp_context
| ^~~~~~~~~~~~~~~~~~~~~~~~~~~~~~~~~~~~~~~~~
../drivers/net/bnxt/tf_ulp/ulp_mapper_tfc.c:1763:1: error: invalid storage class for function 'ulp_mapper_tfc_handle_to_offset'
1763 | ulp_mapper_tfc_handle_to_offset(struct bnxt_ulp_mapper_parms *parms __rte_unused,
| ^~~~~~~~~~~~~~~~~~~~~~~~~~~~~~~
../drivers/net/bnxt/tf_ulp/ulp_mapper_tfc.c:1797:1: error: invalid storage class for function 'ulp_mapper_tfc_mpc_batch_start'
1797 | ulp_mapper_tfc_mpc_batch_start(struct tfc_mpc_batch_info_t *batch_info)
| ^~~~~~~~~~~~~~~~~~~~~~~~~~~~~~
../drivers/net/bnxt/tf_ulp/ulp_mapper_tfc.c:1803:1: error: invalid storage class for function 'ulp_mapper_tfc_mtr_stats_hndl_set'
1803 | ulp_mapper_tfc_mtr_stats_hndl_set(struct bnxt_ulp_mapper_parms *parms __rte_unused,
| ^~~~~~~~~~~~~~~~~~~~~~~~~~~~~~~~~
../drivers/net/bnxt/tf_ulp/ulp_mapper_tfc.c:1821:1: error: invalid storage class for function 'ulp_mapper_tfc_mtr_stats_hndl_get'
1821 | ulp_mapper_tfc_mtr_stats_hndl_get(uint32_t mtr_id, uint64_t *stats_hndl)
| ^~~~~~~~~~~~~~~~~~~~~~~~~~~~~~~~~
../drivers/net/bnxt/tf_ulp/ulp_mapper_tfc.c:1837:1: error: invalid storage class for function 'ulp_mapper_tfc_mtr_stats_hndl_del'
1837 | ulp_mapper_tfc_mtr_stats_hndl_del(uint32_t mtr_id)
| ^~~~~~~~~~~~~~~~~~~~~~~~~~~~~~~~~
../drivers/net/bnxt/tf_ulp/ulp_mapper_tfc.c:1852:1: error: invalid storage class for function 'ulp_mapper_tfc_glb_idx_tbl_alloc'
1852 | ulp_mapper_tfc_glb_idx_tbl_alloc(struct bnxt_ulp_context *ulp_ctx,
| ^~~~~~~~~~~~~~~~~~~~~~~~~~~~~~~~
../drivers/net/bnxt/tf_ulp/ulp_mapper_tfc.c:1892:1: error: invalid storage class for function 'ulp_mapper_tfc_glb_idx_tbl_free'
1892 | ulp_mapper_tfc_glb_idx_tbl_free(struct bnxt_ulp_context *ulp_ctx,
| ^~~~~~~~~~~~~~~~~~~~~~~~~~~~~~~
../drivers/net/bnxt/tf_ulp/ulp_mapper_tfc.c:1926:1: error: invalid storage class for function 'ulp_mapper_tfc_tcam_prio_update'
1926 | ulp_mapper_tfc_tcam_prio_update(struct bnxt_ulp_mapper_parms *parms,
| ^~~~~~~~~~~~~~~~~~~~~~~~~~~~~~~
../drivers/net/bnxt/tf_ulp/ulp_mapper_tfc.c:1990:1: error: expected declaration or statement at end of input
1990 | };
| ^
../drivers/net/bnxt/tf_ulp/ulp_mapper_tfc.c:1961:34: error: unused variable 'ulp_mapper_tfc_core_ops' [-Werror=unused-variable]
1961 | const struct ulp_mapper_core_ops ulp_mapper_tfc_core_ops = {
| ^~~~~~~~~~~~~~~~~~~~~~~
../drivers/net/bnxt/tf_ulp/ulp_mapper_tfc.c: At top level:
../drivers/net/bnxt/tf_ulp/ulp_mapper_tfc.c:457:1: error: 'ulp_mapper_tfc_em_tbl_process' defined but not used [-Werror=unused-function]
457 | ulp_mapper_tfc_em_tbl_process(struct bnxt_ulp_mapper_parms *parms,
| ^~~~~~~~~~~~~~~~~~~~~~~~~~~~~
cc1: all warnings being treated as errors
[641/2286] Compiling C object drivers/libtmp_rte_net_bnxt.a.p/net_bnxt_tf_ulp_ulp_mapper_tf.c.o
[642/2286] Compiling C object drivers/libtmp_rte_net_bnxt.a.p/net_bnxt_tf_ulp_bnxt_ulp_tf.c.o
[643/2286] Compiling C object drivers/libtmp_rte_net_bnxt.a.p/net_bnxt_tf_ulp_ulp_fc_mgr_tfc.c.o
[644/2286] Compiling C object drivers/libtmp_rte_net_bnxt.a.p/net_bnxt_tf_ulp_ulp_fc_mgr_tf.c.o
[645/2286] Compiling C object drivers/libtmp_rte_net_bnxt.a.p/net_bnxt_tf_ulp_bnxt_ulp_tfc.c.o
[646/2286] Compiling C object drivers/libtmp_rte_net_bnxt.a.p/net_bnxt_tf_ulp_ulp_alloc_tbl.c.o
[647/2286] Compiling C object drivers/libtmp_rte_net_bnxt.a.p/net_bnxt_tf_ulp_ulp_sc_mgr.c.o
[648/2286] Compiling C object drivers/libtmp_rte_net_bnxt.a.p/net_bnxt_tf_ulp_ulp_mapper.c.o
[649/2286] Compiling C object drivers/libtmp_rte_net_bnxt.a.p/net_bnxt_tf_ulp_ulp_rte_parser.c.o
ninja: build stopped
*Build Failed #3:
OS: FreeBSD15-64
Target: x86_64-native-bsdapp-clang
FAILED: drivers/libtmp_rte_net_bnxt.a.p/net_bnxt_tf_ulp_ulp_mapper_tfc.c.o
clang -Idrivers/libtmp_rte_net_bnxt.a.p -Idrivers -I../drivers -Idrivers/net/bnxt -I../drivers/net/bnxt -Idrivers/net/bnxt/tf_ulp -I../drivers/net/bnxt/tf_ulp -Idrivers/net/bnxt/tf_ulp/generic_templates -I../drivers/net/bnxt/tf_ulp/generic_templates -Idrivers/net/bnxt/tf_core -I../drivers/net/bnxt/tf_core -Idrivers/net/bnxt/tf_core/v3 -I../drivers/net/bnxt/tf_core/v3 -Idrivers/net/bnxt/hcapi/cfa -I../drivers/net/bnxt/hcapi/cfa -Idrivers/net/bnxt/hcapi/cfa_v3 -I../drivers/net/bnxt/hcapi/cfa_v3 -I../drivers/net/bnxt/hcapi/cfa_v3/include -I../drivers/net/bnxt/hcapi/cfa_v3/include/platform/dpdk -I../drivers/net/bnxt/hcapi/cfa_v3/bld/p70 -I../drivers/net/bnxt/hcapi/cfa_v3/bld/p70/host -I../drivers/net/bnxt/hcapi/cfa_v3/bld/include -I../drivers/net/bnxt/hcapi/cfa_v3/bld/include/host -I../drivers/net/bnxt/hcapi/cfa_v3/bld/include/p70 -I../drivers/net/bnxt/hcapi/cfa_v3/mm/include -I../drivers/net/bnxt/hcapi/cfa_v3/tim/include -I../drivers/net/bnxt/hcapi/cfa_v3/tpm/include -Ilib/ethdev -I../lib/ethdev -Ilib/eal/common -I../lib/eal/common -I. -I.. -Iconfig -I../config -Ilib/eal/include -I../lib/eal/include -Ilib/eal/freebsd/include -I../lib/eal/freebsd/include -Ilib/eal/x86/include -I../lib/eal/x86/include -Ilib/eal -I../lib/eal -Ilib/kvargs -I../lib/kvargs -Ilib/log -I../lib/log -Ilib/metrics -I../lib/metrics -Ilib/telemetry -I../lib/telemetry -Ilib/argparse -I../lib/argparse -Ilib/net -I../lib/net -Ilib/mbuf -I../lib/mbuf -Ilib/mempool -I../lib/mempool -Ilib/ring -I../lib/ring -Ilib/meter -I../lib/meter -Idrivers/bus/pci -I../drivers/bus/pci -I../drivers/bus/pci/bsd -Ilib/pci -I../lib/pci -Idrivers/bus/vdev -I../drivers/bus/vdev -Ilib/hash -I../lib/hash -Ilib/rcu -I../lib/rcu -fcolor-diagnostics -D_FILE_OFFSET_BITS=64 -Wall -Winvalid-pch -Wextra -Werror -std=c11 -O3 -include rte_config.h -Wvla -Wcast-qual -Wcomma -Wdeprecated -Wformat -Wformat-nonliteral -Wformat-security -Wmissing-declarations -Wmissing-prototypes -Wnested-externs -Wold-style-definition -Wpointer-arith -Wshadow -Wsign-compare -Wstrict-prototypes -Wundef -Wwrite-strings -Wno-missing-field-initializers -D_GNU_SOURCE -D__BSD_VISIBLE -fPIC -march=native -mrtm -DALLOW_EXPERIMENTAL_API -DALLOW_INTERNAL_API -Wno-format-truncation -Wno-address-of-packed-member -Wno-vla -Wno-shadow -DBNXT_TF_APP_ID=0 -DSUPPORT_CFA_HW_P70=1 -DCFA_BLD_PRINT_OBJ=1 -DRTE_COMPONENT_CLASS=pmd_net -DRTE_COMPONENT_NAME=bnxt -DRTE_LOG_DEFAULT_LOGTYPE=pmd.net.bnxt -MD -MQ drivers/libtmp_rte_net_bnxt.a.p/net_bnxt_tf_ulp_ulp_mapper_tfc.c.o -MF drivers/libtmp_rte_net_bnxt.a.p/net_bnxt_tf_ulp_ulp_mapper_tfc.c.o.d -o drivers/libtmp_rte_net_bnxt.a.p/net_bnxt_tf_ulp_ulp_mapper_tfc.c.o -c ../drivers/net/bnxt/tf_ulp/ulp_mapper_tfc.c
../drivers/net/bnxt/tf_ulp/ulp_mapper_tfc.c:662:1: error: function definition is not allowed here
662 | {
| ^
../drivers/net/bnxt/tf_ulp/ulp_mapper_tfc.c:710:1: error: function definition is not allowed here
710 | {
| ^
../drivers/net/bnxt/tf_ulp/ulp_mapper_tfc.c:733:1: error: function definition is not allowed here
733 | {
| ^
../drivers/net/bnxt/tf_ulp/ulp_mapper_tfc.c:1031:1: error: function definition is not allowed here
1031 | {
| ^
../drivers/net/bnxt/tf_ulp/ulp_mapper_tfc.c:1063:1: error: function definition is not allowed here
1063 | {
| ^
../drivers/net/bnxt/tf_ulp/ulp_mapper_tfc.c:1371:1: error: function definition is not allowed here
1371 | {
| ^
../drivers/net/bnxt/tf_ulp/ulp_mapper_tfc.c:1420:1: error: function definition is not allowed here
1420 | {
| ^
../drivers/net/bnxt/tf_ulp/ulp_mapper_tfc.c:1525:1: error: function definition is not allowed here
1525 | {
| ^
../drivers/net/bnxt/tf_ulp/ulp_mapper_tfc.c:1558:1: error: function definition is not allowed here
1558 | {
| ^
../drivers/net/bnxt/tf_ulp/ulp_mapper_tfc.c:1595:1: error: function definition is not allowed here
1595 | {
| ^
../drivers/net/bnxt/tf_ulp/ulp_mapper_tfc.c:1633:1: error: function definition is not allowed here
1633 | {
| ^
../drivers/net/bnxt/tf_ulp/ulp_mapper_tfc.c:1667:1: error: function definition is not allowed here
1667 | {
| ^
../drivers/net/bnxt/tf_ulp/ulp_mapper_tfc.c:1699:1: error: function definition is not allowed here
1699 | {
| ^
../drivers/net/bnxt/tf_ulp/ulp_mapper_tfc.c:1720:1: error: function definition is not allowed here
1720 | {
| ^
../drivers/net/bnxt/tf_ulp/ulp_mapper_tfc.c:1757:1: error: function definition is not allowed here
1757 | {
| ^
../drivers/net/bnxt/tf_ulp/ulp_mapper_tfc.c:1767:1: error: function definition is not allowed here
1767 | {
| ^
../drivers/net/bnxt/tf_ulp/ulp_mapper_tfc.c:1798:1: error: function definition is not allowed here
1798 | {
| ^
../drivers/net/bnxt/tf_ulp/ulp_mapper_tfc.c:1805:1: error: function definition is not allowed here
1805 | {
| ^
../drivers/net/bnxt/tf_ulp/ulp_mapper_tfc.c:1822:1: error: function definition is not allowed here
1822 | {
| ^
fatal error: too many errors emitted, stopping now [-ferror-limit=]
20 errors generated.
[902/2307] Compiling C object drivers/libtmp_rte_net_bnxt.a.p/net_bnxt_tf_ulp_ulp_fc_mgr_tfc.c.o
[903/2307] Compiling C object drivers/libtmp_rte_net_bnxt.a.p/net_bnxt_tf_ulp_ulp_mapper.c.o
[904/2307] Compiling C object drivers/libtmp_rte_net_bnxt.a.p/net_bnxt_tf_ulp_ulp_fc_mgr_tf.c.o
[905/2307] Compiling C object drivers/libtmp_rte_net_bnxt.a.p/net_bnxt_tf_ulp_ulp_alloc_tbl.c.o
[906/2307] Compiling C object drivers/libtmp_rte_net_bnxt.a.p/net_bnxt_tf_ulp_ulp_rte_parser.c.o
[907/2307] Compiling C object drivers/libtmp_rte_net_bnxt.a.p/net_bnxt_tf_ulp_bnxt_ulp_tfc.c.o
[908/2307] Compiling C object drivers/libtmp_rte_net_bnxt.a.p/net_bnxt_tf_ulp_bnxt_ulp_tf.c.o
[909/2307] Compiling C object drivers/libtmp_rte_net_bnxt.a.p/net_bnxt_tf_ulp_ulp_sc_mgr.c.o
[910/2307] Compiling C object drivers/libtmp_rte_net_bnxt.a.p/net_bnxt_tf_ulp_ulp_sc_mgr_tfc.c.o
ninja: build stopped
*Build Failed #4:
OS: FreeBSD15-64
Target: x86_64-native-bsdapp-gcc+shared
FAILED: drivers/libtmp_rte_net_bnxt.a.p/net_bnxt_tf_ulp_ulp_mapper_tfc.c.o
gcc -Idrivers/libtmp_rte_net_bnxt.a.p -Idrivers -I../drivers -Idrivers/net/bnxt -I../drivers/net/bnxt -Idrivers/net/bnxt/tf_ulp -I../drivers/net/bnxt/tf_ulp -Idrivers/net/bnxt/tf_ulp/generic_templates -I../drivers/net/bnxt/tf_ulp/generic_templates -Idrivers/net/bnxt/tf_core -I../drivers/net/bnxt/tf_core -Idrivers/net/bnxt/tf_core/v3 -I../drivers/net/bnxt/tf_core/v3 -Idrivers/net/bnxt/hcapi/cfa -I../drivers/net/bnxt/hcapi/cfa -Idrivers/net/bnxt/hcapi/cfa_v3 -I../drivers/net/bnxt/hcapi/cfa_v3 -I../drivers/net/bnxt/hcapi/cfa_v3/include -I../drivers/net/bnxt/hcapi/cfa_v3/include/platform/dpdk -I../drivers/net/bnxt/hcapi/cfa_v3/bld/p70 -I../drivers/net/bnxt/hcapi/cfa_v3/bld/p70/host -I../drivers/net/bnxt/hcapi/cfa_v3/bld/include -I../drivers/net/bnxt/hcapi/cfa_v3/bld/include/host -I../drivers/net/bnxt/hcapi/cfa_v3/bld/include/p70 -I../drivers/net/bnxt/hcapi/cfa_v3/mm/include -I../drivers/net/bnxt/hcapi/cfa_v3/tim/include -I../drivers/net/bnxt/hcapi/cfa_v3/tpm/include -Ilib/ethdev -I../lib/ethdev -Ilib/eal/common -I../lib/eal/common -I. -I.. -Iconfig -I../config -Ilib/eal/include -I../lib/eal/include -Ilib/eal/freebsd/include -I../lib/eal/freebsd/include -Ilib/eal/x86/include -I../lib/eal/x86/include -Ilib/eal -I../lib/eal -Ilib/kvargs -I../lib/kvargs -Ilib/log -I../lib/log -Ilib/metrics -I../lib/metrics -Ilib/telemetry -I../lib/telemetry -Ilib/argparse -I../lib/argparse -Ilib/net -I../lib/net -Ilib/mbuf -I../lib/mbuf -Ilib/mempool -I../lib/mempool -Ilib/ring -I../lib/ring -Ilib/meter -I../lib/meter -Idrivers/bus/pci -I../drivers/bus/pci -I../drivers/bus/pci/bsd -Ilib/pci -I../lib/pci -Idrivers/bus/vdev -I../drivers/bus/vdev -Ilib/hash -I../lib/hash -Ilib/rcu -I../lib/rcu -fdiagnostics-color=always -D_FILE_OFFSET_BITS=64 -Wall -Winvalid-pch -Wextra -Werror -std=c11 -O3 -include rte_config.h -Wvla -Wcast-qual -Wdeprecated -Wformat -Wformat-nonliteral -Wformat-security -Wmissing-declarations -Wmissing-prototypes -Wnested-externs -Wold-style-definition -Wpointer-arith -Wshadow -Wsign-compare -Wstrict-prototypes -Wundef -Wwrite-strings -Wno-packed-not-aligned -Wno-missing-field-initializers -D_GNU_SOURCE -D__BSD_VISIBLE -fPIC -march=native -mno-avx512f -mrtm -DALLOW_EXPERIMENTAL_API -DALLOW_INTERNAL_API -Wno-format-truncation -Wno-address-of-packed-member -Wno-vla -Wno-shadow -DBNXT_TF_APP_ID=0 -DSUPPORT_CFA_HW_P70=1 -DCFA_BLD_PRINT_OBJ=1 -DRTE_COMPONENT_CLASS=pmd_net -DRTE_COMPONENT_NAME=bnxt -DRTE_LOG_DEFAULT_LOGTYPE=pmd.net.bnxt -MD -MQ drivers/libtmp_rte_net_bnxt.a.p/net_bnxt_tf_ulp_ulp_mapper_tfc.c.o -MF drivers/libtmp_rte_net_bnxt.a.p/net_bnxt_tf_ulp_ulp_mapper_tfc.c.o.d -o drivers/libtmp_rte_net_bnxt.a.p/net_bnxt_tf_ulp_ulp_mapper_tfc.c.o -c ../drivers/net/bnxt/tf_ulp/ulp_mapper_tfc.c
../drivers/net/bnxt/tf_ulp/ulp_mapper_tfc.c: In function 'ulp_mapper_tfc_em_tbl_process':
../drivers/net/bnxt/tf_ulp/ulp_mapper_tfc.c:659:1: error: invalid storage class for function 'ulp_mapper_tfc_em_entry_free'
659 | ulp_mapper_tfc_em_entry_free(struct bnxt_ulp_context *ulp,
| ^~~~~~~~~~~~~~~~~~~~~~~~~~~~
../drivers/net/bnxt/tf_ulp/ulp_mapper_tfc.c:708:1: error: invalid storage class for function 'ulp_mapper_tfc_dyn_blob_size_get'
708 | ulp_mapper_tfc_dyn_blob_size_get(struct bnxt_ulp_mapper_parms *mparms,
| ^~~~~~~~~~~~~~~~~~~~~~~~~~~~~~~~
../drivers/net/bnxt/tf_ulp/ulp_mapper_tfc.c:731:1: error: invalid storage class for function 'ulp_mapper_tfc_index_tbl_process'
731 | ulp_mapper_tfc_index_tbl_process(struct bnxt_ulp_mapper_parms *parms,
| ^~~~~~~~~~~~~~~~~~~~~~~~~~~~~~~~
../drivers/net/bnxt/tf_ulp/ulp_mapper_tfc.c:1029:1: error: invalid storage class for function 'ulp_mapper_tfc_index_entry_free'
1029 | ulp_mapper_tfc_index_entry_free(struct bnxt_ulp_context *ulp_ctx,
| ^~~~~~~~~~~~~~~~~~~~~~~~~~~~~~~
../drivers/net/bnxt/tf_ulp/ulp_mapper_tfc.c:1060:1: error: invalid storage class for function 'ulp_mapper_tfc_cmm_tbl_process'
1060 | ulp_mapper_tfc_cmm_tbl_process(struct bnxt_ulp_mapper_parms *parms,
| ^~~~~~~~~~~~~~~~~~~~~~~~~~~~~~
../drivers/net/bnxt/tf_ulp/ulp_mapper_tfc.c:1368:1: error: invalid storage class for function 'ulp_mapper_tfc_cmm_entry_free'
1368 | ulp_mapper_tfc_cmm_entry_free(struct bnxt_ulp_context *ulp_ctx,
| ^~~~~~~~~~~~~~~~~~~~~~~~~~~~~
../drivers/net/bnxt/tf_ulp/ulp_mapper_tfc.c:1418:1: error: invalid storage class for function 'ulp_mapper_tfc_if_tbl_process'
1418 | ulp_mapper_tfc_if_tbl_process(struct bnxt_ulp_mapper_parms *parms,
| ^~~~~~~~~~~~~~~~~~~~~~~~~~~~~
../drivers/net/bnxt/tf_ulp/ulp_mapper_tfc.c:1519:1: error: invalid storage class for function 'ulp_mapper_tfc_ident_alloc'
1519 | ulp_mapper_tfc_ident_alloc(struct bnxt_ulp_context *ulp_ctx,
| ^~~~~~~~~~~~~~~~~~~~~~~~~~
../drivers/net/bnxt/tf_ulp/ulp_mapper_tfc.c:1556:1: error: invalid storage class for function 'ulp_mapper_tfc_ident_free'
1556 | ulp_mapper_tfc_ident_free(struct bnxt_ulp_context *ulp_ctx,
| ^~~~~~~~~~~~~~~~~~~~~~~~~
../drivers/net/bnxt/tf_ulp/ulp_mapper_tfc.c:1589:1: error: invalid storage class for function 'ulp_mapper_tfc_global_ident_alloc'
1589 | ulp_mapper_tfc_global_ident_alloc(struct bnxt_ulp_context *ulp_ctx,
| ^~~~~~~~~~~~~~~~~~~~~~~~~~~~~~~~~
../drivers/net/bnxt/tf_ulp/ulp_mapper_tfc.c:1631:1: error: invalid storage class for function 'ulp_mapper_tfc_global_ident_free'
1631 | ulp_mapper_tfc_global_ident_free(struct bnxt_ulp_context *ulp_ctx,
| ^~~~~~~~~~~~~~~~~~~~~~~~~~~~~~~~
../drivers/net/bnxt/tf_ulp/ulp_mapper_tfc.c:1665:1: error: invalid storage class for function 'ulp_mapper_tfc_tcam_entry_free'
1665 | ulp_mapper_tfc_tcam_entry_free(struct bnxt_ulp_context *ulp,
| ^~~~~~~~~~~~~~~~~~~~~~~~~~~~~~
../drivers/net/bnxt/tf_ulp/ulp_mapper_tfc.c:1695:1: error: invalid storage class for function 'ulp_mapper_tfc_dyn_tbl_type_get'
1695 | ulp_mapper_tfc_dyn_tbl_type_get(struct bnxt_ulp_mapper_parms *parm __rte_unused,
| ^~~~~~~~~~~~~~~~~~~~~~~~~~~~~~~
../drivers/net/bnxt/tf_ulp/ulp_mapper_tfc.c:1715:1: error: invalid storage class for function 'ulp_mapper_tfc_index_tbl_alloc_process'
1715 | ulp_mapper_tfc_index_tbl_alloc_process(struct bnxt_ulp_context *ulp,
| ^~~~~~~~~~~~~~~~~~~~~~~~~~~~~~~~~~~~~~
../drivers/net/bnxt/tf_ulp/ulp_mapper_tfc.c:1753:1: error: invalid storage class for function 'ulp_mapper_tfc_app_glb_resource_info_init'
1753 | ulp_mapper_tfc_app_glb_resource_info_init(struct bnxt_ulp_context
| ^~~~~~~~~~~~~~~~~~~~~~~~~~~~~~~~~~~~~~~~~
../drivers/net/bnxt/tf_ulp/ulp_mapper_tfc.c:1763:1: error: invalid storage class for function 'ulp_mapper_tfc_handle_to_offset'
1763 | ulp_mapper_tfc_handle_to_offset(struct bnxt_ulp_mapper_parms *parms __rte_unused,
| ^~~~~~~~~~~~~~~~~~~~~~~~~~~~~~~
../drivers/net/bnxt/tf_ulp/ulp_mapper_tfc.c:1797:1: error: invalid storage class for function 'ulp_mapper_tfc_mpc_batch_start'
1797 | ulp_mapper_tfc_mpc_batch_start(struct tfc_mpc_batch_info_t *batch_info)
| ^~~~~~~~~~~~~~~~~~~~~~~~~~~~~~
../drivers/net/bnxt/tf_ulp/ulp_mapper_tfc.c:1803:1: error: invalid storage class for function 'ulp_mapper_tfc_mtr_stats_hndl_set'
1803 | ulp_mapper_tfc_mtr_stats_hndl_set(struct bnxt_ulp_mapper_parms *parms __rte_unused,
| ^~~~~~~~~~~~~~~~~~~~~~~~~~~~~~~~~
../drivers/net/bnxt/tf_ulp/ulp_mapper_tfc.c:1821:1: error: invalid storage class for function 'ulp_mapper_tfc_mtr_stats_hndl_get'
1821 | ulp_mapper_tfc_mtr_stats_hndl_get(uint32_t mtr_id, uint64_t *stats_hndl)
| ^~~~~~~~~~~~~~~~~~~~~~~~~~~~~~~~~
../drivers/net/bnxt/tf_ulp/ulp_mapper_tfc.c:1837:1: error: invalid storage class for function 'ulp_mapper_tfc_mtr_stats_hndl_del'
1837 | ulp_mapper_tfc_mtr_stats_hndl_del(uint32_t mtr_id)
| ^~~~~~~~~~~~~~~~~~~~~~~~~~~~~~~~~
../drivers/net/bnxt/tf_ulp/ulp_mapper_tfc.c:1852:1: error: invalid storage class for function 'ulp_mapper_tfc_glb_idx_tbl_alloc'
1852 | ulp_mapper_tfc_glb_idx_tbl_alloc(struct bnxt_ulp_context *ulp_ctx,
| ^~~~~~~~~~~~~~~~~~~~~~~~~~~~~~~~
../drivers/net/bnxt/tf_ulp/ulp_mapper_tfc.c:1892:1: error: invalid storage class for function 'ulp_mapper_tfc_glb_idx_tbl_free'
1892 | ulp_mapper_tfc_glb_idx_tbl_free(struct bnxt_ulp_context *ulp_ctx,
| ^~~~~~~~~~~~~~~~~~~~~~~~~~~~~~~
../drivers/net/bnxt/tf_ulp/ulp_mapper_tfc.c:1926:1: error: invalid storage class for function 'ulp_mapper_tfc_tcam_prio_update'
1926 | ulp_mapper_tfc_tcam_prio_update(struct bnxt_ulp_mapper_parms *parms,
| ^~~~~~~~~~~~~~~~~~~~~~~~~~~~~~~
../drivers/net/bnxt/tf_ulp/ulp_mapper_tfc.c:1990:1: error: expected declaration or statement at end of input
1990 | };
| ^
../drivers/net/bnxt/tf_ulp/ulp_mapper_tfc.c:1961:34: error: unused variable 'ulp_mapper_tfc_core_ops' [-Werror=unused-variable]
1961 | const struct ulp_mapper_core_ops ulp_mapper_tfc_core_ops = {
| ^~~~~~~~~~~~~~~~~~~~~~~
../drivers/net/bnxt/tf_ulp/ulp_mapper_tfc.c: At top level:
../drivers/net/bnxt/tf_ulp/ulp_mapper_tfc.c:457:1: error: 'ulp_mapper_tfc_em_tbl_process' defined but not used [-Werror=unused-function]
457 | ulp_mapper_tfc_em_tbl_process(struct bnxt_ulp_mapper_parms *parms,
| ^~~~~~~~~~~~~~~~~~~~~~~~~~~~~
cc1: all warnings being treated as errors
[655/2164] Compiling C object drivers/libtmp_rte_net_bnxt.a.p/net_bnxt_tf_ulp_ulp_fc_mgr_tfc.c.o
[656/2164] Compiling C object drivers/libtmp_rte_net_bnxt.a.p/net_bnxt_tf_ulp_ulp_mapper_tf.c.o
[657/2164] Compiling C object drivers/libtmp_rte_net_bnxt.a.p/net_bnxt_tf_ulp_bnxt_ulp_tfc.c.o
[658/2164] Compiling C object drivers/libtmp_rte_net_bnxt.a.p/net_bnxt_tf_ulp_ulp_fc_mgr_tf.c.o
[659/2164] Compiling C object drivers/libtmp_rte_net_bnxt.a.p/net_bnxt_tf_ulp_bnxt_ulp_tf.c.o
[660/2164] Compiling C object drivers/libtmp_rte_net_bnxt.a.p/net_bnxt_tf_ulp_ulp_alloc_tbl.c.o
[661/2164] Compiling C object drivers/libtmp_rte_net_bnxt.a.p/net_bnxt_tf_ulp_ulp_sc_mgr.c.o
[662/2164] Compiling C object drivers/libtmp_rte_net_bnxt.a.p/net_bnxt_tf_ulp_ulp_mapper.c.o
[663/2164] Compiling C object drivers/libtmp_rte_net_bnxt.a.p/net_bnxt_tf_ulp_ulp_rte_parser.c.o
ninja: build stopped
*Build Failed #5:
OS: FreeBSD15-64
Target: x86_64-native-bsdapp-gcc+debug
FAILED: drivers/libtmp_rte_net_bnxt.a.p/net_bnxt_tf_ulp_ulp_mapper_tfc.c.o
gcc -Idrivers/libtmp_rte_net_bnxt.a.p -Idrivers -I../drivers -Idrivers/net/bnxt -I../drivers/net/bnxt -Idrivers/net/bnxt/tf_ulp -I../drivers/net/bnxt/tf_ulp -Idrivers/net/bnxt/tf_ulp/generic_templates -I../drivers/net/bnxt/tf_ulp/generic_templates -Idrivers/net/bnxt/tf_core -I../drivers/net/bnxt/tf_core -Idrivers/net/bnxt/tf_core/v3 -I../drivers/net/bnxt/tf_core/v3 -Idrivers/net/bnxt/hcapi/cfa -I../drivers/net/bnxt/hcapi/cfa -Idrivers/net/bnxt/hcapi/cfa_v3 -I../drivers/net/bnxt/hcapi/cfa_v3 -I../drivers/net/bnxt/hcapi/cfa_v3/include -I../drivers/net/bnxt/hcapi/cfa_v3/include/platform/dpdk -I../drivers/net/bnxt/hcapi/cfa_v3/bld/p70 -I../drivers/net/bnxt/hcapi/cfa_v3/bld/p70/host -I../drivers/net/bnxt/hcapi/cfa_v3/bld/include -I../drivers/net/bnxt/hcapi/cfa_v3/bld/include/host -I../drivers/net/bnxt/hcapi/cfa_v3/bld/include/p70 -I../drivers/net/bnxt/hcapi/cfa_v3/mm/include -I../drivers/net/bnxt/hcapi/cfa_v3/tim/include -I../drivers/net/bnxt/hcapi/cfa_v3/tpm/include -Ilib/ethdev -I../lib/ethdev -Ilib/eal/common -I../lib/eal/common -I. -I.. -Iconfig -I../config -Ilib/eal/include -I../lib/eal/include -Ilib/eal/freebsd/include -I../lib/eal/freebsd/include -Ilib/eal/x86/include -I../lib/eal/x86/include -Ilib/eal -I../lib/eal -Ilib/kvargs -I../lib/kvargs -Ilib/log -I../lib/log -Ilib/metrics -I../lib/metrics -Ilib/telemetry -I../lib/telemetry -Ilib/argparse -I../lib/argparse -Ilib/net -I../lib/net -Ilib/mbuf -I../lib/mbuf -Ilib/mempool -I../lib/mempool -Ilib/ring -I../lib/ring -Ilib/meter -I../lib/meter -Idrivers/bus/pci -I../drivers/bus/pci -I../drivers/bus/pci/bsd -Ilib/pci -I../lib/pci -Idrivers/bus/vdev -I../drivers/bus/vdev -Ilib/hash -I../lib/hash -Ilib/rcu -I../lib/rcu -fdiagnostics-color=always -D_FILE_OFFSET_BITS=64 -Wall -Winvalid-pch -Wextra -Werror -std=c11 -O2 -g -include rte_config.h -Wvla -Wcast-qual -Wdeprecated -Wformat -Wformat-nonliteral -Wformat-security -Wmissing-declarations -Wmissing-prototypes -Wnested-externs -Wold-style-definition -Wpointer-arith -Wshadow -Wsign-compare -Wstrict-prototypes -Wundef -Wwrite-strings -Wno-packed-not-aligned -Wno-missing-field-initializers -D_GNU_SOURCE -D__BSD_VISIBLE -fPIC -march=native -mno-avx512f -mrtm -DALLOW_EXPERIMENTAL_API -DALLOW_INTERNAL_API -Wno-format-truncation -Wno-address-of-packed-member -Wno-vla -Wno-shadow -DBNXT_TF_APP_ID=0 -DSUPPORT_CFA_HW_P70=1 -DCFA_BLD_PRINT_OBJ=1 -DRTE_COMPONENT_CLASS=pmd_net -DRTE_COMPONENT_NAME=bnxt -DRTE_LOG_DEFAULT_LOGTYPE=pmd.net.bnxt -MD -MQ drivers/libtmp_rte_net_bnxt.a.p/net_bnxt_tf_ulp_ulp_mapper_tfc.c.o -MF drivers/libtmp_rte_net_bnxt.a.p/net_bnxt_tf_ulp_ulp_mapper_tfc.c.o.d -o drivers/libtmp_rte_net_bnxt.a.p/net_bnxt_tf_ulp_ulp_mapper_tfc.c.o -c ../drivers/net/bnxt/tf_ulp/ulp_mapper_tfc.c
../drivers/net/bnxt/tf_ulp/ulp_mapper_tfc.c: In function 'ulp_mapper_tfc_em_tbl_process':
../drivers/net/bnxt/tf_ulp/ulp_mapper_tfc.c:659:1: error: invalid storage class for function 'ulp_mapper_tfc_em_entry_free'
659 | ulp_mapper_tfc_em_entry_free(struct bnxt_ulp_context *ulp,
| ^~~~~~~~~~~~~~~~~~~~~~~~~~~~
../drivers/net/bnxt/tf_ulp/ulp_mapper_tfc.c:708:1: error: invalid storage class for function 'ulp_mapper_tfc_dyn_blob_size_get'
708 | ulp_mapper_tfc_dyn_blob_size_get(struct bnxt_ulp_mapper_parms *mparms,
| ^~~~~~~~~~~~~~~~~~~~~~~~~~~~~~~~
../drivers/net/bnxt/tf_ulp/ulp_mapper_tfc.c:731:1: error: invalid storage class for function 'ulp_mapper_tfc_index_tbl_process'
731 | ulp_mapper_tfc_index_tbl_process(struct bnxt_ulp_mapper_parms *parms,
| ^~~~~~~~~~~~~~~~~~~~~~~~~~~~~~~~
../drivers/net/bnxt/tf_ulp/ulp_mapper_tfc.c:1029:1: error: invalid storage class for function 'ulp_mapper_tfc_index_entry_free'
1029 | ulp_mapper_tfc_index_entry_free(struct bnxt_ulp_context *ulp_ctx,
| ^~~~~~~~~~~~~~~~~~~~~~~~~~~~~~~
../drivers/net/bnxt/tf_ulp/ulp_mapper_tfc.c:1060:1: error: invalid storage class for function 'ulp_mapper_tfc_cmm_tbl_process'
1060 | ulp_mapper_tfc_cmm_tbl_process(struct bnxt_ulp_mapper_parms *parms,
| ^~~~~~~~~~~~~~~~~~~~~~~~~~~~~~
../drivers/net/bnxt/tf_ulp/ulp_mapper_tfc.c:1368:1: error: invalid storage class for function 'ulp_mapper_tfc_cmm_entry_free'
1368 | ulp_mapper_tfc_cmm_entry_free(struct bnxt_ulp_context *ulp_ctx,
| ^~~~~~~~~~~~~~~~~~~~~~~~~~~~~
../drivers/net/bnxt/tf_ulp/ulp_mapper_tfc.c:1418:1: error: invalid storage class for function 'ulp_mapper_tfc_if_tbl_process'
1418 | ulp_mapper_tfc_if_tbl_process(struct bnxt_ulp_mapper_parms *parms,
| ^~~~~~~~~~~~~~~~~~~~~~~~~~~~~
../drivers/net/bnxt/tf_ulp/ulp_mapper_tfc.c:1519:1: error: invalid storage class for function 'ulp_mapper_tfc_ident_alloc'
1519 | ulp_mapper_tfc_ident_alloc(struct bnxt_ulp_context *ulp_ctx,
| ^~~~~~~~~~~~~~~~~~~~~~~~~~
../drivers/net/bnxt/tf_ulp/ulp_mapper_tfc.c:1556:1: error: invalid storage class for function 'ulp_mapper_tfc_ident_free'
1556 | ulp_mapper_tfc_ident_free(struct bnxt_ulp_context *ulp_ctx,
| ^~~~~~~~~~~~~~~~~~~~~~~~~
../drivers/net/bnxt/tf_ulp/ulp_mapper_tfc.c:1589:1: error: invalid storage class for function 'ulp_mapper_tfc_global_ident_alloc'
1589 | ulp_mapper_tfc_global_ident_alloc(struct bnxt_ulp_context *ulp_ctx,
| ^~~~~~~~~~~~~~~~~~~~~~~~~~~~~~~~~
../drivers/net/bnxt/tf_ulp/ulp_mapper_tfc.c:1631:1: error: invalid storage class for function 'ulp_mapper_tfc_global_ident_free'
1631 | ulp_mapper_tfc_global_ident_free(struct bnxt_ulp_context *ulp_ctx,
| ^~~~~~~~~~~~~~~~~~~~~~~~~~~~~~~~
../drivers/net/bnxt/tf_ulp/ulp_mapper_tfc.c:1665:1: error: invalid storage class for function 'ulp_mapper_tfc_tcam_entry_free'
1665 | ulp_mapper_tfc_tcam_entry_free(struct bnxt_ulp_context *ulp,
| ^~~~~~~~~~~~~~~~~~~~~~~~~~~~~~
../drivers/net/bnxt/tf_ulp/ulp_mapper_tfc.c:1695:1: error: invalid storage class for function 'ulp_mapper_tfc_dyn_tbl_type_get'
1695 | ulp_mapper_tfc_dyn_tbl_type_get(struct bnxt_ulp_mapper_parms *parm __rte_unused,
| ^~~~~~~~~~~~~~~~~~~~~~~~~~~~~~~
../drivers/net/bnxt/tf_ulp/ulp_mapper_tfc.c:1715:1: error: invalid storage class for function 'ulp_mapper_tfc_index_tbl_alloc_process'
1715 | ulp_mapper_tfc_index_tbl_alloc_process(struct bnxt_ulp_context *ulp,
| ^~~~~~~~~~~~~~~~~~~~~~~~~~~~~~~~~~~~~~
../drivers/net/bnxt/tf_ulp/ulp_mapper_tfc.c:1753:1: error: invalid storage class for function 'ulp_mapper_tfc_app_glb_resource_info_init'
1753 | ulp_mapper_tfc_app_glb_resource_info_init(struct bnxt_ulp_context
| ^~~~~~~~~~~~~~~~~~~~~~~~~~~~~~~~~~~~~~~~~
../drivers/net/bnxt/tf_ulp/ulp_mapper_tfc.c:1763:1: error: invalid storage class for function 'ulp_mapper_tfc_handle_to_offset'
1763 | ulp_mapper_tfc_handle_to_offset(struct bnxt_ulp_mapper_parms *parms __rte_unused,
| ^~~~~~~~~~~~~~~~~~~~~~~~~~~~~~~
../drivers/net/bnxt/tf_ulp/ulp_mapper_tfc.c:1797:1: error: invalid storage class for function 'ulp_mapper_tfc_mpc_batch_start'
1797 | ulp_mapper_tfc_mpc_batch_start(struct tfc_mpc_batch_info_t *batch_info)
| ^~~~~~~~~~~~~~~~~~~~~~~~~~~~~~
../drivers/net/bnxt/tf_ulp/ulp_mapper_tfc.c:1803:1: error: invalid storage class for function 'ulp_mapper_tfc_mtr_stats_hndl_set'
1803 | ulp_mapper_tfc_mtr_stats_hndl_set(struct bnxt_ulp_mapper_parms *parms __rte_unused,
| ^~~~~~~~~~~~~~~~~~~~~~~~~~~~~~~~~
../drivers/net/bnxt/tf_ulp/ulp_mapper_tfc.c:1821:1: error: invalid storage class for function 'ulp_mapper_tfc_mtr_stats_hndl_get'
1821 | ulp_mapper_tfc_mtr_stats_hndl_get(uint32_t mtr_id, uint64_t *stats_hndl)
| ^~~~~~~~~~~~~~~~~~~~~~~~~~~~~~~~~
../drivers/net/bnxt/tf_ulp/ulp_mapper_tfc.c:1837:1: error: invalid storage class for function 'ulp_mapper_tfc_mtr_stats_hndl_del'
1837 | ulp_mapper_tfc_mtr_stats_hndl_del(uint32_t mtr_id)
| ^~~~~~~~~~~~~~~~~~~~~~~~~~~~~~~~~
../drivers/net/bnxt/tf_ulp/ulp_mapper_tfc.c:1852:1: error: invalid storage class for function 'ulp_mapper_tfc_glb_idx_tbl_alloc'
1852 | ulp_mapper_tfc_glb_idx_tbl_alloc(struct bnxt_ulp_context *ulp_ctx,
| ^~~~~~~~~~~~~~~~~~~~~~~~~~~~~~~~
../drivers/net/bnxt/tf_ulp/ulp_mapper_tfc.c:1892:1: error: invalid storage class for function 'ulp_mapper_tfc_glb_idx_tbl_free'
1892 | ulp_mapper_tfc_glb_idx_tbl_free(struct bnxt_ulp_context *ulp_ctx,
| ^~~~~~~~~~~~~~~~~~~~~~~~~~~~~~~
../drivers/net/bnxt/tf_ulp/ulp_mapper_tfc.c:1926:1: error: invalid storage class for function 'ulp_mapper_tfc_tcam_prio_update'
1926 | ulp_mapper_tfc_tcam_prio_update(struct bnxt_ulp_mapper_parms *parms,
| ^~~~~~~~~~~~~~~~~~~~~~~~~~~~~~~
../drivers/net/bnxt/tf_ulp/ulp_mapper_tfc.c:1990:1: error: expected declaration or statement at end of input
1990 | };
| ^
../drivers/net/bnxt/tf_ulp/ulp_mapper_tfc.c:1961:34: error: unused variable 'ulp_mapper_tfc_core_ops' [-Werror=unused-variable]
1961 | const struct ulp_mapper_core_ops ulp_mapper_tfc_core_ops = {
| ^~~~~~~~~~~~~~~~~~~~~~~
../drivers/net/bnxt/tf_ulp/ulp_mapper_tfc.c: At top level:
../drivers/net/bnxt/tf_ulp/ulp_mapper_tfc.c:457:1: error: 'ulp_mapper_tfc_em_tbl_process' defined but not used [-Werror=unused-function]
457 | ulp_mapper_tfc_em_tbl_process(struct bnxt_ulp_mapper_parms *parms,
| ^~~~~~~~~~~~~~~~~~~~~~~~~~~~~
cc1: all warnings being treated as errors
[640/2286] Compiling C object drivers/libtmp_rte_net_bnxt.a.p/net_bnxt_bnxt_hwrm.c.o
[641/2286] Compiling C object drivers/libtmp_rte_net_bnxt.a.p/net_bnxt_tf_ulp_ulp_mapper_tf.c.o
[642/2286] Compiling C object drivers/libtmp_rte_net_bnxt.a.p/net_bnxt_tf_ulp_ulp_fc_mgr_tfc.c.o
[643/2286] Compiling C object drivers/libtmp_rte_net_bnxt.a.p/net_bnxt_tf_ulp_bnxt_ulp_tf.c.o
[644/2286] Compiling C object drivers/libtmp_rte_net_bnxt.a.p/net_bnxt_tf_ulp_ulp_fc_mgr_tf.c.o
[645/2286] Compiling C object drivers/libtmp_rte_net_bnxt.a.p/net_bnxt_tf_ulp_bnxt_ulp_tfc.c.o
[646/2286] Compiling C object drivers/libtmp_rte_net_bnxt.a.p/net_bnxt_tf_ulp_ulp_alloc_tbl.c.o
[647/2286] Compiling C object drivers/libtmp_rte_net_bnxt.a.p/net_bnxt_tf_ulp_ulp_mapper.c.o
[648/2286] Compiling C object drivers/libtmp_rte_net_bnxt.a.p/net_bnxt_tf_ulp_ulp_rte_parser.c.o
ninja: build stopped
*Build Failed #6:
OS: RHEL96-64
Target: x86_64-native-linuxapp-gcc
FAILED: drivers/libtmp_rte_net_bnxt.a.p/net_bnxt_tf_ulp_ulp_mapper_tfc.c.o
gcc -Idrivers/libtmp_rte_net_bnxt.a.p -Idrivers -I../drivers -Idrivers/net/bnxt -I../drivers/net/bnxt -Idrivers/net/bnxt/tf_ulp -I../drivers/net/bnxt/tf_ulp -Idrivers/net/bnxt/tf_ulp/generic_templates -I../drivers/net/bnxt/tf_ulp/generic_templates -Idrivers/net/bnxt/tf_core -I../drivers/net/bnxt/tf_core -Idrivers/net/bnxt/tf_core/v3 -I../drivers/net/bnxt/tf_core/v3 -Idrivers/net/bnxt/hcapi/cfa -I../drivers/net/bnxt/hcapi/cfa -Idrivers/net/bnxt/hcapi/cfa_v3 -I../drivers/net/bnxt/hcapi/cfa_v3 -I../drivers/net/bnxt/hcapi/cfa_v3/include -I../drivers/net/bnxt/hcapi/cfa_v3/include/platform/dpdk -I../drivers/net/bnxt/hcapi/cfa_v3/bld/p70 -I../drivers/net/bnxt/hcapi/cfa_v3/bld/p70/host -I../drivers/net/bnxt/hcapi/cfa_v3/bld/include -I../drivers/net/bnxt/hcapi/cfa_v3/bld/include/host -I../drivers/net/bnxt/hcapi/cfa_v3/bld/include/p70 -I../drivers/net/bnxt/hcapi/cfa_v3/mm/include -I../drivers/net/bnxt/hcapi/cfa_v3/tim/include -I../drivers/net/bnxt/hcapi/cfa_v3/tpm/include -Ilib/ethdev -I../lib/ethdev -Ilib/eal/common -I../lib/eal/common -I. -I.. -Iconfig -I../config -Ilib/eal/include -I../lib/eal/include -Ilib/eal/linux/include -I../lib/eal/linux/include -Ilib/eal/x86/include -I../lib/eal/x86/include -I../kernel/linux -Ilib/eal -I../lib/eal -Ilib/kvargs -I../lib/kvargs -Ilib/log -I../lib/log -Ilib/metrics -I../lib/metrics -Ilib/telemetry -I../lib/telemetry -Ilib/argparse -I../lib/argparse -Ilib/net -I../lib/net -Ilib/mbuf -I../lib/mbuf -Ilib/mempool -I../lib/mempool -Ilib/ring -I../lib/ring -Ilib/meter -I../lib/meter -Idrivers/bus/pci -I../drivers/bus/pci -I../drivers/bus/pci/linux -Ilib/pci -I../lib/pci -Idrivers/bus/vdev -I../drivers/bus/vdev -Ilib/hash -I../lib/hash -Ilib/rcu -I../lib/rcu -fdiagnostics-color=always -D_FILE_OFFSET_BITS=64 -Wall -Winvalid-pch -Wextra -Werror -std=c11 -O3 -include rte_config.h -Wvla -Wcast-qual -Wdeprecated -Wformat -Wformat-nonliteral -Wformat-security -Wmissing-declarations -Wmissing-prototypes -Wnested-externs -Wold-style-definition -Wpointer-arith -Wshadow -Wsign-compare -Wstrict-prototypes -Wundef -Wwrite-strings -Wno-packed-not-aligned -Wno-missing-field-initializers -D_GNU_SOURCE -fPIC -march=native -mrtm -DALLOW_EXPERIMENTAL_API -DALLOW_INTERNAL_API -Wno-format-truncation -Wno-address-of-packed-member -Wno-vla -Wno-shadow -DBNXT_TF_APP_ID=0 -DSUPPORT_CFA_HW_P70=1 -DCFA_BLD_PRINT_OBJ=1 -DRTE_COMPONENT_CLASS=pmd_net -DRTE_COMPONENT_NAME=bnxt -DRTE_LOG_DEFAULT_LOGTYPE=pmd.net.bnxt -MD -MQ drivers/libtmp_rte_net_bnxt.a.p/net_bnxt_tf_ulp_ulp_mapper_tfc.c.o -MF drivers/libtmp_rte_net_bnxt.a.p/net_bnxt_tf_ulp_ulp_mapper_tfc.c.o.d -o drivers/libtmp_rte_net_bnxt.a.p/net_bnxt_tf_ulp_ulp_mapper_tfc.c.o -c ../drivers/net/bnxt/tf_ulp/ulp_mapper_tfc.c
../drivers/net/bnxt/tf_ulp/ulp_mapper_tfc.c: In function ‘ulp_mapper_tfc_em_tbl_process’:
../drivers/net/bnxt/tf_ulp/ulp_mapper_tfc.c:659:1: error: invalid storage class for function ‘ulp_mapper_tfc_em_entry_free’
659 | ulp_mapper_tfc_em_entry_free(struct bnxt_ulp_context *ulp,
| ^~~~~~~~~~~~~~~~~~~~~~~~~~~~
../drivers/net/bnxt/tf_ulp/ulp_mapper_tfc.c:708:1: error: invalid storage class for function ‘ulp_mapper_tfc_dyn_blob_size_get’
708 | ulp_mapper_tfc_dyn_blob_size_get(struct bnxt_ulp_mapper_parms *mparms,
| ^~~~~~~~~~~~~~~~~~~~~~~~~~~~~~~~
../drivers/net/bnxt/tf_ulp/ulp_mapper_tfc.c:731:1: error: invalid storage class for function ‘ulp_mapper_tfc_index_tbl_process’
731 | ulp_mapper_tfc_index_tbl_process(struct bnxt_ulp_mapper_parms *parms,
| ^~~~~~~~~~~~~~~~~~~~~~~~~~~~~~~~
../drivers/net/bnxt/tf_ulp/ulp_mapper_tfc.c:1029:1: error: invalid storage class for function ‘ulp_mapper_tfc_index_entry_free’
1029 | ulp_mapper_tfc_index_entry_free(struct bnxt_ulp_context *ulp_ctx,
| ^~~~~~~~~~~~~~~~~~~~~~~~~~~~~~~
../drivers/net/bnxt/tf_ulp/ulp_mapper_tfc.c:1060:1: error: invalid storage class for function ‘ulp_mapper_tfc_cmm_tbl_process’
1060 | ulp_mapper_tfc_cmm_tbl_process(struct bnxt_ulp_mapper_parms *parms,
| ^~~~~~~~~~~~~~~~~~~~~~~~~~~~~~
../drivers/net/bnxt/tf_ulp/ulp_mapper_tfc.c:1368:1: error: invalid storage class for function ‘ulp_mapper_tfc_cmm_entry_free’
1368 | ulp_mapper_tfc_cmm_entry_free(struct bnxt_ulp_context *ulp_ctx,
| ^~~~~~~~~~~~~~~~~~~~~~~~~~~~~
../drivers/net/bnxt/tf_ulp/ulp_mapper_tfc.c:1418:1: error: invalid storage class for function ‘ulp_mapper_tfc_if_tbl_process’
1418 | ulp_mapper_tfc_if_tbl_process(struct bnxt_ulp_mapper_parms *parms,
| ^~~~~~~~~~~~~~~~~~~~~~~~~~~~~
../drivers/net/bnxt/tf_ulp/ulp_mapper_tfc.c:1519:1: error: invalid storage class for function ‘ulp_mapper_tfc_ident_alloc’
1519 | ulp_mapper_tfc_ident_alloc(struct bnxt_ulp_context *ulp_ctx,
| ^~~~~~~~~~~~~~~~~~~~~~~~~~
../drivers/net/bnxt/tf_ulp/ulp_mapper_tfc.c:1556:1: error: invalid storage class for function ‘ulp_mapper_tfc_ident_free’
1556 | ulp_mapper_tfc_ident_free(struct bnxt_ulp_context *ulp_ctx,
| ^~~~~~~~~~~~~~~~~~~~~~~~~
../drivers/net/bnxt/tf_ulp/ulp_mapper_tfc.c:1589:1: error: invalid storage class for function ‘ulp_mapper_tfc_global_ident_alloc’
1589 | ulp_mapper_tfc_global_ident_alloc(struct bnxt_ulp_context *ulp_ctx,
| ^~~~~~~~~~~~~~~~~~~~~~~~~~~~~~~~~
../drivers/net/bnxt/tf_ulp/ulp_mapper_tfc.c:1631:1: error: invalid storage class for function ‘ulp_mapper_tfc_global_ident_free’
1631 | ulp_mapper_tfc_global_ident_free(struct bnxt_ulp_context *ulp_ctx,
| ^~~~~~~~~~~~~~~~~~~~~~~~~~~~~~~~
../drivers/net/bnxt/tf_ulp/ulp_mapper_tfc.c:1665:1: error: invalid storage class for function ‘ulp_mapper_tfc_tcam_entry_free’
1665 | ulp_mapper_tfc_tcam_entry_free(struct bnxt_ulp_context *ulp,
| ^~~~~~~~~~~~~~~~~~~~~~~~~~~~~~
../drivers/net/bnxt/tf_ulp/ulp_mapper_tfc.c:1695:1: error: invalid storage class for function ‘ulp_mapper_tfc_dyn_tbl_type_get’
1695 | ulp_mapper_tfc_dyn_tbl_type_get(struct bnxt_ulp_mapper_parms *parm __rte_unused,
| ^~~~~~~~~~~~~~~~~~~~~~~~~~~~~~~
../drivers/net/bnxt/tf_ulp/ulp_mapper_tfc.c:1715:1: error: invalid storage class for function ‘ulp_mapper_tfc_index_tbl_alloc_process’
1715 | ulp_mapper_tfc_index_tbl_alloc_process(struct bnxt_ulp_context *ulp,
| ^~~~~~~~~~~~~~~~~~~~~~~~~~~~~~~~~~~~~~
../drivers/net/bnxt/tf_ulp/ulp_mapper_tfc.c:1753:1: error: invalid storage class for function ‘ulp_mapper_tfc_app_glb_resource_info_init’
1753 | ulp_mapper_tfc_app_glb_resource_info_init(struct bnxt_ulp_context
| ^~~~~~~~~~~~~~~~~~~~~~~~~~~~~~~~~~~~~~~~~
../drivers/net/bnxt/tf_ulp/ulp_mapper_tfc.c:1763:1: error: invalid storage class for function ‘ulp_mapper_tfc_handle_to_offset’
1763 | ulp_mapper_tfc_handle_to_offset(struct bnxt_ulp_mapper_parms *parms __rte_unused,
| ^~~~~~~~~~~~~~~~~~~~~~~~~~~~~~~
../drivers/net/bnxt/tf_ulp/ulp_mapper_tfc.c:1797:1: error: invalid storage class for function ‘ulp_mapper_tfc_mpc_batch_start’
1797 | ulp_mapper_tfc_mpc_batch_start(struct tfc_mpc_batch_info_t *batch_info)
| ^~~~~~~~~~~~~~~~~~~~~~~~~~~~~~
../drivers/net/bnxt/tf_ulp/ulp_mapper_tfc.c:1803:1: error: invalid storage class for function ‘ulp_mapper_tfc_mtr_stats_hndl_set’
1803 | ulp_mapper_tfc_mtr_stats_hndl_set(struct bnxt_ulp_mapper_parms *parms __rte_unused,
| ^~~~~~~~~~~~~~~~~~~~~~~~~~~~~~~~~
../drivers/net/bnxt/tf_ulp/ulp_mapper_tfc.c:1821:1: error: invalid storage class for function ‘ulp_mapper_tfc_mtr_stats_hndl_get’
1821 | ulp_mapper_tfc_mtr_stats_hndl_get(uint32_t mtr_id, uint64_t *stats_hndl)
| ^~~~~~~~~~~~~~~~~~~~~~~~~~~~~~~~~
../drivers/net/bnxt/tf_ulp/ulp_mapper_tfc.c:1837:1: error: invalid storage class for function ‘ulp_mapper_tfc_mtr_stats_hndl_del’
1837 | ulp_mapper_tfc_mtr_stats_hndl_del(uint32_t mtr_id)
| ^~~~~~~~~~~~~~~~~~~~~~~~~~~~~~~~~
../drivers/net/bnxt/tf_ulp/ulp_mapper_tfc.c:1852:1: error: invalid storage class for function ‘ulp_mapper_tfc_glb_idx_tbl_alloc’
1852 | ulp_mapper_tfc_glb_idx_tbl_alloc(struct bnxt_ulp_context *ulp_ctx,
| ^~~~~~~~~~~~~~~~~~~~~~~~~~~~~~~~
../drivers/net/bnxt/tf_ulp/ulp_mapper_tfc.c:1892:1: error: invalid storage class for function ‘ulp_mapper_tfc_glb_idx_tbl_free’
1892 | ulp_mapper_tfc_glb_idx_tbl_free(struct bnxt_ulp_context *ulp_ctx,
| ^~~~~~~~~~~~~~~~~~~~~~~~~~~~~~~
../drivers/net/bnxt/tf_ulp/ulp_mapper_tfc.c:1926:1: error: invalid storage class for function ‘ulp_mapper_tfc_tcam_prio_update’
1926 | ulp_mapper_tfc_tcam_prio_update(struct bnxt_ulp_mapper_parms *parms,
| ^~~~~~~~~~~~~~~~~~~~~~~~~~~~~~~
../drivers/net/bnxt/tf_ulp/ulp_mapper_tfc.c:1990:1: error: expected declaration or statement at end of input
1990 | };
| ^
../drivers/net/bnxt/tf_ulp/ulp_mapper_tfc.c:1961:34: error: unused variable ‘ulp_mapper_tfc_core_ops’ [-Werror=unused-variable]
1961 | const struct ulp_mapper_core_ops ulp_mapper_tfc_core_ops = {
| ^~~~~~~~~~~~~~~~~~~~~~~
At top level:
../drivers/net/bnxt/tf_ulp/ulp_mapper_tfc.c:457:1: error: ‘ulp_mapper_tfc_em_tbl_process’ defined but not used [-Werror=unused-function]
457 | ulp_mapper_tfc_em_tbl_process(struct bnxt_ulp_mapper_parms *parms,
| ^~~~~~~~~~~~~~~~~~~~~~~~~~~~~
cc1: all warnings being treated as errors
[1331/3700] Compiling C object drivers/libtmp_rte_net_bnxt.a.p/net_bnxt_tf_ulp_ulp_fc_mgr_tfc.c.o
[1332/3700] Compiling C object drivers/libtmp_rte_net_bnxt.a.p/net_bnxt_tf_ulp_ulp_fc_mgr_tf.c.o
[1333/3700] Compiling C object drivers/libtmp_rte_net_bnxt.a.p/net_bnxt_tf_core_bitalloc.c.o
[1334/3700] Compiling C object drivers/libtmp_rte_net_bnxt.a.p/net_bnxt_tf_ulp_ulp_sc_mgr.c.o
[1335/3700] Compiling C object drivers/libtmp_rte_net_bnxt.a.p/net_bnxt_tf_ulp_ulp_mapper_tf.c.o
[1336/3700] Compiling C object drivers/libtmp_rte_net_bnxt.a.p/net_bnxt_tf_ulp_ulp_alloc_tbl.c.o
[1337/3700] Compiling C object drivers/libtmp_rte_net_bnxt.a.p/net_bnxt_tf_ulp_bnxt_ulp_tfc.c.o
[1338/3700] Compiling C object drivers/libtmp_rte_net_bnxt.a.p/net_bnxt_tf_ulp_ulp_mapper.c.o
[1339/3700] Compiling C object drivers/libtmp_rte_net_bnxt.a.p/net_bnxt_tf_ulp_ulp_rte_parser.c.o
ninja: build stopped
*Build Failed #7:
OS: RHEL96-64
Target: x86_64-native-linuxapp-clang
FAILED: drivers/libtmp_rte_net_bnxt.a.p/net_bnxt_tf_ulp_ulp_mapper_tfc.c.o
clang -Idrivers/libtmp_rte_net_bnxt.a.p -Idrivers -I../drivers -Idrivers/net/bnxt -I../drivers/net/bnxt -Idrivers/net/bnxt/tf_ulp -I../drivers/net/bnxt/tf_ulp -Idrivers/net/bnxt/tf_ulp/generic_templates -I../drivers/net/bnxt/tf_ulp/generic_templates -Idrivers/net/bnxt/tf_core -I../drivers/net/bnxt/tf_core -Idrivers/net/bnxt/tf_core/v3 -I../drivers/net/bnxt/tf_core/v3 -Idrivers/net/bnxt/hcapi/cfa -I../drivers/net/bnxt/hcapi/cfa -Idrivers/net/bnxt/hcapi/cfa_v3 -I../drivers/net/bnxt/hcapi/cfa_v3 -I../drivers/net/bnxt/hcapi/cfa_v3/include -I../drivers/net/bnxt/hcapi/cfa_v3/include/platform/dpdk -I../drivers/net/bnxt/hcapi/cfa_v3/bld/p70 -I../drivers/net/bnxt/hcapi/cfa_v3/bld/p70/host -I../drivers/net/bnxt/hcapi/cfa_v3/bld/include -I../drivers/net/bnxt/hcapi/cfa_v3/bld/include/host -I../drivers/net/bnxt/hcapi/cfa_v3/bld/include/p70 -I../drivers/net/bnxt/hcapi/cfa_v3/mm/include -I../drivers/net/bnxt/hcapi/cfa_v3/tim/include -I../drivers/net/bnxt/hcapi/cfa_v3/tpm/include -Ilib/ethdev -I../lib/ethdev -Ilib/eal/common -I../lib/eal/common -I. -I.. -Iconfig -I../config -Ilib/eal/include -I../lib/eal/include -Ilib/eal/linux/include -I../lib/eal/linux/include -Ilib/eal/x86/include -I../lib/eal/x86/include -I../kernel/linux -Ilib/eal -I../lib/eal -Ilib/kvargs -I../lib/kvargs -Ilib/log -I../lib/log -Ilib/metrics -I../lib/metrics -Ilib/telemetry -I../lib/telemetry -Ilib/argparse -I../lib/argparse -Ilib/net -I../lib/net -Ilib/mbuf -I../lib/mbuf -Ilib/mempool -I../lib/mempool -Ilib/ring -I../lib/ring -Ilib/meter -I../lib/meter -Idrivers/bus/pci -I../drivers/bus/pci -I../drivers/bus/pci/linux -Ilib/pci -I../lib/pci -Idrivers/bus/vdev -I../drivers/bus/vdev -Ilib/hash -I../lib/hash -Ilib/rcu -I../lib/rcu -fcolor-diagnostics -D_FILE_OFFSET_BITS=64 -Wall -Winvalid-pch -Wextra -Werror -std=c11 -O3 -include rte_config.h -Wvla -Wcast-qual -Wcomma -Wdeprecated -Wformat -Wformat-nonliteral -Wformat-security -Wmissing-declarations -Wmissing-prototypes -Wnested-externs -Wold-style-definition -Wpointer-arith -Wshadow -Wsign-compare -Wstrict-prototypes -Wundef -Wwrite-strings -Wno-missing-field-initializers -D_GNU_SOURCE -fPIC -march=native -mrtm -DALLOW_EXPERIMENTAL_API -DALLOW_INTERNAL_API -Wno-format-truncation -Wno-address-of-packed-member -Wno-vla -Wno-shadow -DBNXT_TF_APP_ID=0 -DSUPPORT_CFA_HW_P70=1 -DCFA_BLD_PRINT_OBJ=1 -DRTE_COMPONENT_CLASS=pmd_net -DRTE_COMPONENT_NAME=bnxt -DRTE_LOG_DEFAULT_LOGTYPE=pmd.net.bnxt -MD -MQ drivers/libtmp_rte_net_bnxt.a.p/net_bnxt_tf_ulp_ulp_mapper_tfc.c.o -MF drivers/libtmp_rte_net_bnxt.a.p/net_bnxt_tf_ulp_ulp_mapper_tfc.c.o.d -o drivers/libtmp_rte_net_bnxt.a.p/net_bnxt_tf_ulp_ulp_mapper_tfc.c.o -c ../drivers/net/bnxt/tf_ulp/ulp_mapper_tfc.c
../drivers/net/bnxt/tf_ulp/ulp_mapper_tfc.c:662:1: error: function definition is not allowed here
662 | {
| ^
../drivers/net/bnxt/tf_ulp/ulp_mapper_tfc.c:710:1: error: function definition is not allowed here
710 | {
| ^
../drivers/net/bnxt/tf_ulp/ulp_mapper_tfc.c:733:1: error: function definition is not allowed here
733 | {
| ^
../drivers/net/bnxt/tf_ulp/ulp_mapper_tfc.c:1031:1: error: function definition is not allowed here
1031 | {
| ^
../drivers/net/bnxt/tf_ulp/ulp_mapper_tfc.c:1063:1: error: function definition is not allowed here
1063 | {
| ^
../drivers/net/bnxt/tf_ulp/ulp_mapper_tfc.c:1371:1: error: function definition is not allowed here
1371 | {
| ^
../drivers/net/bnxt/tf_ulp/ulp_mapper_tfc.c:1420:1: error: function definition is not allowed here
1420 | {
| ^
../drivers/net/bnxt/tf_ulp/ulp_mapper_tfc.c:1525:1: error: function definition is not allowed here
1525 | {
| ^
../drivers/net/bnxt/tf_ulp/ulp_mapper_tfc.c:1558:1: error: function definition is not allowed here
1558 | {
| ^
../drivers/net/bnxt/tf_ulp/ulp_mapper_tfc.c:1595:1: error: function definition is not allowed here
1595 | {
| ^
../drivers/net/bnxt/tf_ulp/ulp_mapper_tfc.c:1633:1: error: function definition is not allowed here
1633 | {
| ^
../drivers/net/bnxt/tf_ulp/ulp_mapper_tfc.c:1667:1: error: function definition is not allowed here
1667 | {
| ^
../drivers/net/bnxt/tf_ulp/ulp_mapper_tfc.c:1699:1: error: function definition is not allowed here
1699 | {
| ^
../drivers/net/bnxt/tf_ulp/ulp_mapper_tfc.c:1720:1: error: function definition is not allowed here
1720 | {
| ^
../drivers/net/bnxt/tf_ulp/ulp_mapper_tfc.c:1757:1: error: function definition is not allowed here
1757 | {
| ^
../drivers/net/bnxt/tf_ulp/ulp_mapper_tfc.c:1767:1: error: function definition is not allowed here
1767 | {
| ^
../drivers/net/bnxt/tf_ulp/ulp_mapper_tfc.c:1798:1: error: function definition is not allowed here
1798 | {
| ^
../drivers/net/bnxt/tf_ulp/ulp_mapper_tfc.c:1805:1: error: function definition is not allowed here
1805 | {
| ^
../drivers/net/bnxt/tf_ulp/ulp_mapper_tfc.c:1822:1: error: function definition is not allowed here
1822 | {
| ^
fatal error: too many errors emitted, stopping now [-ferror-limit=]
20 errors generated.
[1328/3659] Linking target drivers/librte_net_bnx2x.so.27.0
[1329/3659] Compiling C object drivers/libtmp_rte_net_bnxt.a.p/net_bnxt_tf_ulp_ulp_mapper.c.o
[1330/3659] Compiling C object drivers/libtmp_rte_net_bnxt.a.p/net_bnxt_tf_ulp_ulp_fc_mgr_tfc.c.o
[1331/3659] Compiling C object drivers/libtmp_rte_net_bnxt.a.p/net_bnxt_tf_ulp_ulp_sc_mgr.c.o
[1332/3659] Compiling C object drivers/libtmp_rte_net_bnxt.a.p/net_bnxt_tf_ulp_bnxt_ulp_tf.c.o
[1333/3659] Compiling C object drivers/libtmp_rte_net_bnxt.a.p/net_bnxt_tf_ulp_bnxt_ulp_tfc.c.o
[1334/3659] Compiling C object drivers/libtmp_rte_net_bnxt.a.p/net_bnxt_tf_ulp_ulp_fc_mgr_tf.c.o
[1335/3659] Compiling C object drivers/libtmp_rte_net_bnxt.a.p/net_bnxt_tf_ulp_ulp_mapper_tf.c.o
[1336/3659] Compiling C object drivers/libtmp_rte_net_bnxt.a.p/net_bnxt_tf_ulp_ulp_rte_parser.c.o
ninja: build stopped
*Build Failed #8:
OS: RHEL96-64
Target: x86_64-native-linuxapp-gcc+shared
FAILED: drivers/libtmp_rte_net_bnxt.a.p/net_bnxt_tf_ulp_ulp_mapper_tfc.c.o
gcc -Idrivers/libtmp_rte_net_bnxt.a.p -Idrivers -I../drivers -Idrivers/net/bnxt -I../drivers/net/bnxt -Idrivers/net/bnxt/tf_ulp -I../drivers/net/bnxt/tf_ulp -Idrivers/net/bnxt/tf_ulp/generic_templates -I../drivers/net/bnxt/tf_ulp/generic_templates -Idrivers/net/bnxt/tf_core -I../drivers/net/bnxt/tf_core -Idrivers/net/bnxt/tf_core/v3 -I../drivers/net/bnxt/tf_core/v3 -Idrivers/net/bnxt/hcapi/cfa -I../drivers/net/bnxt/hcapi/cfa -Idrivers/net/bnxt/hcapi/cfa_v3 -I../drivers/net/bnxt/hcapi/cfa_v3 -I../drivers/net/bnxt/hcapi/cfa_v3/include -I../drivers/net/bnxt/hcapi/cfa_v3/include/platform/dpdk -I../drivers/net/bnxt/hcapi/cfa_v3/bld/p70 -I../drivers/net/bnxt/hcapi/cfa_v3/bld/p70/host -I../drivers/net/bnxt/hcapi/cfa_v3/bld/include -I../drivers/net/bnxt/hcapi/cfa_v3/bld/include/host -I../drivers/net/bnxt/hcapi/cfa_v3/bld/include/p70 -I../drivers/net/bnxt/hcapi/cfa_v3/mm/include -I../drivers/net/bnxt/hcapi/cfa_v3/tim/include -I../drivers/net/bnxt/hcapi/cfa_v3/tpm/include -Ilib/ethdev -I../lib/ethdev -Ilib/eal/common -I../lib/eal/common -I. -I.. -Iconfig -I../config -Ilib/eal/include -I../lib/eal/include -Ilib/eal/linux/include -I../lib/eal/linux/include -Ilib/eal/x86/include -I../lib/eal/x86/include -I../kernel/linux -Ilib/eal -I../lib/eal -Ilib/kvargs -I../lib/kvargs -Ilib/log -I../lib/log -Ilib/metrics -I../lib/metrics -Ilib/telemetry -I../lib/telemetry -Ilib/argparse -I../lib/argparse -Ilib/net -I../lib/net -Ilib/mbuf -I../lib/mbuf -Ilib/mempool -I../lib/mempool -Ilib/ring -I../lib/ring -Ilib/meter -I../lib/meter -Idrivers/bus/pci -I../drivers/bus/pci -I../drivers/bus/pci/linux -Ilib/pci -I../lib/pci -Idrivers/bus/vdev -I../drivers/bus/vdev -Ilib/hash -I../lib/hash -Ilib/rcu -I../lib/rcu -fdiagnostics-color=always -D_FILE_OFFSET_BITS=64 -Wall -Winvalid-pch -Wextra -Werror -std=c11 -O3 -include rte_config.h -Wvla -Wcast-qual -Wdeprecated -Wformat -Wformat-nonliteral -Wformat-security -Wmissing-declarations -Wmissing-prototypes -Wnested-externs -Wold-style-definition -Wpointer-arith -Wshadow -Wsign-compare -Wstrict-prototypes -Wundef -Wwrite-strings -Wno-packed-not-aligned -Wno-missing-field-initializers -D_GNU_SOURCE -fPIC -march=native -mrtm -DALLOW_EXPERIMENTAL_API -DALLOW_INTERNAL_API -Wno-format-truncation -Wno-address-of-packed-member -Wno-vla -Wno-shadow -DBNXT_TF_APP_ID=0 -DSUPPORT_CFA_HW_P70=1 -DCFA_BLD_PRINT_OBJ=1 -DRTE_COMPONENT_CLASS=pmd_net -DRTE_COMPONENT_NAME=bnxt -DRTE_LOG_DEFAULT_LOGTYPE=pmd.net.bnxt -MD -MQ drivers/libtmp_rte_net_bnxt.a.p/net_bnxt_tf_ulp_ulp_mapper_tfc.c.o -MF drivers/libtmp_rte_net_bnxt.a.p/net_bnxt_tf_ulp_ulp_mapper_tfc.c.o.d -o drivers/libtmp_rte_net_bnxt.a.p/net_bnxt_tf_ulp_ulp_mapper_tfc.c.o -c ../drivers/net/bnxt/tf_ulp/ulp_mapper_tfc.c
../drivers/net/bnxt/tf_ulp/ulp_mapper_tfc.c: In function ‘ulp_mapper_tfc_em_tbl_process’:
../drivers/net/bnxt/tf_ulp/ulp_mapper_tfc.c:659:1: error: invalid storage class for function ‘ulp_mapper_tfc_em_entry_free’
659 | ulp_mapper_tfc_em_entry_free(struct bnxt_ulp_context *ulp,
| ^~~~~~~~~~~~~~~~~~~~~~~~~~~~
../drivers/net/bnxt/tf_ulp/ulp_mapper_tfc.c:708:1: error: invalid storage class for function ‘ulp_mapper_tfc_dyn_blob_size_get’
708 | ulp_mapper_tfc_dyn_blob_size_get(struct bnxt_ulp_mapper_parms *mparms,
| ^~~~~~~~~~~~~~~~~~~~~~~~~~~~~~~~
../drivers/net/bnxt/tf_ulp/ulp_mapper_tfc.c:731:1: error: invalid storage class for function ‘ulp_mapper_tfc_index_tbl_process’
731 | ulp_mapper_tfc_index_tbl_process(struct bnxt_ulp_mapper_parms *parms,
| ^~~~~~~~~~~~~~~~~~~~~~~~~~~~~~~~
../drivers/net/bnxt/tf_ulp/ulp_mapper_tfc.c:1029:1: error: invalid storage class for function ‘ulp_mapper_tfc_index_entry_free’
1029 | ulp_mapper_tfc_index_entry_free(struct bnxt_ulp_context *ulp_ctx,
| ^~~~~~~~~~~~~~~~~~~~~~~~~~~~~~~
../drivers/net/bnxt/tf_ulp/ulp_mapper_tfc.c:1060:1: error: invalid storage class for function ‘ulp_mapper_tfc_cmm_tbl_process’
1060 | ulp_mapper_tfc_cmm_tbl_process(struct bnxt_ulp_mapper_parms *parms,
| ^~~~~~~~~~~~~~~~~~~~~~~~~~~~~~
../drivers/net/bnxt/tf_ulp/ulp_mapper_tfc.c:1368:1: error: invalid storage class for function ‘ulp_mapper_tfc_cmm_entry_free’
1368 | ulp_mapper_tfc_cmm_entry_free(struct bnxt_ulp_context *ulp_ctx,
| ^~~~~~~~~~~~~~~~~~~~~~~~~~~~~
../drivers/net/bnxt/tf_ulp/ulp_mapper_tfc.c:1418:1: error: invalid storage class for function ‘ulp_mapper_tfc_if_tbl_process’
1418 | ulp_mapper_tfc_if_tbl_process(struct bnxt_ulp_mapper_parms *parms,
| ^~~~~~~~~~~~~~~~~~~~~~~~~~~~~
../drivers/net/bnxt/tf_ulp/ulp_mapper_tfc.c:1519:1: error: invalid storage class for function ‘ulp_mapper_tfc_ident_alloc’
1519 | ulp_mapper_tfc_ident_alloc(struct bnxt_ulp_context *ulp_ctx,
| ^~~~~~~~~~~~~~~~~~~~~~~~~~
../drivers/net/bnxt/tf_ulp/ulp_mapper_tfc.c:1556:1: error: invalid storage class for function ‘ulp_mapper_tfc_ident_free’
1556 | ulp_mapper_tfc_ident_free(struct bnxt_ulp_context *ulp_ctx,
| ^~~~~~~~~~~~~~~~~~~~~~~~~
../drivers/net/bnxt/tf_ulp/ulp_mapper_tfc.c:1589:1: error: invalid storage class for function ‘ulp_mapper_tfc_global_ident_alloc’
1589 | ulp_mapper_tfc_global_ident_alloc(struct bnxt_ulp_context *ulp_ctx,
| ^~~~~~~~~~~~~~~~~~~~~~~~~~~~~~~~~
../drivers/net/bnxt/tf_ulp/ulp_mapper_tfc.c:1631:1: error: invalid storage class for function ‘ulp_mapper_tfc_global_ident_free’
1631 | ulp_mapper_tfc_global_ident_free(struct bnxt_ulp_context *ulp_ctx,
| ^~~~~~~~~~~~~~~~~~~~~~~~~~~~~~~~
../drivers/net/bnxt/tf_ulp/ulp_mapper_tfc.c:1665:1: error: invalid storage class for function ‘ulp_mapper_tfc_tcam_entry_free’
1665 | ulp_mapper_tfc_tcam_entry_free(struct bnxt_ulp_context *ulp,
| ^~~~~~~~~~~~~~~~~~~~~~~~~~~~~~
../drivers/net/bnxt/tf_ulp/ulp_mapper_tfc.c:1695:1: error: invalid storage class for function ‘ulp_mapper_tfc_dyn_tbl_type_get’
1695 | ulp_mapper_tfc_dyn_tbl_type_get(struct bnxt_ulp_mapper_parms *parm __rte_unused,
| ^~~~~~~~~~~~~~~~~~~~~~~~~~~~~~~
../drivers/net/bnxt/tf_ulp/ulp_mapper_tfc.c:1715:1: error: invalid storage class for function ‘ulp_mapper_tfc_index_tbl_alloc_process’
1715 | ulp_mapper_tfc_index_tbl_alloc_process(struct bnxt_ulp_context *ulp,
| ^~~~~~~~~~~~~~~~~~~~~~~~~~~~~~~~~~~~~~
../drivers/net/bnxt/tf_ulp/ulp_mapper_tfc.c:1753:1: error: invalid storage class for function ‘ulp_mapper_tfc_app_glb_resource_info_init’
1753 | ulp_mapper_tfc_app_glb_resource_info_init(struct bnxt_ulp_context
| ^~~~~~~~~~~~~~~~~~~~~~~~~~~~~~~~~~~~~~~~~
../drivers/net/bnxt/tf_ulp/ulp_mapper_tfc.c:1763:1: error: invalid storage class for function ‘ulp_mapper_tfc_handle_to_offset’
1763 | ulp_mapper_tfc_handle_to_offset(struct bnxt_ulp_mapper_parms *parms __rte_unused,
| ^~~~~~~~~~~~~~~~~~~~~~~~~~~~~~~
../drivers/net/bnxt/tf_ulp/ulp_mapper_tfc.c:1797:1: error: invalid storage class for function ‘ulp_mapper_tfc_mpc_batch_start’
1797 | ulp_mapper_tfc_mpc_batch_start(struct tfc_mpc_batch_info_t *batch_info)
| ^~~~~~~~~~~~~~~~~~~~~~~~~~~~~~
../drivers/net/bnxt/tf_ulp/ulp_mapper_tfc.c:1803:1: error: invalid storage class for function ‘ulp_mapper_tfc_mtr_stats_hndl_set’
1803 | ulp_mapper_tfc_mtr_stats_hndl_set(struct bnxt_ulp_mapper_parms *parms __rte_unused,
| ^~~~~~~~~~~~~~~~~~~~~~~~~~~~~~~~~
../drivers/net/bnxt/tf_ulp/ulp_mapper_tfc.c:1821:1: error: invalid storage class for function ‘ulp_mapper_tfc_mtr_stats_hndl_get’
1821 | ulp_mapper_tfc_mtr_stats_hndl_get(uint32_t mtr_id, uint64_t *stats_hndl)
| ^~~~~~~~~~~~~~~~~~~~~~~~~~~~~~~~~
../drivers/net/bnxt/tf_ulp/ulp_mapper_tfc.c:1837:1: error: invalid storage class for function ‘ulp_mapper_tfc_mtr_stats_hndl_del’
1837 | ulp_mapper_tfc_mtr_stats_hndl_del(uint32_t mtr_id)
| ^~~~~~~~~~~~~~~~~~~~~~~~~~~~~~~~~
../drivers/net/bnxt/tf_ulp/ulp_mapper_tfc.c:1852:1: error: invalid storage class for function ‘ulp_mapper_tfc_glb_idx_tbl_alloc’
1852 | ulp_mapper_tfc_glb_idx_tbl_alloc(struct bnxt_ulp_context *ulp_ctx,
| ^~~~~~~~~~~~~~~~~~~~~~~~~~~~~~~~
../drivers/net/bnxt/tf_ulp/ulp_mapper_tfc.c:1892:1: error: invalid storage class for function ‘ulp_mapper_tfc_glb_idx_tbl_free’
1892 | ulp_mapper_tfc_glb_idx_tbl_free(struct bnxt_ulp_context *ulp_ctx,
| ^~~~~~~~~~~~~~~~~~~~~~~~~~~~~~~
../drivers/net/bnxt/tf_ulp/ulp_mapper_tfc.c:1926:1: error: invalid storage class for function ‘ulp_mapper_tfc_tcam_prio_update’
1926 | ulp_mapper_tfc_tcam_prio_update(struct bnxt_ulp_mapper_parms *parms,
| ^~~~~~~~~~~~~~~~~~~~~~~~~~~~~~~
../drivers/net/bnxt/tf_ulp/ulp_mapper_tfc.c:1990:1: error: expected declaration or statement at end of input
1990 | };
| ^
../drivers/net/bnxt/tf_ulp/ulp_mapper_tfc.c:1961:34: error: unused variable ‘ulp_mapper_tfc_core_ops’ [-Werror=unused-variable]
1961 | const struct ulp_mapper_core_ops ulp_mapper_tfc_core_ops = {
| ^~~~~~~~~~~~~~~~~~~~~~~
At top level:
../drivers/net/bnxt/tf_ulp/ulp_mapper_tfc.c:457:1: error: ‘ulp_mapper_tfc_em_tbl_process’ defined but not used [-Werror=unused-function]
457 | ulp_mapper_tfc_em_tbl_process(struct bnxt_ulp_mapper_parms *parms,
| ^~~~~~~~~~~~~~~~~~~~~~~~~~~~~
cc1: all warnings being treated as errors
[1344/3539] Compiling C object drivers/libtmp_rte_net_bnxt.a.p/net_bnxt_tf_ulp_ulp_fc_mgr_tfc.c.o
[1345/3539] Compiling C object drivers/libtmp_rte_net_bnxt.a.p/net_bnxt_tf_ulp_ulp_fc_mgr_tf.c.o
[1346/3539] Compiling C object drivers/libtmp_rte_net_bnxt.a.p/net_bnxt_tf_ulp_ulp_sc_mgr.c.o
[1347/3539] Compiling C object drivers/libtmp_rte_net_bnxt.a.p/net_bnxt_tf_ulp_ulp_alloc_tbl.c.o
[1348/3539] Compiling C object drivers/libtmp_rte_net_bnxt.a.p/net_bnxt_tf_core_bitalloc.c.o
[1349/3539] Compiling C object drivers/libtmp_rte_net_bnxt.a.p/net_bnxt_tf_ulp_ulp_mapper_tf.c.o
[1350/3539] Compiling C object drivers/libtmp_rte_net_bnxt.a.p/net_bnxt_tf_ulp_bnxt_ulp_tfc.c.o
[1351/3539] Compiling C object drivers/libtmp_rte_net_bnxt.a.p/net_bnxt_tf_ulp_ulp_mapper.c.o
[1352/3539] Compiling C object drivers/libtmp_rte_net_bnxt.a.p/net_bnxt_tf_ulp_ulp_rte_parser.c.o
ninja: build stopped
*Build Failed #9:
OS: RHEL96-64
Target: x86_64-native-linuxapp-gcc+debug
FAILED: drivers/libtmp_rte_net_bnxt.a.p/net_bnxt_tf_ulp_ulp_mapper_tfc.c.o
gcc -Idrivers/libtmp_rte_net_bnxt.a.p -Idrivers -I../drivers -Idrivers/net/bnxt -I../drivers/net/bnxt -Idrivers/net/bnxt/tf_ulp -I../drivers/net/bnxt/tf_ulp -Idrivers/net/bnxt/tf_ulp/generic_templates -I../drivers/net/bnxt/tf_ulp/generic_templates -Idrivers/net/bnxt/tf_core -I../drivers/net/bnxt/tf_core -Idrivers/net/bnxt/tf_core/v3 -I../drivers/net/bnxt/tf_core/v3 -Idrivers/net/bnxt/hcapi/cfa -I../drivers/net/bnxt/hcapi/cfa -Idrivers/net/bnxt/hcapi/cfa_v3 -I../drivers/net/bnxt/hcapi/cfa_v3 -I../drivers/net/bnxt/hcapi/cfa_v3/include -I../drivers/net/bnxt/hcapi/cfa_v3/include/platform/dpdk -I../drivers/net/bnxt/hcapi/cfa_v3/bld/p70 -I../drivers/net/bnxt/hcapi/cfa_v3/bld/p70/host -I../drivers/net/bnxt/hcapi/cfa_v3/bld/include -I../drivers/net/bnxt/hcapi/cfa_v3/bld/include/host -I../drivers/net/bnxt/hcapi/cfa_v3/bld/include/p70 -I../drivers/net/bnxt/hcapi/cfa_v3/mm/include -I../drivers/net/bnxt/hcapi/cfa_v3/tim/include -I../drivers/net/bnxt/hcapi/cfa_v3/tpm/include -Ilib/ethdev -I../lib/ethdev -Ilib/eal/common -I../lib/eal/common -I. -I.. -Iconfig -I../config -Ilib/eal/include -I../lib/eal/include -Ilib/eal/linux/include -I../lib/eal/linux/include -Ilib/eal/x86/include -I../lib/eal/x86/include -I../kernel/linux -Ilib/eal -I../lib/eal -Ilib/kvargs -I../lib/kvargs -Ilib/log -I../lib/log -Ilib/metrics -I../lib/metrics -Ilib/telemetry -I../lib/telemetry -Ilib/argparse -I../lib/argparse -Ilib/net -I../lib/net -Ilib/mbuf -I../lib/mbuf -Ilib/mempool -I../lib/mempool -Ilib/ring -I../lib/ring -Ilib/meter -I../lib/meter -Idrivers/bus/pci -I../drivers/bus/pci -I../drivers/bus/pci/linux -Ilib/pci -I../lib/pci -Idrivers/bus/vdev -I../drivers/bus/vdev -Ilib/hash -I../lib/hash -Ilib/rcu -I../lib/rcu -fdiagnostics-color=always -D_FILE_OFFSET_BITS=64 -Wall -Winvalid-pch -Wextra -Werror -std=c11 -O2 -g -include rte_config.h -Wvla -Wcast-qual -Wdeprecated -Wformat -Wformat-nonliteral -Wformat-security -Wmissing-declarations -Wmissing-prototypes -Wnested-externs -Wold-style-definition -Wpointer-arith -Wshadow -Wsign-compare -Wstrict-prototypes -Wundef -Wwrite-strings -Wno-packed-not-aligned -Wno-missing-field-initializers -D_GNU_SOURCE -fPIC -march=native -mrtm -DALLOW_EXPERIMENTAL_API -DALLOW_INTERNAL_API -Wno-format-truncation -Wno-address-of-packed-member -Wno-vla -Wno-shadow -DBNXT_TF_APP_ID=0 -DSUPPORT_CFA_HW_P70=1 -DCFA_BLD_PRINT_OBJ=1 -DRTE_COMPONENT_CLASS=pmd_net -DRTE_COMPONENT_NAME=bnxt -DRTE_LOG_DEFAULT_LOGTYPE=pmd.net.bnxt -MD -MQ drivers/libtmp_rte_net_bnxt.a.p/net_bnxt_tf_ulp_ulp_mapper_tfc.c.o -MF drivers/libtmp_rte_net_bnxt.a.p/net_bnxt_tf_ulp_ulp_mapper_tfc.c.o.d -o drivers/libtmp_rte_net_bnxt.a.p/net_bnxt_tf_ulp_ulp_mapper_tfc.c.o -c ../drivers/net/bnxt/tf_ulp/ulp_mapper_tfc.c
../drivers/net/bnxt/tf_ulp/ulp_mapper_tfc.c: In function ‘ulp_mapper_tfc_em_tbl_process’:
../drivers/net/bnxt/tf_ulp/ulp_mapper_tfc.c:659:1: error: invalid storage class for function ‘ulp_mapper_tfc_em_entry_free’
659 | ulp_mapper_tfc_em_entry_free(struct bnxt_ulp_context *ulp,
| ^~~~~~~~~~~~~~~~~~~~~~~~~~~~
../drivers/net/bnxt/tf_ulp/ulp_mapper_tfc.c:708:1: error: invalid storage class for function ‘ulp_mapper_tfc_dyn_blob_size_get’
708 | ulp_mapper_tfc_dyn_blob_size_get(struct bnxt_ulp_mapper_parms *mparms,
| ^~~~~~~~~~~~~~~~~~~~~~~~~~~~~~~~
../drivers/net/bnxt/tf_ulp/ulp_mapper_tfc.c:731:1: error: invalid storage class for function ‘ulp_mapper_tfc_index_tbl_process’
731 | ulp_mapper_tfc_index_tbl_process(struct bnxt_ulp_mapper_parms *parms,
| ^~~~~~~~~~~~~~~~~~~~~~~~~~~~~~~~
../drivers/net/bnxt/tf_ulp/ulp_mapper_tfc.c:1029:1: error: invalid storage class for function ‘ulp_mapper_tfc_index_entry_free’
1029 | ulp_mapper_tfc_index_entry_free(struct bnxt_ulp_context *ulp_ctx,
| ^~~~~~~~~~~~~~~~~~~~~~~~~~~~~~~
../drivers/net/bnxt/tf_ulp/ulp_mapper_tfc.c:1060:1: error: invalid storage class for function ‘ulp_mapper_tfc_cmm_tbl_process’
1060 | ulp_mapper_tfc_cmm_tbl_process(struct bnxt_ulp_mapper_parms *parms,
| ^~~~~~~~~~~~~~~~~~~~~~~~~~~~~~
../drivers/net/bnxt/tf_ulp/ulp_mapper_tfc.c:1368:1: error: invalid storage class for function ‘ulp_mapper_tfc_cmm_entry_free’
1368 | ulp_mapper_tfc_cmm_entry_free(struct bnxt_ulp_context *ulp_ctx,
| ^~~~~~~~~~~~~~~~~~~~~~~~~~~~~
../drivers/net/bnxt/tf_ulp/ulp_mapper_tfc.c:1418:1: error: invalid storage class for function ‘ulp_mapper_tfc_if_tbl_process’
1418 | ulp_mapper_tfc_if_tbl_process(struct bnxt_ulp_mapper_parms *parms,
| ^~~~~~~~~~~~~~~~~~~~~~~~~~~~~
../drivers/net/bnxt/tf_ulp/ulp_mapper_tfc.c:1519:1: error: invalid storage class for function ‘ulp_mapper_tfc_ident_alloc’
1519 | ulp_mapper_tfc_ident_alloc(struct bnxt_ulp_context *ulp_ctx,
| ^~~~~~~~~~~~~~~~~~~~~~~~~~
../drivers/net/bnxt/tf_ulp/ulp_mapper_tfc.c:1556:1: error: invalid storage class for function ‘ulp_mapper_tfc_ident_free’
1556 | ulp_mapper_tfc_ident_free(struct bnxt_ulp_context *ulp_ctx,
| ^~~~~~~~~~~~~~~~~~~~~~~~~
../drivers/net/bnxt/tf_ulp/ulp_mapper_tfc.c:1589:1: error: invalid storage class for function ‘ulp_mapper_tfc_global_ident_alloc’
1589 | ulp_mapper_tfc_global_ident_alloc(struct bnxt_ulp_context *ulp_ctx,
| ^~~~~~~~~~~~~~~~~~~~~~~~~~~~~~~~~
../drivers/net/bnxt/tf_ulp/ulp_mapper_tfc.c:1631:1: error: invalid storage class for function ‘ulp_mapper_tfc_global_ident_free’
1631 | ulp_mapper_tfc_global_ident_free(struct bnxt_ulp_context *ulp_ctx,
| ^~~~~~~~~~~~~~~~~~~~~~~~~~~~~~~~
../drivers/net/bnxt/tf_ulp/ulp_mapper_tfc.c:1665:1: error: invalid storage class for function ‘ulp_mapper_tfc_tcam_entry_free’
1665 | ulp_mapper_tfc_tcam_entry_free(struct bnxt_ulp_context *ulp,
| ^~~~~~~~~~~~~~~~~~~~~~~~~~~~~~
../drivers/net/bnxt/tf_ulp/ulp_mapper_tfc.c:1695:1: error: invalid storage class for function ‘ulp_mapper_tfc_dyn_tbl_type_get’
1695 | ulp_mapper_tfc_dyn_tbl_type_get(struct bnxt_ulp_mapper_parms *parm __rte_unused,
| ^~~~~~~~~~~~~~~~~~~~~~~~~~~~~~~
../drivers/net/bnxt/tf_ulp/ulp_mapper_tfc.c:1715:1: error: invalid storage class for function ‘ulp_mapper_tfc_index_tbl_alloc_process’
1715 | ulp_mapper_tfc_index_tbl_alloc_process(struct bnxt_ulp_context *ulp,
| ^~~~~~~~~~~~~~~~~~~~~~~~~~~~~~~~~~~~~~
../drivers/net/bnxt/tf_ulp/ulp_mapper_tfc.c:1753:1: error: invalid storage class for function ‘ulp_mapper_tfc_app_glb_resource_info_init’
1753 | ulp_mapper_tfc_app_glb_resource_info_init(struct bnxt_ulp_context
| ^~~~~~~~~~~~~~~~~~~~~~~~~~~~~~~~~~~~~~~~~
../drivers/net/bnxt/tf_ulp/ulp_mapper_tfc.c:1763:1: error: invalid storage class for function ‘ulp_mapper_tfc_handle_to_offset’
1763 | ulp_mapper_tfc_handle_to_offset(struct bnxt_ulp_mapper_parms *parms __rte_unused,
| ^~~~~~~~~~~~~~~~~~~~~~~~~~~~~~~
../drivers/net/bnxt/tf_ulp/ulp_mapper_tfc.c:1797:1: error: invalid storage class for function ‘ulp_mapper_tfc_mpc_batch_start’
1797 | ulp_mapper_tfc_mpc_batch_start(struct tfc_mpc_batch_info_t *batch_info)
| ^~~~~~~~~~~~~~~~~~~~~~~~~~~~~~
../drivers/net/bnxt/tf_ulp/ulp_mapper_tfc.c:1803:1: error: invalid storage class for function ‘ulp_mapper_tfc_mtr_stats_hndl_set’
1803 | ulp_mapper_tfc_mtr_stats_hndl_set(struct bnxt_ulp_mapper_parms *parms __rte_unused,
| ^~~~~~~~~~~~~~~~~~~~~~~~~~~~~~~~~
../drivers/net/bnxt/tf_ulp/ulp_mapper_tfc.c:1821:1: error: invalid storage class for function ‘ulp_mapper_tfc_mtr_stats_hndl_get’
1821 | ulp_mapper_tfc_mtr_stats_hndl_get(uint32_t mtr_id, uint64_t *stats_hndl)
| ^~~~~~~~~~~~~~~~~~~~~~~~~~~~~~~~~
../drivers/net/bnxt/tf_ulp/ulp_mapper_tfc.c:1837:1: error: invalid storage class for function ‘ulp_mapper_tfc_mtr_stats_hndl_del’
1837 | ulp_mapper_tfc_mtr_stats_hndl_del(uint32_t mtr_id)
| ^~~~~~~~~~~~~~~~~~~~~~~~~~~~~~~~~
../drivers/net/bnxt/tf_ulp/ulp_mapper_tfc.c:1852:1: error: invalid storage class for function ‘ulp_mapper_tfc_glb_idx_tbl_alloc’
1852 | ulp_mapper_tfc_glb_idx_tbl_alloc(struct bnxt_ulp_context *ulp_ctx,
| ^~~~~~~~~~~~~~~~~~~~~~~~~~~~~~~~
../drivers/net/bnxt/tf_ulp/ulp_mapper_tfc.c:1892:1: error: invalid storage class for function ‘ulp_mapper_tfc_glb_idx_tbl_free’
1892 | ulp_mapper_tfc_glb_idx_tbl_free(struct bnxt_ulp_context *ulp_ctx,
| ^~~~~~~~~~~~~~~~~~~~~~~~~~~~~~~
../drivers/net/bnxt/tf_ulp/ulp_mapper_tfc.c:1926:1: error: invalid storage class for function ‘ulp_mapper_tfc_tcam_prio_update’
1926 | ulp_mapper_tfc_tcam_prio_update(struct bnxt_ulp_mapper_parms *parms,
| ^~~~~~~~~~~~~~~~~~~~~~~~~~~~~~~
../drivers/net/bnxt/tf_ulp/ulp_mapper_tfc.c:1990:1: error: expected declaration or statement at end of input
1990 | };
| ^
../drivers/net/bnxt/tf_ulp/ulp_mapper_tfc.c:1961:34: error: unused variable ‘ulp_mapper_tfc_core_ops’ [-Werror=unused-variable]
1961 | const struct ulp_mapper_core_ops ulp_mapper_tfc_core_ops = {
| ^~~~~~~~~~~~~~~~~~~~~~~
At top level:
../drivers/net/bnxt/tf_ulp/ulp_mapper_tfc.c:457:1: error: ‘ulp_mapper_tfc_em_tbl_process’ defined but not used [-Werror=unused-function]
457 | ulp_mapper_tfc_em_tbl_process(struct bnxt_ulp_mapper_parms *parms,
| ^~~~~~~~~~~~~~~~~~~~~~~~~~~~~
cc1: all warnings being treated as errors
[1329/3700] Compiling C object drivers/libtmp_rte_net_bnxt.a.p/net_bnxt_tf_ulp_ulp_fc_mgr_tfc.c.o
[1330/3700] Compiling C object drivers/libtmp_rte_net_bnxt.a.p/net_bnxt_tf_ulp_ulp_sc_mgr.c.o
[1331/3700] Compiling C object drivers/libtmp_rte_net_bnxt.a.p/net_bnxt_tf_ulp_ulp_mapper_tf.c.o
[1332/3700] Compiling C object drivers/libtmp_rte_net_bnxt.a.p/net_bnxt_tf_ulp_bnxt_ulp_tfc.c.o
[1333/3700] Compiling C object drivers/libtmp_rte_net_bnxt.a.p/net_bnxt_tf_ulp_ulp_fc_mgr_tf.c.o
[1334/3700] Compiling C object drivers/libtmp_rte_net_bnxt.a.p/net_bnxt_tf_ulp_ulp_alloc_tbl.c.o
[1335/3700] Compiling C object drivers/libtmp_rte_net_bnxt.a.p/net_bnxt_bnxt_hwrm.c.o
[1336/3700] Compiling C object drivers/libtmp_rte_net_bnxt.a.p/net_bnxt_tf_ulp_ulp_mapper.c.o
[1337/3700] Compiling C object drivers/libtmp_rte_net_bnxt.a.p/net_bnxt_tf_ulp_ulp_rte_parser.c.o
ninja: build stopped
*Build Failed #10:
OS: SUSE16-64
Target: x86_64-native-linuxapp-clang
FAILED: drivers/libtmp_rte_net_bnxt.a.p/net_bnxt_tf_ulp_ulp_mapper_tfc.c.o
clang -Idrivers/libtmp_rte_net_bnxt.a.p -Idrivers -I../drivers -Idrivers/net/bnxt -I../drivers/net/bnxt -Idrivers/net/bnxt/tf_ulp -I../drivers/net/bnxt/tf_ulp -Idrivers/net/bnxt/tf_ulp/generic_templates -I../drivers/net/bnxt/tf_ulp/generic_templates -Idrivers/net/bnxt/tf_core -I../drivers/net/bnxt/tf_core -Idrivers/net/bnxt/tf_core/v3 -I../drivers/net/bnxt/tf_core/v3 -Idrivers/net/bnxt/hcapi/cfa -I../drivers/net/bnxt/hcapi/cfa -Idrivers/net/bnxt/hcapi/cfa_v3 -I../drivers/net/bnxt/hcapi/cfa_v3 -I../drivers/net/bnxt/hcapi/cfa_v3/include -I../drivers/net/bnxt/hcapi/cfa_v3/include/platform/dpdk -I../drivers/net/bnxt/hcapi/cfa_v3/bld/p70 -I../drivers/net/bnxt/hcapi/cfa_v3/bld/p70/host -I../drivers/net/bnxt/hcapi/cfa_v3/bld/include -I../drivers/net/bnxt/hcapi/cfa_v3/bld/include/host -I../drivers/net/bnxt/hcapi/cfa_v3/bld/include/p70 -I../drivers/net/bnxt/hcapi/cfa_v3/mm/include -I../drivers/net/bnxt/hcapi/cfa_v3/tim/include -I../drivers/net/bnxt/hcapi/cfa_v3/tpm/include -Ilib/ethdev -I../lib/ethdev -Ilib/eal/common -I../lib/eal/common -I. -I.. -Iconfig -I../config -Ilib/eal/include -I../lib/eal/include -Ilib/eal/linux/include -I../lib/eal/linux/include -Ilib/eal/x86/include -I../lib/eal/x86/include -I../kernel/linux -Ilib/eal -I../lib/eal -Ilib/kvargs -I../lib/kvargs -Ilib/log -I../lib/log -Ilib/metrics -I../lib/metrics -Ilib/telemetry -I../lib/telemetry -Ilib/argparse -I../lib/argparse -Ilib/net -I../lib/net -Ilib/mbuf -I../lib/mbuf -Ilib/mempool -I../lib/mempool -Ilib/ring -I../lib/ring -Ilib/meter -I../lib/meter -Idrivers/bus/pci -I../drivers/bus/pci -I../drivers/bus/pci/linux -Ilib/pci -I../lib/pci -Idrivers/bus/vdev -I../drivers/bus/vdev -Ilib/hash -I../lib/hash -Ilib/rcu -I../lib/rcu -fdiagnostics-color=always -D_FILE_OFFSET_BITS=64 -Wall -Winvalid-pch -Wextra -Werror -std=c11 -O3 -include rte_config.h -Wvla -Wcast-qual -Wcomma -Wdeprecated -Wformat -Wformat-nonliteral -Wformat-security -Wmissing-declarations -Wmissing-prototypes -Wnested-externs -Wold-style-definition -Wpointer-arith -Wshadow -Wsign-compare -Wstrict-prototypes -Wundef -Wwrite-strings -Wno-missing-field-initializers -D_GNU_SOURCE -fPIC -march=native -mrtm -DALLOW_EXPERIMENTAL_API -DALLOW_INTERNAL_API -Wno-format-truncation -Wno-address-of-packed-member -Wno-vla -Wno-shadow -DBNXT_TF_APP_ID=0 -DSUPPORT_CFA_HW_P70=1 -DCFA_BLD_PRINT_OBJ=1 -DRTE_COMPONENT_CLASS=pmd_net -DRTE_COMPONENT_NAME=bnxt -DRTE_LOG_DEFAULT_LOGTYPE=pmd.net.bnxt -MD -MQ drivers/libtmp_rte_net_bnxt.a.p/net_bnxt_tf_ulp_ulp_mapper_tfc.c.o -MF drivers/libtmp_rte_net_bnxt.a.p/net_bnxt_tf_ulp_ulp_mapper_tfc.c.o.d -o drivers/libtmp_rte_net_bnxt.a.p/net_bnxt_tf_ulp_ulp_mapper_tfc.c.o -c ../drivers/net/bnxt/tf_ulp/ulp_mapper_tfc.c
../drivers/net/bnxt/tf_ulp/ulp_mapper_tfc.c:662:1: error: function definition is not allowed here
662 | {
| ^
../drivers/net/bnxt/tf_ulp/ulp_mapper_tfc.c:710:1: error: function definition is not allowed here
710 | {
| ^
../drivers/net/bnxt/tf_ulp/ulp_mapper_tfc.c:733:1: error: function definition is not allowed here
733 | {
| ^
../drivers/net/bnxt/tf_ulp/ulp_mapper_tfc.c:1031:1: error: function definition is not allowed here
1031 | {
| ^
../drivers/net/bnxt/tf_ulp/ulp_mapper_tfc.c:1063:1: error: function definition is not allowed here
1063 | {
| ^
../drivers/net/bnxt/tf_ulp/ulp_mapper_tfc.c:1371:1: error: function definition is not allowed here
1371 | {
| ^
../drivers/net/bnxt/tf_ulp/ulp_mapper_tfc.c:1420:1: error: function definition is not allowed here
1420 | {
| ^
../drivers/net/bnxt/tf_ulp/ulp_mapper_tfc.c:1525:1: error: function definition is not allowed here
1525 | {
| ^
../drivers/net/bnxt/tf_ulp/ulp_mapper_tfc.c:1558:1: error: function definition is not allowed here
1558 | {
| ^
../drivers/net/bnxt/tf_ulp/ulp_mapper_tfc.c:1595:1: error: function definition is not allowed here
1595 | {
| ^
../drivers/net/bnxt/tf_ulp/ulp_mapper_tfc.c:1633:1: error: function definition is not allowed here
1633 | {
| ^
../drivers/net/bnxt/tf_ulp/ulp_mapper_tfc.c:1667:1: error: function definition is not allowed here
1667 | {
| ^
../drivers/net/bnxt/tf_ulp/ulp_mapper_tfc.c:1699:1: error: function definition is not allowed here
1699 | {
| ^
../drivers/net/bnxt/tf_ulp/ulp_mapper_tfc.c:1720:1: error: function definition is not allowed here
1720 | {
| ^
../drivers/net/bnxt/tf_ulp/ulp_mapper_tfc.c:1757:1: error: function definition is not allowed here
1757 | {
| ^
../drivers/net/bnxt/tf_ulp/ulp_mapper_tfc.c:1767:1: error: function definition is not allowed here
1767 | {
| ^
../drivers/net/bnxt/tf_ulp/ulp_mapper_tfc.c:1798:1: error: function definition is not allowed here
1798 | {
| ^
../drivers/net/bnxt/tf_ulp/ulp_mapper_tfc.c:1805:1: error: function definition is not allowed here
1805 | {
| ^
../drivers/net/bnxt/tf_ulp/ulp_mapper_tfc.c:1822:1: error: function definition is not allowed here
1822 | {
| ^
fatal error: too many errors emitted, stopping now [-ferror-limit=]
20 errors generated.
[1329/3682] Compiling C object drivers/libtmp_rte_net_bnxt.a.p/net_bnxt_tf_ulp_ulp_fc_mgr_tfc.c.o
[1330/3682] Compiling C object drivers/libtmp_rte_net_bnxt.a.p/net_bnxt_tf_ulp_ulp_mapper.c.o
[1331/3682] Compiling C object drivers/libtmp_rte_net_bnxt.a.p/net_bnxt_tf_ulp_ulp_sc_mgr.c.o
[1332/3682] Compiling C object drivers/libtmp_rte_net_bnxt.a.p/net_bnxt_tf_ulp_bnxt_ulp_tf.c.o
[1333/3682] Compiling C object drivers/libtmp_rte_net_bnxt.a.p/net_bnxt_tf_ulp_ulp_mapper_tf.c.o
[1334/3682] Compiling C object drivers/libtmp_rte_net_bnxt.a.p/net_bnxt_tf_ulp_bnxt_ulp_tfc.c.o
[1335/3682] Compiling C object drivers/libtmp_rte_net_bnxt.a.p/net_bnxt_tf_ulp_ulp_fc_mgr_tf.c.o
[1336/3682] Compiling C object drivers/libtmp_rte_net_bnxt.a.p/net_bnxt_tf_ulp_ulp_alloc_tbl.c.o
[1337/3682] Compiling C object drivers/libtmp_rte_net_bnxt.a.p/net_bnxt_tf_ulp_ulp_rte_parser.c.o
ninja: build stopped
*Build Failed #11:
OS: SUSE16-64
Target: x86_64-native-linuxapp-gcc
FAILED: drivers/libtmp_rte_net_bnxt.a.p/net_bnxt_tf_ulp_ulp_mapper_tfc.c.o
gcc -Idrivers/libtmp_rte_net_bnxt.a.p -Idrivers -I../drivers -Idrivers/net/bnxt -I../drivers/net/bnxt -Idrivers/net/bnxt/tf_ulp -I../drivers/net/bnxt/tf_ulp -Idrivers/net/bnxt/tf_ulp/generic_templates -I../drivers/net/bnxt/tf_ulp/generic_templates -Idrivers/net/bnxt/tf_core -I../drivers/net/bnxt/tf_core -Idrivers/net/bnxt/tf_core/v3 -I../drivers/net/bnxt/tf_core/v3 -Idrivers/net/bnxt/hcapi/cfa -I../drivers/net/bnxt/hcapi/cfa -Idrivers/net/bnxt/hcapi/cfa_v3 -I../drivers/net/bnxt/hcapi/cfa_v3 -I../drivers/net/bnxt/hcapi/cfa_v3/include -I../drivers/net/bnxt/hcapi/cfa_v3/include/platform/dpdk -I../drivers/net/bnxt/hcapi/cfa_v3/bld/p70 -I../drivers/net/bnxt/hcapi/cfa_v3/bld/p70/host -I../drivers/net/bnxt/hcapi/cfa_v3/bld/include -I../drivers/net/bnxt/hcapi/cfa_v3/bld/include/host -I../drivers/net/bnxt/hcapi/cfa_v3/bld/include/p70 -I../drivers/net/bnxt/hcapi/cfa_v3/mm/include -I../drivers/net/bnxt/hcapi/cfa_v3/tim/include -I../drivers/net/bnxt/hcapi/cfa_v3/tpm/include -Ilib/ethdev -I../lib/ethdev -Ilib/eal/common -I../lib/eal/common -I. -I.. -Iconfig -I../config -Ilib/eal/include -I../lib/eal/include -Ilib/eal/linux/include -I../lib/eal/linux/include -Ilib/eal/x86/include -I../lib/eal/x86/include -I../kernel/linux -Ilib/eal -I../lib/eal -Ilib/kvargs -I../lib/kvargs -Ilib/log -I../lib/log -Ilib/metrics -I../lib/metrics -Ilib/telemetry -I../lib/telemetry -Ilib/argparse -I../lib/argparse -Ilib/net -I../lib/net -Ilib/mbuf -I../lib/mbuf -Ilib/mempool -I../lib/mempool -Ilib/ring -I../lib/ring -Ilib/meter -I../lib/meter -Idrivers/bus/pci -I../drivers/bus/pci -I../drivers/bus/pci/linux -Ilib/pci -I../lib/pci -Idrivers/bus/vdev -I../drivers/bus/vdev -Ilib/hash -I../lib/hash -Ilib/rcu -I../lib/rcu -fdiagnostics-color=always -D_FILE_OFFSET_BITS=64 -Wall -Winvalid-pch -Wextra -Werror -std=c11 -O3 -include rte_config.h -Wvla -Wcast-qual -Wdeprecated -Wformat -Wformat-nonliteral -Wformat-security -Wmissing-declarations -Wmissing-prototypes -Wnested-externs -Wold-style-definition -Wpointer-arith -Wshadow -Wsign-compare -Wstrict-prototypes -Wundef -Wwrite-strings -Wno-packed-not-aligned -Wno-missing-field-initializers -fzero-init-padding-bits=all -D_GNU_SOURCE -fPIC -march=native -mrtm -DALLOW_EXPERIMENTAL_API -DALLOW_INTERNAL_API -Wno-format-truncation -Wno-address-of-packed-member -Wno-vla -Wno-shadow -DBNXT_TF_APP_ID=0 -DSUPPORT_CFA_HW_P70=1 -DCFA_BLD_PRINT_OBJ=1 -DRTE_COMPONENT_CLASS=pmd_net -DRTE_COMPONENT_NAME=bnxt -DRTE_LOG_DEFAULT_LOGTYPE=pmd.net.bnxt -MD -MQ drivers/libtmp_rte_net_bnxt.a.p/net_bnxt_tf_ulp_ulp_mapper_tfc.c.o -MF drivers/libtmp_rte_net_bnxt.a.p/net_bnxt_tf_ulp_ulp_mapper_tfc.c.o.d -o drivers/libtmp_rte_net_bnxt.a.p/net_bnxt_tf_ulp_ulp_mapper_tfc.c.o -c ../drivers/net/bnxt/tf_ulp/ulp_mapper_tfc.c
../drivers/net/bnxt/tf_ulp/ulp_mapper_tfc.c: In function ‘ulp_mapper_tfc_em_tbl_process’:
../drivers/net/bnxt/tf_ulp/ulp_mapper_tfc.c:659:1: error: invalid storage class for function ‘ulp_mapper_tfc_em_entry_free’
659 | ulp_mapper_tfc_em_entry_free(struct bnxt_ulp_context *ulp,
| ^~~~~~~~~~~~~~~~~~~~~~~~~~~~
../drivers/net/bnxt/tf_ulp/ulp_mapper_tfc.c:708:1: error: invalid storage class for function ‘ulp_mapper_tfc_dyn_blob_size_get’
708 | ulp_mapper_tfc_dyn_blob_size_get(struct bnxt_ulp_mapper_parms *mparms,
| ^~~~~~~~~~~~~~~~~~~~~~~~~~~~~~~~
../drivers/net/bnxt/tf_ulp/ulp_mapper_tfc.c:731:1: error: invalid storage class for function ‘ulp_mapper_tfc_index_tbl_process’
731 | ulp_mapper_tfc_index_tbl_process(struct bnxt_ulp_mapper_parms *parms,
| ^~~~~~~~~~~~~~~~~~~~~~~~~~~~~~~~
../drivers/net/bnxt/tf_ulp/ulp_mapper_tfc.c:1029:1: error: invalid storage class for function ‘ulp_mapper_tfc_index_entry_free’
1029 | ulp_mapper_tfc_index_entry_free(struct bnxt_ulp_context *ulp_ctx,
| ^~~~~~~~~~~~~~~~~~~~~~~~~~~~~~~
../drivers/net/bnxt/tf_ulp/ulp_mapper_tfc.c:1060:1: error: invalid storage class for function ‘ulp_mapper_tfc_cmm_tbl_process’
1060 | ulp_mapper_tfc_cmm_tbl_process(struct bnxt_ulp_mapper_parms *parms,
| ^~~~~~~~~~~~~~~~~~~~~~~~~~~~~~
../drivers/net/bnxt/tf_ulp/ulp_mapper_tfc.c:1368:1: error: invalid storage class for function ‘ulp_mapper_tfc_cmm_entry_free’
1368 | ulp_mapper_tfc_cmm_entry_free(struct bnxt_ulp_context *ulp_ctx,
| ^~~~~~~~~~~~~~~~~~~~~~~~~~~~~
../drivers/net/bnxt/tf_ulp/ulp_mapper_tfc.c:1418:1: error: invalid storage class for function ‘ulp_mapper_tfc_if_tbl_process’
1418 | ulp_mapper_tfc_if_tbl_process(struct bnxt_ulp_mapper_parms *parms,
| ^~~~~~~~~~~~~~~~~~~~~~~~~~~~~
../drivers/net/bnxt/tf_ulp/ulp_mapper_tfc.c:1519:1: error: invalid storage class for function ‘ulp_mapper_tfc_ident_alloc’
1519 | ulp_mapper_tfc_ident_alloc(struct bnxt_ulp_context *ulp_ctx,
| ^~~~~~~~~~~~~~~~~~~~~~~~~~
../drivers/net/bnxt/tf_ulp/ulp_mapper_tfc.c:1556:1: error: invalid storage class for function ‘ulp_mapper_tfc_ident_free’
1556 | ulp_mapper_tfc_ident_free(struct bnxt_ulp_context *ulp_ctx,
| ^~~~~~~~~~~~~~~~~~~~~~~~~
../drivers/net/bnxt/tf_ulp/ulp_mapper_tfc.c:1589:1: error: invalid storage class for function ‘ulp_mapper_tfc_global_ident_alloc’
1589 | ulp_mapper_tfc_global_ident_alloc(struct bnxt_ulp_context *ulp_ctx,
| ^~~~~~~~~~~~~~~~~~~~~~~~~~~~~~~~~
../drivers/net/bnxt/tf_ulp/ulp_mapper_tfc.c:1631:1: error: invalid storage class for function ‘ulp_mapper_tfc_global_ident_free’
1631 | ulp_mapper_tfc_global_ident_free(struct bnxt_ulp_context *ulp_ctx,
| ^~~~~~~~~~~~~~~~~~~~~~~~~~~~~~~~
../drivers/net/bnxt/tf_ulp/ulp_mapper_tfc.c:1665:1: error: invalid storage class for function ‘ulp_mapper_tfc_tcam_entry_free’
1665 | ulp_mapper_tfc_tcam_entry_free(struct bnxt_ulp_context *ulp,
| ^~~~~~~~~~~~~~~~~~~~~~~~~~~~~~
../drivers/net/bnxt/tf_ulp/ulp_mapper_tfc.c:1695:1: error: invalid storage class for function ‘ulp_mapper_tfc_dyn_tbl_type_get’
1695 | ulp_mapper_tfc_dyn_tbl_type_get(struct bnxt_ulp_mapper_parms *parm __rte_unused,
| ^~~~~~~~~~~~~~~~~~~~~~~~~~~~~~~
../drivers/net/bnxt/tf_ulp/ulp_mapper_tfc.c:1715:1: error: invalid storage class for function ‘ulp_mapper_tfc_index_tbl_alloc_process’
1715 | ulp_mapper_tfc_index_tbl_alloc_process(struct bnxt_ulp_context *ulp,
| ^~~~~~~~~~~~~~~~~~~~~~~~~~~~~~~~~~~~~~
../drivers/net/bnxt/tf_ulp/ulp_mapper_tfc.c:1753:1: error: invalid storage class for function ‘ulp_mapper_tfc_app_glb_resource_info_init’
1753 | ulp_mapper_tfc_app_glb_resource_info_init(struct bnxt_ulp_context
| ^~~~~~~~~~~~~~~~~~~~~~~~~~~~~~~~~~~~~~~~~
../drivers/net/bnxt/tf_ulp/ulp_mapper_tfc.c:1763:1: error: invalid storage class for function ‘ulp_mapper_tfc_handle_to_offset’
1763 | ulp_mapper_tfc_handle_to_offset(struct bnxt_ulp_mapper_parms *parms __rte_unused,
| ^~~~~~~~~~~~~~~~~~~~~~~~~~~~~~~
../drivers/net/bnxt/tf_ulp/ulp_mapper_tfc.c:1797:1: error: invalid storage class for function ‘ulp_mapper_tfc_mpc_batch_start’
1797 | ulp_mapper_tfc_mpc_batch_start(struct tfc_mpc_batch_info_t *batch_info)
| ^~~~~~~~~~~~~~~~~~~~~~~~~~~~~~
../drivers/net/bnxt/tf_ulp/ulp_mapper_tfc.c:1803:1: error: invalid storage class for function ‘ulp_mapper_tfc_mtr_stats_hndl_set’
1803 | ulp_mapper_tfc_mtr_stats_hndl_set(struct bnxt_ulp_mapper_parms *parms __rte_unused,
| ^~~~~~~~~~~~~~~~~~~~~~~~~~~~~~~~~
../drivers/net/bnxt/tf_ulp/ulp_mapper_tfc.c:1821:1: error: invalid storage class for function ‘ulp_mapper_tfc_mtr_stats_hndl_get’
1821 | ulp_mapper_tfc_mtr_stats_hndl_get(uint32_t mtr_id, uint64_t *stats_hndl)
| ^~~~~~~~~~~~~~~~~~~~~~~~~~~~~~~~~
../drivers/net/bnxt/tf_ulp/ulp_mapper_tfc.c:1837:1: error: invalid storage class for function ‘ulp_mapper_tfc_mtr_stats_hndl_del’
1837 | ulp_mapper_tfc_mtr_stats_hndl_del(uint32_t mtr_id)
| ^~~~~~~~~~~~~~~~~~~~~~~~~~~~~~~~~
../drivers/net/bnxt/tf_ulp/ulp_mapper_tfc.c:1852:1: error: invalid storage class for function ‘ulp_mapper_tfc_glb_idx_tbl_alloc’
1852 | ulp_mapper_tfc_glb_idx_tbl_alloc(struct bnxt_ulp_context *ulp_ctx,
| ^~~~~~~~~~~~~~~~~~~~~~~~~~~~~~~~
../drivers/net/bnxt/tf_ulp/ulp_mapper_tfc.c:1892:1: error: invalid storage class for function ‘ulp_mapper_tfc_glb_idx_tbl_free’
1892 | ulp_mapper_tfc_glb_idx_tbl_free(struct bnxt_ulp_context *ulp_ctx,
| ^~~~~~~~~~~~~~~~~~~~~~~~~~~~~~~
../drivers/net/bnxt/tf_ulp/ulp_mapper_tfc.c:1926:1: error: invalid storage class for function ‘ulp_mapper_tfc_tcam_prio_update’
1926 | ulp_mapper_tfc_tcam_prio_update(struct bnxt_ulp_mapper_parms *parms,
| ^~~~~~~~~~~~~~~~~~~~~~~~~~~~~~~
../drivers/net/bnxt/tf_ulp/ulp_mapper_tfc.c:1990:1: error: expected declaration or statement at end of input
1990 | };
| ^
../drivers/net/bnxt/tf_ulp/ulp_mapper_tfc.c:1961:34: error: unused variable ‘ulp_mapper_tfc_core_ops’ [-Werror=unused-variable]
1961 | const struct ulp_mapper_core_ops ulp_mapper_tfc_core_ops = {
| ^~~~~~~~~~~~~~~~~~~~~~~
../drivers/net/bnxt/tf_ulp/ulp_mapper_tfc.c: At top level:
../drivers/net/bnxt/tf_ulp/ulp_mapper_tfc.c:457:1: error: ‘ulp_mapper_tfc_em_tbl_process’ defined but not used [-Werror=unused-function]
457 | ulp_mapper_tfc_em_tbl_process(struct bnxt_ulp_mapper_parms *parms,
| ^~~~~~~~~~~~~~~~~~~~~~~~~~~~~
cc1: all warnings being treated as errors
[1326/3682] Compiling C object drivers/libtmp_rte_net_bnxt.a.p/net_bnxt_tf_ulp_bnxt_ulp_tf.c.o
[1327/3682] Compiling C object drivers/libtmp_rte_net_bnxt.a.p/net_bnxt_tf_ulp_ulp_mapper_tf.c.o
[1328/3682] Compiling C object drivers/libtmp_rte_net_bnxt.a.p/net_bnxt_tf_ulp_ulp_fc_mgr_tfc.c.o
[1329/3682] Compiling C object drivers/libtmp_rte_net_bnxt.a.p/net_bnxt_tf_ulp_ulp_sc_mgr.c.o
[1330/3682] Compiling C object drivers/libtmp_rte_net_bnxt.a.p/net_bnxt_tf_ulp_ulp_fc_mgr_tf.c.o
[1331/3682] Compiling C object drivers/libtmp_rte_net_bnxt.a.p/net_bnxt_tf_ulp_ulp_alloc_tbl.c.o
[1332/3682] Compiling C object drivers/libtmp_rte_net_bnxt.a.p/net_bnxt_tf_ulp_bnxt_ulp_tfc.c.o
[1333/3682] Compiling C object drivers/libtmp_rte_net_bnxt.a.p/net_bnxt_tf_ulp_ulp_mapper.c.o
[1334/3682] Compiling C object drivers/libtmp_rte_net_bnxt.a.p/net_bnxt_tf_ulp_ulp_rte_parser.c.o
ninja: build stopped
*Build Failed #12:
OS: AzureLinux3.0-64
Target: x86_64-native-linuxapp-gcc
FAILED: drivers/libtmp_rte_net_bnxt.a.p/net_bnxt_tf_ulp_ulp_mapper_tfc.c.o
gcc -Idrivers/libtmp_rte_net_bnxt.a.p -Idrivers -I../drivers -Idrivers/net/bnxt -I../drivers/net/bnxt -Idrivers/net/bnxt/tf_ulp -I../drivers/net/bnxt/tf_ulp -Idrivers/net/bnxt/tf_ulp/generic_templates -I../drivers/net/bnxt/tf_ulp/generic_templates -Idrivers/net/bnxt/tf_core -I../drivers/net/bnxt/tf_core -Idrivers/net/bnxt/tf_core/v3 -I../drivers/net/bnxt/tf_core/v3 -Idrivers/net/bnxt/hcapi/cfa -I../drivers/net/bnxt/hcapi/cfa -Idrivers/net/bnxt/hcapi/cfa_v3 -I../drivers/net/bnxt/hcapi/cfa_v3 -I../drivers/net/bnxt/hcapi/cfa_v3/include -I../drivers/net/bnxt/hcapi/cfa_v3/include/platform/dpdk -I../drivers/net/bnxt/hcapi/cfa_v3/bld/p70 -I../drivers/net/bnxt/hcapi/cfa_v3/bld/p70/host -I../drivers/net/bnxt/hcapi/cfa_v3/bld/include -I../drivers/net/bnxt/hcapi/cfa_v3/bld/include/host -I../drivers/net/bnxt/hcapi/cfa_v3/bld/include/p70 -I../drivers/net/bnxt/hcapi/cfa_v3/mm/include -I../drivers/net/bnxt/hcapi/cfa_v3/tim/include -I../drivers/net/bnxt/hcapi/cfa_v3/tpm/include -Ilib/ethdev -I../lib/ethdev -Ilib/eal/common -I../lib/eal/common -I. -I.. -Iconfig -I../config -Ilib/eal/include -I../lib/eal/include -Ilib/eal/linux/include -I../lib/eal/linux/include -Ilib/eal/x86/include -I../lib/eal/x86/include -I../kernel/linux -Ilib/eal -I../lib/eal -Ilib/kvargs -I../lib/kvargs -Ilib/log -I../lib/log -Ilib/metrics -I../lib/metrics -Ilib/telemetry -I../lib/telemetry -Ilib/argparse -I../lib/argparse -Ilib/net -I../lib/net -Ilib/mbuf -I../lib/mbuf -Ilib/mempool -I../lib/mempool -Ilib/ring -I../lib/ring -Ilib/meter -I../lib/meter -Idrivers/bus/pci -I../drivers/bus/pci -I../drivers/bus/pci/linux -Ilib/pci -I../lib/pci -Idrivers/bus/vdev -I../drivers/bus/vdev -Ilib/hash -I../lib/hash -Ilib/rcu -I../lib/rcu -fdiagnostics-color=always -D_FILE_OFFSET_BITS=64 -Wall -Winvalid-pch -Wextra -Werror -std=c11 -O3 -include rte_config.h -Wvla -Wcast-qual -Wdeprecated -Wformat -Wformat-nonliteral -Wformat-security -Wmissing-declarations -Wmissing-prototypes -Wnested-externs -Wold-style-definition -Wpointer-arith -Wshadow -Wsign-compare -Wstrict-prototypes -Wundef -Wwrite-strings -Wno-packed-not-aligned -Wno-missing-field-initializers -D_GNU_SOURCE -fPIC -march=native -mrtm -DALLOW_EXPERIMENTAL_API -DALLOW_INTERNAL_API -Wno-format-truncation -Wno-address-of-packed-member -Wno-vla -Wno-shadow -DBNXT_TF_APP_ID=0 -DSUPPORT_CFA_HW_P70=1 -DCFA_BLD_PRINT_OBJ=1 -DRTE_COMPONENT_CLASS=pmd_net -DRTE_COMPONENT_NAME=bnxt -DRTE_LOG_DEFAULT_LOGTYPE=pmd.net.bnxt -MD -MQ drivers/libtmp_rte_net_bnxt.a.p/net_bnxt_tf_ulp_ulp_mapper_tfc.c.o -MF drivers/libtmp_rte_net_bnxt.a.p/net_bnxt_tf_ulp_ulp_mapper_tfc.c.o.d -o drivers/libtmp_rte_net_bnxt.a.p/net_bnxt_tf_ulp_ulp_mapper_tfc.c.o -c ../drivers/net/bnxt/tf_ulp/ulp_mapper_tfc.c
../drivers/net/bnxt/tf_ulp/ulp_mapper_tfc.c: In function ‘ulp_mapper_tfc_em_tbl_process’:
../drivers/net/bnxt/tf_ulp/ulp_mapper_tfc.c:659:1: error: invalid storage class for function ‘ulp_mapper_tfc_em_entry_free’
659 | ulp_mapper_tfc_em_entry_free(struct bnxt_ulp_context *ulp,
| ^~~~~~~~~~~~~~~~~~~~~~~~~~~~
../drivers/net/bnxt/tf_ulp/ulp_mapper_tfc.c:708:1: error: invalid storage class for function ‘ulp_mapper_tfc_dyn_blob_size_get’
708 | ulp_mapper_tfc_dyn_blob_size_get(struct bnxt_ulp_mapper_parms *mparms,
| ^~~~~~~~~~~~~~~~~~~~~~~~~~~~~~~~
../drivers/net/bnxt/tf_ulp/ulp_mapper_tfc.c:731:1: error: invalid storage class for function ‘ulp_mapper_tfc_index_tbl_process’
731 | ulp_mapper_tfc_index_tbl_process(struct bnxt_ulp_mapper_parms *parms,
| ^~~~~~~~~~~~~~~~~~~~~~~~~~~~~~~~
../drivers/net/bnxt/tf_ulp/ulp_mapper_tfc.c:1029:1: error: invalid storage class for function ‘ulp_mapper_tfc_index_entry_free’
1029 | ulp_mapper_tfc_index_entry_free(struct bnxt_ulp_context *ulp_ctx,
| ^~~~~~~~~~~~~~~~~~~~~~~~~~~~~~~
../drivers/net/bnxt/tf_ulp/ulp_mapper_tfc.c:1060:1: error: invalid storage class for function ‘ulp_mapper_tfc_cmm_tbl_process’
1060 | ulp_mapper_tfc_cmm_tbl_process(struct bnxt_ulp_mapper_parms *parms,
| ^~~~~~~~~~~~~~~~~~~~~~~~~~~~~~
../drivers/net/bnxt/tf_ulp/ulp_mapper_tfc.c:1368:1: error: invalid storage class for function ‘ulp_mapper_tfc_cmm_entry_free’
1368 | ulp_mapper_tfc_cmm_entry_free(struct bnxt_ulp_context *ulp_ctx,
| ^~~~~~~~~~~~~~~~~~~~~~~~~~~~~
../drivers/net/bnxt/tf_ulp/ulp_mapper_tfc.c:1418:1: error: invalid storage class for function ‘ulp_mapper_tfc_if_tbl_process’
1418 | ulp_mapper_tfc_if_tbl_process(struct bnxt_ulp_mapper_parms *parms,
| ^~~~~~~~~~~~~~~~~~~~~~~~~~~~~
../drivers/net/bnxt/tf_ulp/ulp_mapper_tfc.c:1519:1: error: invalid storage class for function ‘ulp_mapper_tfc_ident_alloc’
1519 | ulp_mapper_tfc_ident_alloc(struct bnxt_ulp_context *ulp_ctx,
| ^~~~~~~~~~~~~~~~~~~~~~~~~~
../drivers/net/bnxt/tf_ulp/ulp_mapper_tfc.c:1556:1: error: invalid storage class for function ‘ulp_mapper_tfc_ident_free’
1556 | ulp_mapper_tfc_ident_free(struct bnxt_ulp_context *ulp_ctx,
| ^~~~~~~~~~~~~~~~~~~~~~~~~
../drivers/net/bnxt/tf_ulp/ulp_mapper_tfc.c:1589:1: error: invalid storage class for function ‘ulp_mapper_tfc_global_ident_alloc’
1589 | ulp_mapper_tfc_global_ident_alloc(struct bnxt_ulp_context *ulp_ctx,
| ^~~~~~~~~~~~~~~~~~~~~~~~~~~~~~~~~
../drivers/net/bnxt/tf_ulp/ulp_mapper_tfc.c:1631:1: error: invalid storage class for function ‘ulp_mapper_tfc_global_ident_free’
1631 | ulp_mapper_tfc_global_ident_free(struct bnxt_ulp_context *ulp_ctx,
| ^~~~~~~~~~~~~~~~~~~~~~~~~~~~~~~~
../drivers/net/bnxt/tf_ulp/ulp_mapper_tfc.c:1665:1: error: invalid storage class for function ‘ulp_mapper_tfc_tcam_entry_free’
1665 | ulp_mapper_tfc_tcam_entry_free(struct bnxt_ulp_context *ulp,
| ^~~~~~~~~~~~~~~~~~~~~~~~~~~~~~
../drivers/net/bnxt/tf_ulp/ulp_mapper_tfc.c:1695:1: error: invalid storage class for function ‘ulp_mapper_tfc_dyn_tbl_type_get’
1695 | ulp_mapper_tfc_dyn_tbl_type_get(struct bnxt_ulp_mapper_parms *parm __rte_unused,
| ^~~~~~~~~~~~~~~~~~~~~~~~~~~~~~~
../drivers/net/bnxt/tf_ulp/ulp_mapper_tfc.c:1715:1: error: invalid storage class for function ‘ulp_mapper_tfc_index_tbl_alloc_process’
1715 | ulp_mapper_tfc_index_tbl_alloc_process(struct bnxt_ulp_context *ulp,
| ^~~~~~~~~~~~~~~~~~~~~~~~~~~~~~~~~~~~~~
../drivers/net/bnxt/tf_ulp/ulp_mapper_tfc.c:1753:1: error: invalid storage class for function ‘ulp_mapper_tfc_app_glb_resource_info_init’
1753 | ulp_mapper_tfc_app_glb_resource_info_init(struct bnxt_ulp_context
| ^~~~~~~~~~~~~~~~~~~~~~~~~~~~~~~~~~~~~~~~~
../drivers/net/bnxt/tf_ulp/ulp_mapper_tfc.c:1763:1: error: invalid storage class for function ‘ulp_mapper_tfc_handle_to_offset’
1763 | ulp_mapper_tfc_handle_to_offset(struct bnxt_ulp_mapper_parms *parms __rte_unused,
| ^~~~~~~~~~~~~~~~~~~~~~~~~~~~~~~
../drivers/net/bnxt/tf_ulp/ulp_mapper_tfc.c:1797:1: error: invalid storage class for function ‘ulp_mapper_tfc_mpc_batch_start’
1797 | ulp_mapper_tfc_mpc_batch_start(struct tfc_mpc_batch_info_t *batch_info)
| ^~~~~~~~~~~~~~~~~~~~~~~~~~~~~~
../drivers/net/bnxt/tf_ulp/ulp_mapper_tfc.c:1803:1: error: invalid storage class for function ‘ulp_mapper_tfc_mtr_stats_hndl_set’
1803 | ulp_mapper_tfc_mtr_stats_hndl_set(struct bnxt_ulp_mapper_parms *parms __rte_unused,
| ^~~~~~~~~~~~~~~~~~~~~~~~~~~~~~~~~
../drivers/net/bnxt/tf_ulp/ulp_mapper_tfc.c:1821:1: error: invalid storage class for function ‘ulp_mapper_tfc_mtr_stats_hndl_get’
1821 | ulp_mapper_tfc_mtr_stats_hndl_get(uint32_t mtr_id, uint64_t *stats_hndl)
| ^~~~~~~~~~~~~~~~~~~~~~~~~~~~~~~~~
../drivers/net/bnxt/tf_ulp/ulp_mapper_tfc.c:1837:1: error: invalid storage class for function ‘ulp_mapper_tfc_mtr_stats_hndl_del’
1837 | ulp_mapper_tfc_mtr_stats_hndl_del(uint32_t mtr_id)
| ^~~~~~~~~~~~~~~~~~~~~~~~~~~~~~~~~
../drivers/net/bnxt/tf_ulp/ulp_mapper_tfc.c:1852:1: error: invalid storage class for function ‘ulp_mapper_tfc_glb_idx_tbl_alloc’
1852 | ulp_mapper_tfc_glb_idx_tbl_alloc(struct bnxt_ulp_context *ulp_ctx,
| ^~~~~~~~~~~~~~~~~~~~~~~~~~~~~~~~
../drivers/net/bnxt/tf_ulp/ulp_mapper_tfc.c:1892:1: error: invalid storage class for function ‘ulp_mapper_tfc_glb_idx_tbl_free’
1892 | ulp_mapper_tfc_glb_idx_tbl_free(struct bnxt_ulp_context *ulp_ctx,
| ^~~~~~~~~~~~~~~~~~~~~~~~~~~~~~~
../drivers/net/bnxt/tf_ulp/ulp_mapper_tfc.c:1926:1: error: invalid storage class for function ‘ulp_mapper_tfc_tcam_prio_update’
1926 | ulp_mapper_tfc_tcam_prio_update(struct bnxt_ulp_mapper_parms *parms,
| ^~~~~~~~~~~~~~~~~~~~~~~~~~~~~~~
../drivers/net/bnxt/tf_ulp/ulp_mapper_tfc.c:1990:1: error: expected declaration or statement at end of input
1990 | };
| ^
../drivers/net/bnxt/tf_ulp/ulp_mapper_tfc.c:1961:34: error: unused variable ‘ulp_mapper_tfc_core_ops’ [-Werror=unused-variable]
1961 | const struct ulp_mapper_core_ops ulp_mapper_tfc_core_ops = {
| ^~~~~~~~~~~~~~~~~~~~~~~
../drivers/net/bnxt/tf_ulp/ulp_mapper_tfc.c: At top level:
../drivers/net/bnxt/tf_ulp/ulp_mapper_tfc.c:457:1: error: ‘ulp_mapper_tfc_em_tbl_process’ defined but not used [-Werror=unused-function]
457 | ulp_mapper_tfc_em_tbl_process(struct bnxt_ulp_mapper_parms *parms,
| ^~~~~~~~~~~~~~~~~~~~~~~~~~~~~
cc1: all warnings being treated as errors
[1331/3765] Compiling C object drivers/libtmp_rte_net_bnxt.a.p/net_bnxt_tf_ulp_ulp_sc_mgr.c.o
[1332/3765] Compiling C object drivers/libtmp_rte_net_bnxt.a.p/net_bnxt_tf_ulp_bnxt_ulp_tf.c.o
[1333/3765] Compiling C object drivers/libtmp_rte_net_bnxt.a.p/net_bnxt_tf_ulp_ulp_mapper_tf.c.o
[1334/3765] Compiling C object drivers/libtmp_rte_net_bnxt.a.p/net_bnxt_tf_ulp_bnxt_ulp_tfc.c.o
[1335/3765] Compiling C object drivers/libtmp_rte_net_bnxt.a.p/net_bnxt_tf_ulp_ulp_fc_mgr_tfc.c.o
[1336/3765] Compiling C object drivers/libtmp_rte_net_bnxt.a.p/net_bnxt_tf_ulp_ulp_alloc_tbl.c.o
[1337/3765] Compiling C object drivers/libtmp_rte_net_bnxt.a.p/net_bnxt_tf_ulp_ulp_fc_mgr_tf.c.o
[1338/3765] Compiling C object drivers/libtmp_rte_net_bnxt.a.p/net_bnxt_tf_ulp_ulp_mapper.c.o
[1339/3765] Compiling C object drivers/libtmp_rte_net_bnxt.a.p/net_bnxt_tf_ulp_ulp_rte_parser.c.o
ninja: build stopped
*Build Failed #13:
OS: UB2604-32
Target: i686-native-linuxapp-gcc
FAILED: drivers/libtmp_rte_net_bnxt.a.p/net_bnxt_tf_ulp_ulp_mapper_tfc.c.o
gcc -Idrivers/libtmp_rte_net_bnxt.a.p -Idrivers -I../drivers -Idrivers/net/bnxt -I../drivers/net/bnxt -Idrivers/net/bnxt/tf_ulp -I../drivers/net/bnxt/tf_ulp -Idrivers/net/bnxt/tf_ulp/generic_templates -I../drivers/net/bnxt/tf_ulp/generic_templates -Idrivers/net/bnxt/tf_core -I../drivers/net/bnxt/tf_core -Idrivers/net/bnxt/tf_core/v3 -I../drivers/net/bnxt/tf_core/v3 -Idrivers/net/bnxt/hcapi/cfa -I../drivers/net/bnxt/hcapi/cfa -Idrivers/net/bnxt/hcapi/cfa_v3 -I../drivers/net/bnxt/hcapi/cfa_v3 -I../drivers/net/bnxt/hcapi/cfa_v3/include -I../drivers/net/bnxt/hcapi/cfa_v3/include/platform/dpdk -I../drivers/net/bnxt/hcapi/cfa_v3/bld/p70 -I../drivers/net/bnxt/hcapi/cfa_v3/bld/p70/host -I../drivers/net/bnxt/hcapi/cfa_v3/bld/include -I../drivers/net/bnxt/hcapi/cfa_v3/bld/include/host -I../drivers/net/bnxt/hcapi/cfa_v3/bld/include/p70 -I../drivers/net/bnxt/hcapi/cfa_v3/mm/include -I../drivers/net/bnxt/hcapi/cfa_v3/tim/include -I../drivers/net/bnxt/hcapi/cfa_v3/tpm/include -Ilib/ethdev -I../lib/ethdev -Ilib/eal/common -I../lib/eal/common -I. -I.. -Iconfig -I../config -Ilib/eal/include -I../lib/eal/include -Ilib/eal/linux/include -I../lib/eal/linux/include -Ilib/eal/x86/include -I../lib/eal/x86/include -I../kernel/linux -Ilib/eal -I../lib/eal -Ilib/kvargs -I../lib/kvargs -Ilib/log -I../lib/log -Ilib/metrics -I../lib/metrics -Ilib/telemetry -I../lib/telemetry -Ilib/argparse -I../lib/argparse -Ilib/net -I../lib/net -Ilib/mbuf -I../lib/mbuf -Ilib/mempool -I../lib/mempool -Ilib/ring -I../lib/ring -Ilib/meter -I../lib/meter -Idrivers/bus/pci -I../drivers/bus/pci -I../drivers/bus/pci/linux -Ilib/pci -I../lib/pci -Idrivers/bus/vdev -I../drivers/bus/vdev -Ilib/hash -I../lib/hash -Ilib/rcu -I../lib/rcu -fdiagnostics-color=always -D_FILE_OFFSET_BITS=64 -Wall -Winvalid-pch -Wextra -Werror -std=c11 -O3 -include rte_config.h -Wvla -Wcast-qual -Wdeprecated -Wformat -Wformat-nonliteral -Wformat-security -Wmissing-declarations -Wmissing-prototypes -Wnested-externs -Wold-style-definition -Wpointer-arith -Wshadow -Wsign-compare -Wstrict-prototypes -Wundef -Wwrite-strings -Wno-packed-not-aligned -Wno-missing-field-initializers -fzero-init-padding-bits=all -Wno-pointer-to-int-cast -D_GNU_SOURCE -m32 -fPIC -march=native -mrtm -DALLOW_EXPERIMENTAL_API -DALLOW_INTERNAL_API -Wno-format-truncation -Wno-address-of-packed-member -Wno-vla -Wno-shadow -DBNXT_TF_APP_ID=0 -DSUPPORT_CFA_HW_P70=1 -DCFA_BLD_PRINT_OBJ=1 -DRTE_COMPONENT_CLASS=pmd_net -DRTE_COMPONENT_NAME=bnxt -DRTE_LOG_DEFAULT_LOGTYPE=pmd.net.bnxt -MD -MQ drivers/libtmp_rte_net_bnxt.a.p/net_bnxt_tf_ulp_ulp_mapper_tfc.c.o -MF drivers/libtmp_rte_net_bnxt.a.p/net_bnxt_tf_ulp_ulp_mapper_tfc.c.o.d -o drivers/libtmp_rte_net_bnxt.a.p/net_bnxt_tf_ulp_ulp_mapper_tfc.c.o -c ../drivers/net/bnxt/tf_ulp/ulp_mapper_tfc.c
../drivers/net/bnxt/tf_ulp/ulp_mapper_tfc.c: In function ‘ulp_mapper_tfc_em_tbl_process’:
../drivers/net/bnxt/tf_ulp/ulp_mapper_tfc.c:659:1: error: invalid storage class for function ‘ulp_mapper_tfc_em_entry_free’
659 | ulp_mapper_tfc_em_entry_free(struct bnxt_ulp_context *ulp,
| ^~~~~~~~~~~~~~~~~~~~~~~~~~~~
../drivers/net/bnxt/tf_ulp/ulp_mapper_tfc.c:708:1: error: invalid storage class for function ‘ulp_mapper_tfc_dyn_blob_size_get’
708 | ulp_mapper_tfc_dyn_blob_size_get(struct bnxt_ulp_mapper_parms *mparms,
| ^~~~~~~~~~~~~~~~~~~~~~~~~~~~~~~~
../drivers/net/bnxt/tf_ulp/ulp_mapper_tfc.c:731:1: error: invalid storage class for function ‘ulp_mapper_tfc_index_tbl_process’
731 | ulp_mapper_tfc_index_tbl_process(struct bnxt_ulp_mapper_parms *parms,
| ^~~~~~~~~~~~~~~~~~~~~~~~~~~~~~~~
../drivers/net/bnxt/tf_ulp/ulp_mapper_tfc.c:1029:1: error: invalid storage class for function ‘ulp_mapper_tfc_index_entry_free’
1029 | ulp_mapper_tfc_index_entry_free(struct bnxt_ulp_context *ulp_ctx,
| ^~~~~~~~~~~~~~~~~~~~~~~~~~~~~~~
../drivers/net/bnxt/tf_ulp/ulp_mapper_tfc.c:1060:1: error: invalid storage class for function ‘ulp_mapper_tfc_cmm_tbl_process’
1060 | ulp_mapper_tfc_cmm_tbl_process(struct bnxt_ulp_mapper_parms *parms,
| ^~~~~~~~~~~~~~~~~~~~~~~~~~~~~~
../drivers/net/bnxt/tf_ulp/ulp_mapper_tfc.c:1368:1: error: invalid storage class for function ‘ulp_mapper_tfc_cmm_entry_free’
1368 | ulp_mapper_tfc_cmm_entry_free(struct bnxt_ulp_context *ulp_ctx,
| ^~~~~~~~~~~~~~~~~~~~~~~~~~~~~
../drivers/net/bnxt/tf_ulp/ulp_mapper_tfc.c:1418:1: error: invalid storage class for function ‘ulp_mapper_tfc_if_tbl_process’
1418 | ulp_mapper_tfc_if_tbl_process(struct bnxt_ulp_mapper_parms *parms,
| ^~~~~~~~~~~~~~~~~~~~~~~~~~~~~
../drivers/net/bnxt/tf_ulp/ulp_mapper_tfc.c:1519:1: error: invalid storage class for function ‘ulp_mapper_tfc_ident_alloc’
1519 | ulp_mapper_tfc_ident_alloc(struct bnxt_ulp_context *ulp_ctx,
| ^~~~~~~~~~~~~~~~~~~~~~~~~~
../drivers/net/bnxt/tf_ulp/ulp_mapper_tfc.c:1556:1: error: invalid storage class for function ‘ulp_mapper_tfc_ident_free’
1556 | ulp_mapper_tfc_ident_free(struct bnxt_ulp_context *ulp_ctx,
| ^~~~~~~~~~~~~~~~~~~~~~~~~
../drivers/net/bnxt/tf_ulp/ulp_mapper_tfc.c:1589:1: error: invalid storage class for function ‘ulp_mapper_tfc_global_ident_alloc’
1589 | ulp_mapper_tfc_global_ident_alloc(struct bnxt_ulp_context *ulp_ctx,
| ^~~~~~~~~~~~~~~~~~~~~~~~~~~~~~~~~
../drivers/net/bnxt/tf_ulp/ulp_mapper_tfc.c:1631:1: error: invalid storage class for function ‘ulp_mapper_tfc_global_ident_free’
1631 | ulp_mapper_tfc_global_ident_free(struct bnxt_ulp_context *ulp_ctx,
| ^~~~~~~~~~~~~~~~~~~~~~~~~~~~~~~~
../drivers/net/bnxt/tf_ulp/ulp_mapper_tfc.c:1665:1: error: invalid storage class for function ‘ulp_mapper_tfc_tcam_entry_free’
1665 | ulp_mapper_tfc_tcam_entry_free(struct bnxt_ulp_context *ulp,
| ^~~~~~~~~~~~~~~~~~~~~~~~~~~~~~
../drivers/net/bnxt/tf_ulp/ulp_mapper_tfc.c:1695:1: error: invalid storage class for function ‘ulp_mapper_tfc_dyn_tbl_type_get’
1695 | ulp_mapper_tfc_dyn_tbl_type_get(struct bnxt_ulp_mapper_parms *parm __rte_unused,
| ^~~~~~~~~~~~~~~~~~~~~~~~~~~~~~~
../drivers/net/bnxt/tf_ulp/ulp_mapper_tfc.c:1715:1: error: invalid storage class for function ‘ulp_mapper_tfc_index_tbl_alloc_process’
1715 | ulp_mapper_tfc_index_tbl_alloc_process(struct bnxt_ulp_context *ulp,
| ^~~~~~~~~~~~~~~~~~~~~~~~~~~~~~~~~~~~~~
../drivers/net/bnxt/tf_ulp/ulp_mapper_tfc.c:1753:1: error: invalid storage class for function ‘ulp_mapper_tfc_app_glb_resource_info_init’
1753 | ulp_mapper_tfc_app_glb_resource_info_init(struct bnxt_ulp_context
| ^~~~~~~~~~~~~~~~~~~~~~~~~~~~~~~~~~~~~~~~~
../drivers/net/bnxt/tf_ulp/ulp_mapper_tfc.c:1763:1: error: invalid storage class for function ‘ulp_mapper_tfc_handle_to_offset’
1763 | ulp_mapper_tfc_handle_to_offset(struct bnxt_ulp_mapper_parms *parms __rte_unused,
| ^~~~~~~~~~~~~~~~~~~~~~~~~~~~~~~
../drivers/net/bnxt/tf_ulp/ulp_mapper_tfc.c:1797:1: error: invalid storage class for function ‘ulp_mapper_tfc_mpc_batch_start’
1797 | ulp_mapper_tfc_mpc_batch_start(struct tfc_mpc_batch_info_t *batch_info)
| ^~~~~~~~~~~~~~~~~~~~~~~~~~~~~~
../drivers/net/bnxt/tf_ulp/ulp_mapper_tfc.c:1803:1: error: invalid storage class for function ‘ulp_mapper_tfc_mtr_stats_hndl_set’
1803 | ulp_mapper_tfc_mtr_stats_hndl_set(struct bnxt_ulp_mapper_parms *parms __rte_unused,
| ^~~~~~~~~~~~~~~~~~~~~~~~~~~~~~~~~
../drivers/net/bnxt/tf_ulp/ulp_mapper_tfc.c:1821:1: error: invalid storage class for function ‘ulp_mapper_tfc_mtr_stats_hndl_get’
1821 | ulp_mapper_tfc_mtr_stats_hndl_get(uint32_t mtr_id, uint64_t *stats_hndl)
| ^~~~~~~~~~~~~~~~~~~~~~~~~~~~~~~~~
../drivers/net/bnxt/tf_ulp/ulp_mapper_tfc.c:1837:1: error: invalid storage class for function ‘ulp_mapper_tfc_mtr_stats_hndl_del’
1837 | ulp_mapper_tfc_mtr_stats_hndl_del(uint32_t mtr_id)
| ^~~~~~~~~~~~~~~~~~~~~~~~~~~~~~~~~
../drivers/net/bnxt/tf_ulp/ulp_mapper_tfc.c:1852:1: error: invalid storage class for function ‘ulp_mapper_tfc_glb_idx_tbl_alloc’
1852 | ulp_mapper_tfc_glb_idx_tbl_alloc(struct bnxt_ulp_context *ulp_ctx,
| ^~~~~~~~~~~~~~~~~~~~~~~~~~~~~~~~
../drivers/net/bnxt/tf_ulp/ulp_mapper_tfc.c:1892:1: error: invalid storage class for function ‘ulp_mapper_tfc_glb_idx_tbl_free’
1892 | ulp_mapper_tfc_glb_idx_tbl_free(struct bnxt_ulp_context *ulp_ctx,
| ^~~~~~~~~~~~~~~~~~~~~~~~~~~~~~~
../drivers/net/bnxt/tf_ulp/ulp_mapper_tfc.c:1926:1: error: invalid storage class for function ‘ulp_mapper_tfc_tcam_prio_update’
1926 | ulp_mapper_tfc_tcam_prio_update(struct bnxt_ulp_mapper_parms *parms,
| ^~~~~~~~~~~~~~~~~~~~~~~~~~~~~~~
../drivers/net/bnxt/tf_ulp/ulp_mapper_tfc.c:1990:1: error: expected declaration or statement at end of input
1990 | };
| ^
../drivers/net/bnxt/tf_ulp/ulp_mapper_tfc.c:1961:34: error: unused variable ‘ulp_mapper_tfc_core_ops’ [-Werror=unused-variable]
1961 | const struct ulp_mapper_core_ops ulp_mapper_tfc_core_ops = {
| ^~~~~~~~~~~~~~~~~~~~~~~
../drivers/net/bnxt/tf_ulp/ulp_mapper_tfc.c: At top level:
../drivers/net/bnxt/tf_ulp/ulp_mapper_tfc.c:457:1: error: ‘ulp_mapper_tfc_em_tbl_process’ defined but not used [-Werror=unused-function]
457 | ulp_mapper_tfc_em_tbl_process(struct bnxt_ulp_mapper_parms *parms,
| ^~~~~~~~~~~~~~~~~~~~~~~~~~~~~
cc1: all warnings being treated as errors
[1037/2795] Compiling C object drivers/libtmp_rte_net_bnxt.a.p/net_bnxt_tf_ulp_bnxt_ulp_tf.c.o
[1038/2795] Compiling C object drivers/libtmp_rte_net_bnxt.a.p/net_bnxt_tf_core_bitalloc.c.o
[1039/2795] Compiling C object drivers/libtmp_rte_net_bnxt.a.p/net_bnxt_tf_ulp_ulp_mapper_tf.c.o
[1040/2795] Compiling C object drivers/libtmp_rte_net_bnxt.a.p/net_bnxt_tf_ulp_ulp_sc_mgr.c.o
[1041/2795] Compiling C object drivers/libtmp_rte_net_bnxt.a.p/net_bnxt_tf_ulp_ulp_fc_mgr_tfc.c.o
[1042/2795] Compiling C object drivers/libtmp_rte_net_bnxt.a.p/net_bnxt_tf_ulp_ulp_fc_mgr_tf.c.o
[1043/2795] Compiling C object drivers/libtmp_rte_net_bnxt.a.p/net_bnxt_tf_ulp_bnxt_ulp_tfc.c.o
[1044/2795] Compiling C object drivers/libtmp_rte_net_bnxt.a.p/net_bnxt_tf_ulp_ulp_alloc_tbl.c.o
[1045/2795] Compiling C object drivers/libtmp_rte_net_bnxt.a.p/net_bnxt_tf_ulp_ulp_rte_parser.c.o
ninja: build stopped
*Build Failed #14:
OS: RHEL10.1-64
Target: x86_64-native-linuxapp-gcc
FAILED: drivers/libtmp_rte_net_bnxt.a.p/net_bnxt_tf_ulp_ulp_mapper_tfc.c.o
gcc -Idrivers/libtmp_rte_net_bnxt.a.p -Idrivers -I../drivers -Idrivers/net/bnxt -I../drivers/net/bnxt -Idrivers/net/bnxt/tf_ulp -I../drivers/net/bnxt/tf_ulp -Idrivers/net/bnxt/tf_ulp/generic_templates -I../drivers/net/bnxt/tf_ulp/generic_templates -Idrivers/net/bnxt/tf_core -I../drivers/net/bnxt/tf_core -Idrivers/net/bnxt/tf_core/v3 -I../drivers/net/bnxt/tf_core/v3 -Idrivers/net/bnxt/hcapi/cfa -I../drivers/net/bnxt/hcapi/cfa -Idrivers/net/bnxt/hcapi/cfa_v3 -I../drivers/net/bnxt/hcapi/cfa_v3 -I../drivers/net/bnxt/hcapi/cfa_v3/include -I../drivers/net/bnxt/hcapi/cfa_v3/include/platform/dpdk -I../drivers/net/bnxt/hcapi/cfa_v3/bld/p70 -I../drivers/net/bnxt/hcapi/cfa_v3/bld/p70/host -I../drivers/net/bnxt/hcapi/cfa_v3/bld/include -I../drivers/net/bnxt/hcapi/cfa_v3/bld/include/host -I../drivers/net/bnxt/hcapi/cfa_v3/bld/include/p70 -I../drivers/net/bnxt/hcapi/cfa_v3/mm/include -I../drivers/net/bnxt/hcapi/cfa_v3/tim/include -I../drivers/net/bnxt/hcapi/cfa_v3/tpm/include -Ilib/ethdev -I../lib/ethdev -Ilib/eal/common -I../lib/eal/common -I. -I.. -Iconfig -I../config -Ilib/eal/include -I../lib/eal/include -Ilib/eal/linux/include -I../lib/eal/linux/include -Ilib/eal/x86/include -I../lib/eal/x86/include -I../kernel/linux -Ilib/eal -I../lib/eal -Ilib/kvargs -I../lib/kvargs -Ilib/log -I../lib/log -Ilib/metrics -I../lib/metrics -Ilib/telemetry -I../lib/telemetry -Ilib/argparse -I../lib/argparse -Ilib/net -I../lib/net -Ilib/mbuf -I../lib/mbuf -Ilib/mempool -I../lib/mempool -Ilib/ring -I../lib/ring -Ilib/meter -I../lib/meter -Idrivers/bus/pci -I../drivers/bus/pci -I../drivers/bus/pci/linux -Ilib/pci -I../lib/pci -Idrivers/bus/vdev -I../drivers/bus/vdev -Ilib/hash -I../lib/hash -Ilib/rcu -I../lib/rcu -fdiagnostics-color=always -D_FILE_OFFSET_BITS=64 -Wall -Winvalid-pch -Wextra -Werror -std=c11 -O3 -include rte_config.h -Wvla -Wcast-qual -Wdeprecated -Wformat -Wformat-nonliteral -Wformat-security -Wmissing-declarations -Wmissing-prototypes -Wnested-externs -Wold-style-definition -Wpointer-arith -Wshadow -Wsign-compare -Wstrict-prototypes -Wundef -Wwrite-strings -Wno-packed-not-aligned -Wno-missing-field-initializers -D_GNU_SOURCE -fPIC -march=native -mrtm -DALLOW_EXPERIMENTAL_API -DALLOW_INTERNAL_API -Wno-format-truncation -Wno-address-of-packed-member -Wno-vla -Wno-shadow -DBNXT_TF_APP_ID=0 -DSUPPORT_CFA_HW_P70=1 -DCFA_BLD_PRINT_OBJ=1 -DRTE_COMPONENT_CLASS=pmd_net -DRTE_COMPONENT_NAME=bnxt -DRTE_LOG_DEFAULT_LOGTYPE=pmd.net.bnxt -MD -MQ drivers/libtmp_rte_net_bnxt.a.p/net_bnxt_tf_ulp_ulp_mapper_tfc.c.o -MF drivers/libtmp_rte_net_bnxt.a.p/net_bnxt_tf_ulp_ulp_mapper_tfc.c.o.d -o drivers/libtmp_rte_net_bnxt.a.p/net_bnxt_tf_ulp_ulp_mapper_tfc.c.o -c ../drivers/net/bnxt/tf_ulp/ulp_mapper_tfc.c
../drivers/net/bnxt/tf_ulp/ulp_mapper_tfc.c: In function ‘ulp_mapper_tfc_em_tbl_process’:
../drivers/net/bnxt/tf_ulp/ulp_mapper_tfc.c:659:1: error: invalid storage class for function ‘ulp_mapper_tfc_em_entry_free’
659 | ulp_mapper_tfc_em_entry_free(struct bnxt_ulp_context *ulp,
| ^~~~~~~~~~~~~~~~~~~~~~~~~~~~
../drivers/net/bnxt/tf_ulp/ulp_mapper_tfc.c:708:1: error: invalid storage class for function ‘ulp_mapper_tfc_dyn_blob_size_get’
708 | ulp_mapper_tfc_dyn_blob_size_get(struct bnxt_ulp_mapper_parms *mparms,
| ^~~~~~~~~~~~~~~~~~~~~~~~~~~~~~~~
../drivers/net/bnxt/tf_ulp/ulp_mapper_tfc.c:731:1: error: invalid storage class for function ‘ulp_mapper_tfc_index_tbl_process’
731 | ulp_mapper_tfc_index_tbl_process(struct bnxt_ulp_mapper_parms *parms,
| ^~~~~~~~~~~~~~~~~~~~~~~~~~~~~~~~
../drivers/net/bnxt/tf_ulp/ulp_mapper_tfc.c:1029:1: error: invalid storage class for function ‘ulp_mapper_tfc_index_entry_free’
1029 | ulp_mapper_tfc_index_entry_free(struct bnxt_ulp_context *ulp_ctx,
| ^~~~~~~~~~~~~~~~~~~~~~~~~~~~~~~
../drivers/net/bnxt/tf_ulp/ulp_mapper_tfc.c:1060:1: error: invalid storage class for function ‘ulp_mapper_tfc_cmm_tbl_process’
1060 | ulp_mapper_tfc_cmm_tbl_process(struct bnxt_ulp_mapper_parms *parms,
| ^~~~~~~~~~~~~~~~~~~~~~~~~~~~~~
../drivers/net/bnxt/tf_ulp/ulp_mapper_tfc.c:1368:1: error: invalid storage class for function ‘ulp_mapper_tfc_cmm_entry_free’
1368 | ulp_mapper_tfc_cmm_entry_free(struct bnxt_ulp_context *ulp_ctx,
| ^~~~~~~~~~~~~~~~~~~~~~~~~~~~~
../drivers/net/bnxt/tf_ulp/ulp_mapper_tfc.c:1418:1: error: invalid storage class for function ‘ulp_mapper_tfc_if_tbl_process’
1418 | ulp_mapper_tfc_if_tbl_process(struct bnxt_ulp_mapper_parms *parms,
| ^~~~~~~~~~~~~~~~~~~~~~~~~~~~~
../drivers/net/bnxt/tf_ulp/ulp_mapper_tfc.c:1519:1: error: invalid storage class for function ‘ulp_mapper_tfc_ident_alloc’
1519 | ulp_mapper_tfc_ident_alloc(struct bnxt_ulp_context *ulp_ctx,
| ^~~~~~~~~~~~~~~~~~~~~~~~~~
../drivers/net/bnxt/tf_ulp/ulp_mapper_tfc.c:1556:1: error: invalid storage class for function ‘ulp_mapper_tfc_ident_free’
1556 | ulp_mapper_tfc_ident_free(struct bnxt_ulp_context *ulp_ctx,
| ^~~~~~~~~~~~~~~~~~~~~~~~~
../drivers/net/bnxt/tf_ulp/ulp_mapper_tfc.c:1589:1: error: invalid storage class for function ‘ulp_mapper_tfc_global_ident_alloc’
1589 | ulp_mapper_tfc_global_ident_alloc(struct bnxt_ulp_context *ulp_ctx,
| ^~~~~~~~~~~~~~~~~~~~~~~~~~~~~~~~~
../drivers/net/bnxt/tf_ulp/ulp_mapper_tfc.c:1631:1: error: invalid storage class for function ‘ulp_mapper_tfc_global_ident_free’
1631 | ulp_mapper_tfc_global_ident_free(struct bnxt_ulp_context *ulp_ctx,
| ^~~~~~~~~~~~~~~~~~~~~~~~~~~~~~~~
../drivers/net/bnxt/tf_ulp/ulp_mapper_tfc.c:1665:1: error: invalid storage class for function ‘ulp_mapper_tfc_tcam_entry_free’
1665 | ulp_mapper_tfc_tcam_entry_free(struct bnxt_ulp_context *ulp,
| ^~~~~~~~~~~~~~~~~~~~~~~~~~~~~~
../drivers/net/bnxt/tf_ulp/ulp_mapper_tfc.c:1695:1: error: invalid storage class for function ‘ulp_mapper_tfc_dyn_tbl_type_get’
1695 | ulp_mapper_tfc_dyn_tbl_type_get(struct bnxt_ulp_mapper_parms *parm __rte_unused,
| ^~~~~~~~~~~~~~~~~~~~~~~~~~~~~~~
../drivers/net/bnxt/tf_ulp/ulp_mapper_tfc.c:1715:1: error: invalid storage class for function ‘ulp_mapper_tfc_index_tbl_alloc_process’
1715 | ulp_mapper_tfc_index_tbl_alloc_process(struct bnxt_ulp_context *ulp,
| ^~~~~~~~~~~~~~~~~~~~~~~~~~~~~~~~~~~~~~
../drivers/net/bnxt/tf_ulp/ulp_mapper_tfc.c:1753:1: error: invalid storage class for function ‘ulp_mapper_tfc_app_glb_resource_info_init’
1753 | ulp_mapper_tfc_app_glb_resource_info_init(struct bnxt_ulp_context
| ^~~~~~~~~~~~~~~~~~~~~~~~~~~~~~~~~~~~~~~~~
../drivers/net/bnxt/tf_ulp/ulp_mapper_tfc.c:1763:1: error: invalid storage class for function ‘ulp_mapper_tfc_handle_to_offset’
1763 | ulp_mapper_tfc_handle_to_offset(struct bnxt_ulp_mapper_parms *parms __rte_unused,
| ^~~~~~~~~~~~~~~~~~~~~~~~~~~~~~~
../drivers/net/bnxt/tf_ulp/ulp_mapper_tfc.c:1797:1: error: invalid storage class for function ‘ulp_mapper_tfc_mpc_batch_start’
1797 | ulp_mapper_tfc_mpc_batch_start(struct tfc_mpc_batch_info_t *batch_info)
| ^~~~~~~~~~~~~~~~~~~~~~~~~~~~~~
../drivers/net/bnxt/tf_ulp/ulp_mapper_tfc.c:1803:1: error: invalid storage class for function ‘ulp_mapper_tfc_mtr_stats_hndl_set’
1803 | ulp_mapper_tfc_mtr_stats_hndl_set(struct bnxt_ulp_mapper_parms *parms __rte_unused,
| ^~~~~~~~~~~~~~~~~~~~~~~~~~~~~~~~~
../drivers/net/bnxt/tf_ulp/ulp_mapper_tfc.c:1821:1: error: invalid storage class for function ‘ulp_mapper_tfc_mtr_stats_hndl_get’
1821 | ulp_mapper_tfc_mtr_stats_hndl_get(uint32_t mtr_id, uint64_t *stats_hndl)
| ^~~~~~~~~~~~~~~~~~~~~~~~~~~~~~~~~
../drivers/net/bnxt/tf_ulp/ulp_mapper_tfc.c:1837:1: error: invalid storage class for function ‘ulp_mapper_tfc_mtr_stats_hndl_del’
1837 | ulp_mapper_tfc_mtr_stats_hndl_del(uint32_t mtr_id)
| ^~~~~~~~~~~~~~~~~~~~~~~~~~~~~~~~~
../drivers/net/bnxt/tf_ulp/ulp_mapper_tfc.c:1852:1: error: invalid storage class for function ‘ulp_mapper_tfc_glb_idx_tbl_alloc’
1852 | ulp_mapper_tfc_glb_idx_tbl_alloc(struct bnxt_ulp_context *ulp_ctx,
| ^~~~~~~~~~~~~~~~~~~~~~~~~~~~~~~~
../drivers/net/bnxt/tf_ulp/ulp_mapper_tfc.c:1892:1: error: invalid storage class for function ‘ulp_mapper_tfc_glb_idx_tbl_free’
1892 | ulp_mapper_tfc_glb_idx_tbl_free(struct bnxt_ulp_context *ulp_ctx,
| ^~~~~~~~~~~~~~~~~~~~~~~~~~~~~~~
../drivers/net/bnxt/tf_ulp/ulp_mapper_tfc.c:1926:1: error: invalid storage class for function ‘ulp_mapper_tfc_tcam_prio_update’
1926 | ulp_mapper_tfc_tcam_prio_update(struct bnxt_ulp_mapper_parms *parms,
| ^~~~~~~~~~~~~~~~~~~~~~~~~~~~~~~
../drivers/net/bnxt/tf_ulp/ulp_mapper_tfc.c:1990:1: error: expected declaration or statement at end of input
1990 | };
| ^
../drivers/net/bnxt/tf_ulp/ulp_mapper_tfc.c:1961:34: error: unused variable ‘ulp_mapper_tfc_core_ops’ [-Werror=unused-variable]
1961 | const struct ulp_mapper_core_ops ulp_mapper_tfc_core_ops = {
| ^~~~~~~~~~~~~~~~~~~~~~~
../drivers/net/bnxt/tf_ulp/ulp_mapper_tfc.c: At top level:
../drivers/net/bnxt/tf_ulp/ulp_mapper_tfc.c:457:1: error: ‘ulp_mapper_tfc_em_tbl_process’ defined but not used [-Werror=unused-function]
457 | ulp_mapper_tfc_em_tbl_process(struct bnxt_ulp_mapper_parms *parms,
| ^~~~~~~~~~~~~~~~~~~~~~~~~~~~~
cc1: all warnings being treated as errors
[1328/3700] Compiling C object drivers/libtmp_rte_net_bnxt.a.p/net_bnxt_tf_ulp_bnxt_ulp_tf.c.o
[1329/3700] Compiling C object drivers/libtmp_rte_net_bnxt.a.p/net_bnxt_tf_ulp_ulp_mapper_tf.c.o
[1330/3700] Compiling C object drivers/libtmp_rte_net_bnxt.a.p/net_bnxt_tf_ulp_ulp_fc_mgr_tfc.c.o
[1331/3700] Compiling C object drivers/libtmp_rte_net_bnxt.a.p/net_bnxt_tf_ulp_ulp_fc_mgr_tf.c.o
[1332/3700] Compiling C object drivers/libtmp_rte_net_bnxt.a.p/net_bnxt_tf_ulp_ulp_sc_mgr.c.o
[1333/3700] Compiling C object drivers/libtmp_rte_net_bnxt.a.p/net_bnxt_tf_ulp_ulp_alloc_tbl.c.o
[1334/3700] Compiling C object drivers/libtmp_rte_net_bnxt.a.p/net_bnxt_tf_ulp_bnxt_ulp_tfc.c.o
[1335/3700] Compiling C object drivers/libtmp_rte_net_bnxt.a.p/net_bnxt_tf_ulp_ulp_mapper.c.o
[1336/3700] Compiling C object drivers/libtmp_rte_net_bnxt.a.p/net_bnxt_tf_ulp_ulp_rte_parser.c.o
ninja: build stopped
*Build Failed #15:
OS: UB2604-64
Target: x86_64-native-linuxapp-gcc+16byte
FAILED: drivers/libtmp_rte_net_bnxt.a.p/net_bnxt_tf_ulp_ulp_mapper_tfc.c.o
gcc -Idrivers/libtmp_rte_net_bnxt.a.p -Idrivers -I../drivers -Idrivers/net/bnxt -I../drivers/net/bnxt -Idrivers/net/bnxt/tf_ulp -I../drivers/net/bnxt/tf_ulp -Idrivers/net/bnxt/tf_ulp/generic_templates -I../drivers/net/bnxt/tf_ulp/generic_templates -Idrivers/net/bnxt/tf_core -I../drivers/net/bnxt/tf_core -Idrivers/net/bnxt/tf_core/v3 -I../drivers/net/bnxt/tf_core/v3 -Idrivers/net/bnxt/hcapi/cfa -I../drivers/net/bnxt/hcapi/cfa -Idrivers/net/bnxt/hcapi/cfa_v3 -I../drivers/net/bnxt/hcapi/cfa_v3 -I../drivers/net/bnxt/hcapi/cfa_v3/include -I../drivers/net/bnxt/hcapi/cfa_v3/include/platform/dpdk -I../drivers/net/bnxt/hcapi/cfa_v3/bld/p70 -I../drivers/net/bnxt/hcapi/cfa_v3/bld/p70/host -I../drivers/net/bnxt/hcapi/cfa_v3/bld/include -I../drivers/net/bnxt/hcapi/cfa_v3/bld/include/host -I../drivers/net/bnxt/hcapi/cfa_v3/bld/include/p70 -I../drivers/net/bnxt/hcapi/cfa_v3/mm/include -I../drivers/net/bnxt/hcapi/cfa_v3/tim/include -I../drivers/net/bnxt/hcapi/cfa_v3/tpm/include -Ilib/ethdev -I../lib/ethdev -Ilib/eal/common -I../lib/eal/common -I. -I.. -Iconfig -I../config -Ilib/eal/include -I../lib/eal/include -Ilib/eal/linux/include -I../lib/eal/linux/include -Ilib/eal/x86/include -I../lib/eal/x86/include -I../kernel/linux -Ilib/eal -I../lib/eal -Ilib/kvargs -I../lib/kvargs -Ilib/log -I../lib/log -Ilib/metrics -I../lib/metrics -Ilib/telemetry -I../lib/telemetry -Ilib/argparse -I../lib/argparse -Ilib/net -I../lib/net -Ilib/mbuf -I../lib/mbuf -Ilib/mempool -I../lib/mempool -Ilib/ring -I../lib/ring -Ilib/meter -I../lib/meter -Idrivers/bus/pci -I../drivers/bus/pci -I../drivers/bus/pci/linux -Ilib/pci -I../lib/pci -Idrivers/bus/vdev -I../drivers/bus/vdev -Ilib/hash -I../lib/hash -Ilib/rcu -I../lib/rcu -fdiagnostics-color=always -D_FILE_OFFSET_BITS=64 -Wall -Winvalid-pch -Wextra -Werror -std=c11 -O3 -include rte_config.h -Wvla -Wcast-qual -Wdeprecated -Wformat -Wformat-nonliteral -Wformat-security -Wmissing-declarations -Wmissing-prototypes -Wnested-externs -Wold-style-definition -Wpointer-arith -Wshadow -Wsign-compare -Wstrict-prototypes -Wundef -Wwrite-strings -Wno-packed-not-aligned -Wno-missing-field-initializers -fzero-init-padding-bits=all -D_GNU_SOURCE -DRTE_LIBRTE_I40E_16BYTE_RX_DESC -DRTE_LIBRTE_ICE_16BYTE_RX_DESC -fPIC -march=native -mrtm -DALLOW_EXPERIMENTAL_API -DALLOW_INTERNAL_API -Wno-format-truncation -Wno-address-of-packed-member -Wno-vla -Wno-shadow -DBNXT_TF_APP_ID=0 -DSUPPORT_CFA_HW_P70=1 -DCFA_BLD_PRINT_OBJ=1 -DRTE_COMPONENT_CLASS=pmd_net -DRTE_COMPONENT_NAME=bnxt -DRTE_LOG_DEFAULT_LOGTYPE=pmd.net.bnxt -MD -MQ drivers/libtmp_rte_net_bnxt.a.p/net_bnxt_tf_ulp_ulp_mapper_tfc.c.o -MF drivers/libtmp_rte_net_bnxt.a.p/net_bnxt_tf_ulp_ulp_mapper_tfc.c.o.d -o drivers/libtmp_rte_net_bnxt.a.p/net_bnxt_tf_ulp_ulp_mapper_tfc.c.o -c ../drivers/net/bnxt/tf_ulp/ulp_mapper_tfc.c
../drivers/net/bnxt/tf_ulp/ulp_mapper_tfc.c: In function ‘ulp_mapper_tfc_em_tbl_process’:
../drivers/net/bnxt/tf_ulp/ulp_mapper_tfc.c:659:1: error: invalid storage class for function ‘ulp_mapper_tfc_em_entry_free’
659 | ulp_mapper_tfc_em_entry_free(struct bnxt_ulp_context *ulp,
| ^~~~~~~~~~~~~~~~~~~~~~~~~~~~
../drivers/net/bnxt/tf_ulp/ulp_mapper_tfc.c:708:1: error: invalid storage class for function ‘ulp_mapper_tfc_dyn_blob_size_get’
708 | ulp_mapper_tfc_dyn_blob_size_get(struct bnxt_ulp_mapper_parms *mparms,
| ^~~~~~~~~~~~~~~~~~~~~~~~~~~~~~~~
../drivers/net/bnxt/tf_ulp/ulp_mapper_tfc.c:731:1: error: invalid storage class for function ‘ulp_mapper_tfc_index_tbl_process’
731 | ulp_mapper_tfc_index_tbl_process(struct bnxt_ulp_mapper_parms *parms,
| ^~~~~~~~~~~~~~~~~~~~~~~~~~~~~~~~
../drivers/net/bnxt/tf_ulp/ulp_mapper_tfc.c:1029:1: error: invalid storage class for function ‘ulp_mapper_tfc_index_entry_free’
1029 | ulp_mapper_tfc_index_entry_free(struct bnxt_ulp_context *ulp_ctx,
| ^~~~~~~~~~~~~~~~~~~~~~~~~~~~~~~
../drivers/net/bnxt/tf_ulp/ulp_mapper_tfc.c:1060:1: error: invalid storage class for function ‘ulp_mapper_tfc_cmm_tbl_process’
1060 | ulp_mapper_tfc_cmm_tbl_process(struct bnxt_ulp_mapper_parms *parms,
| ^~~~~~~~~~~~~~~~~~~~~~~~~~~~~~
../drivers/net/bnxt/tf_ulp/ulp_mapper_tfc.c:1368:1: error: invalid storage class for function ‘ulp_mapper_tfc_cmm_entry_free’
1368 | ulp_mapper_tfc_cmm_entry_free(struct bnxt_ulp_context *ulp_ctx,
| ^~~~~~~~~~~~~~~~~~~~~~~~~~~~~
../drivers/net/bnxt/tf_ulp/ulp_mapper_tfc.c:1418:1: error: invalid storage class for function ‘ulp_mapper_tfc_if_tbl_process’
1418 | ulp_mapper_tfc_if_tbl_process(struct bnxt_ulp_mapper_parms *parms,
| ^~~~~~~~~~~~~~~~~~~~~~~~~~~~~
../drivers/net/bnxt/tf_ulp/ulp_mapper_tfc.c:1519:1: error: invalid storage class for function ‘ulp_mapper_tfc_ident_alloc’
1519 | ulp_mapper_tfc_ident_alloc(struct bnxt_ulp_context *ulp_ctx,
| ^~~~~~~~~~~~~~~~~~~~~~~~~~
../drivers/net/bnxt/tf_ulp/ulp_mapper_tfc.c:1556:1: error: invalid storage class for function ‘ulp_mapper_tfc_ident_free’
1556 | ulp_mapper_tfc_ident_free(struct bnxt_ulp_context *ulp_ctx,
| ^~~~~~~~~~~~~~~~~~~~~~~~~
../drivers/net/bnxt/tf_ulp/ulp_mapper_tfc.c:1589:1: error: invalid storage class for function ‘ulp_mapper_tfc_global_ident_alloc’
1589 | ulp_mapper_tfc_global_ident_alloc(struct bnxt_ulp_context *ulp_ctx,
| ^~~~~~~~~~~~~~~~~~~~~~~~~~~~~~~~~
../drivers/net/bnxt/tf_ulp/ulp_mapper_tfc.c:1631:1: error: invalid storage class for function ‘ulp_mapper_tfc_global_ident_free’
1631 | ulp_mapper_tfc_global_ident_free(struct bnxt_ulp_context *ulp_ctx,
| ^~~~~~~~~~~~~~~~~~~~~~~~~~~~~~~~
../drivers/net/bnxt/tf_ulp/ulp_mapper_tfc.c:1665:1: error: invalid storage class for function ‘ulp_mapper_tfc_tcam_entry_free’
1665 | ulp_mapper_tfc_tcam_entry_free(struct bnxt_ulp_context *ulp,
| ^~~~~~~~~~~~~~~~~~~~~~~~~~~~~~
../drivers/net/bnxt/tf_ulp/ulp_mapper_tfc.c:1695:1: error: invalid storage class for function ‘ulp_mapper_tfc_dyn_tbl_type_get’
1695 | ulp_mapper_tfc_dyn_tbl_type_get(struct bnxt_ulp_mapper_parms *parm __rte_unused,
| ^~~~~~~~~~~~~~~~~~~~~~~~~~~~~~~
../drivers/net/bnxt/tf_ulp/ulp_mapper_tfc.c:1715:1: error: invalid storage class for function ‘ulp_mapper_tfc_index_tbl_alloc_process’
1715 | ulp_mapper_tfc_index_tbl_alloc_process(struct bnxt_ulp_context *ulp,
| ^~~~~~~~~~~~~~~~~~~~~~~~~~~~~~~~~~~~~~
../drivers/net/bnxt/tf_ulp/ulp_mapper_tfc.c:1753:1: error: invalid storage class for function ‘ulp_mapper_tfc_app_glb_resource_info_init’
1753 | ulp_mapper_tfc_app_glb_resource_info_init(struct bnxt_ulp_context
| ^~~~~~~~~~~~~~~~~~~~~~~~~~~~~~~~~~~~~~~~~
../drivers/net/bnxt/tf_ulp/ulp_mapper_tfc.c:1763:1: error: invalid storage class for function ‘ulp_mapper_tfc_handle_to_offset’
1763 | ulp_mapper_tfc_handle_to_offset(struct bnxt_ulp_mapper_parms *parms __rte_unused,
| ^~~~~~~~~~~~~~~~~~~~~~~~~~~~~~~
../drivers/net/bnxt/tf_ulp/ulp_mapper_tfc.c:1797:1: error: invalid storage class for function ‘ulp_mapper_tfc_mpc_batch_start’
1797 | ulp_mapper_tfc_mpc_batch_start(struct tfc_mpc_batch_info_t *batch_info)
| ^~~~~~~~~~~~~~~~~~~~~~~~~~~~~~
../drivers/net/bnxt/tf_ulp/ulp_mapper_tfc.c:1803:1: error: invalid storage class for function ‘ulp_mapper_tfc_mtr_stats_hndl_set’
1803 | ulp_mapper_tfc_mtr_stats_hndl_set(struct bnxt_ulp_mapper_parms *parms __rte_unused,
| ^~~~~~~~~~~~~~~~~~~~~~~~~~~~~~~~~
../drivers/net/bnxt/tf_ulp/ulp_mapper_tfc.c:1821:1: error: invalid storage class for function ‘ulp_mapper_tfc_mtr_stats_hndl_get’
1821 | ulp_mapper_tfc_mtr_stats_hndl_get(uint32_t mtr_id, uint64_t *stats_hndl)
| ^~~~~~~~~~~~~~~~~~~~~~~~~~~~~~~~~
../drivers/net/bnxt/tf_ulp/ulp_mapper_tfc.c:1837:1: error: invalid storage class for function ‘ulp_mapper_tfc_mtr_stats_hndl_del’
1837 | ulp_mapper_tfc_mtr_stats_hndl_del(uint32_t mtr_id)
| ^~~~~~~~~~~~~~~~~~~~~~~~~~~~~~~~~
../drivers/net/bnxt/tf_ulp/ulp_mapper_tfc.c:1852:1: error: invalid storage class for function ‘ulp_mapper_tfc_glb_idx_tbl_alloc’
1852 | ulp_mapper_tfc_glb_idx_tbl_alloc(struct bnxt_ulp_context *ulp_ctx,
| ^~~~~~~~~~~~~~~~~~~~~~~~~~~~~~~~
../drivers/net/bnxt/tf_ulp/ulp_mapper_tfc.c:1892:1: error: invalid storage class for function ‘ulp_mapper_tfc_glb_idx_tbl_free’
1892 | ulp_mapper_tfc_glb_idx_tbl_free(struct bnxt_ulp_context *ulp_ctx,
| ^~~~~~~~~~~~~~~~~~~~~~~~~~~~~~~
../drivers/net/bnxt/tf_ulp/ulp_mapper_tfc.c:1926:1: error: invalid storage class for function ‘ulp_mapper_tfc_tcam_prio_update’
1926 | ulp_mapper_tfc_tcam_prio_update(struct bnxt_ulp_mapper_parms *parms,
| ^~~~~~~~~~~~~~~~~~~~~~~~~~~~~~~
../drivers/net/bnxt/tf_ulp/ulp_mapper_tfc.c:1990:1: error: expected declaration or statement at end of input
1990 | };
| ^
../drivers/net/bnxt/tf_ulp/ulp_mapper_tfc.c:1961:34: error: unused variable ‘ulp_mapper_tfc_core_ops’ [-Werror=unused-variable]
1961 | const struct ulp_mapper_core_ops ulp_mapper_tfc_core_ops = {
| ^~~~~~~~~~~~~~~~~~~~~~~
../drivers/net/bnxt/tf_ulp/ulp_mapper_tfc.c: At top level:
../drivers/net/bnxt/tf_ulp/ulp_mapper_tfc.c:457:1: error: ‘ulp_mapper_tfc_em_tbl_process’ defined but not used [-Werror=unused-function]
457 | ulp_mapper_tfc_em_tbl_process(struct bnxt_ulp_mapper_parms *parms,
| ^~~~~~~~~~~~~~~~~~~~~~~~~~~~~
cc1: all warnings being treated as errors
[1350/3941] Compiling C object drivers/libtmp_rte_net_bnxt.a.p/net_bnxt_tf_ulp_bnxt_ulp_tf.c.o
[1351/3941] Compiling C object drivers/libtmp_rte_net_bnxt.a.p/net_bnxt_tf_ulp_ulp_mapper_tf.c.o
[1352/3941] Compiling C object drivers/libtmp_rte_net_bnxt.a.p/net_bnxt_tf_ulp_ulp_sc_mgr.c.o
[1353/3941] Compiling C object drivers/libtmp_rte_net_bnxt.a.p/net_bnxt_tf_ulp_ulp_fc_mgr_tfc.c.o
[1354/3941] Compiling C object drivers/libtmp_rte_net_bnxt.a.p/net_bnxt_tf_ulp_bnxt_ulp_tfc.c.o
[1355/3941] Compiling C object drivers/libtmp_rte_net_bnxt.a.p/net_bnxt_tf_ulp_ulp_fc_mgr_tf.c.o
[1356/3941] Compiling C object drivers/libtmp_rte_net_bnxt.a.p/net_bnxt_tf_ulp_ulp_alloc_tbl.c.o
[1357/3941] Compiling C object drivers/libtmp_rte_net_bnxt.a.p/net_bnxt_tf_ulp_ulp_mapper.c.o
[1358/3941] Compiling C object drivers/libtmp_rte_net_bnxt.a.p/net_bnxt_tf_ulp_ulp_rte_parser.c.o
ninja: build stopped
*Build Failed #16:
OS: UB2604-64
Target: x86_64-native-linuxapp-gcc
FAILED: drivers/libtmp_rte_net_bnxt.a.p/net_bnxt_tf_ulp_ulp_mapper_tfc.c.o
gcc -Idrivers/libtmp_rte_net_bnxt.a.p -Idrivers -I../drivers -Idrivers/net/bnxt -I../drivers/net/bnxt -Idrivers/net/bnxt/tf_ulp -I../drivers/net/bnxt/tf_ulp -Idrivers/net/bnxt/tf_ulp/generic_templates -I../drivers/net/bnxt/tf_ulp/generic_templates -Idrivers/net/bnxt/tf_core -I../drivers/net/bnxt/tf_core -Idrivers/net/bnxt/tf_core/v3 -I../drivers/net/bnxt/tf_core/v3 -Idrivers/net/bnxt/hcapi/cfa -I../drivers/net/bnxt/hcapi/cfa -Idrivers/net/bnxt/hcapi/cfa_v3 -I../drivers/net/bnxt/hcapi/cfa_v3 -I../drivers/net/bnxt/hcapi/cfa_v3/include -I../drivers/net/bnxt/hcapi/cfa_v3/include/platform/dpdk -I../drivers/net/bnxt/hcapi/cfa_v3/bld/p70 -I../drivers/net/bnxt/hcapi/cfa_v3/bld/p70/host -I../drivers/net/bnxt/hcapi/cfa_v3/bld/include -I../drivers/net/bnxt/hcapi/cfa_v3/bld/include/host -I../drivers/net/bnxt/hcapi/cfa_v3/bld/include/p70 -I../drivers/net/bnxt/hcapi/cfa_v3/mm/include -I../drivers/net/bnxt/hcapi/cfa_v3/tim/include -I../drivers/net/bnxt/hcapi/cfa_v3/tpm/include -Ilib/ethdev -I../lib/ethdev -Ilib/eal/common -I../lib/eal/common -I. -I.. -Iconfig -I../config -Ilib/eal/include -I../lib/eal/include -Ilib/eal/linux/include -I../lib/eal/linux/include -Ilib/eal/x86/include -I../lib/eal/x86/include -I../kernel/linux -Ilib/eal -I../lib/eal -Ilib/kvargs -I../lib/kvargs -Ilib/log -I../lib/log -Ilib/metrics -I../lib/metrics -Ilib/telemetry -I../lib/telemetry -Ilib/argparse -I../lib/argparse -Ilib/net -I../lib/net -Ilib/mbuf -I../lib/mbuf -Ilib/mempool -I../lib/mempool -Ilib/ring -I../lib/ring -Ilib/meter -I../lib/meter -Idrivers/bus/pci -I../drivers/bus/pci -I../drivers/bus/pci/linux -Ilib/pci -I../lib/pci -Idrivers/bus/vdev -I../drivers/bus/vdev -Ilib/hash -I../lib/hash -Ilib/rcu -I../lib/rcu -fdiagnostics-color=always -D_FILE_OFFSET_BITS=64 -Wall -Winvalid-pch -Wextra -Werror -std=c11 -O3 -include rte_config.h -Wvla -Wcast-qual -Wdeprecated -Wformat -Wformat-nonliteral -Wformat-security -Wmissing-declarations -Wmissing-prototypes -Wnested-externs -Wold-style-definition -Wpointer-arith -Wshadow -Wsign-compare -Wstrict-prototypes -Wundef -Wwrite-strings -Wno-packed-not-aligned -Wno-missing-field-initializers -fzero-init-padding-bits=all -D_GNU_SOURCE -fPIC -march=native -mrtm -DALLOW_EXPERIMENTAL_API -DALLOW_INTERNAL_API -Wno-format-truncation -Wno-address-of-packed-member -Wno-vla -Wno-shadow -DBNXT_TF_APP_ID=0 -DSUPPORT_CFA_HW_P70=1 -DCFA_BLD_PRINT_OBJ=1 -DRTE_COMPONENT_CLASS=pmd_net -DRTE_COMPONENT_NAME=bnxt -DRTE_LOG_DEFAULT_LOGTYPE=pmd.net.bnxt -MD -MQ drivers/libtmp_rte_net_bnxt.a.p/net_bnxt_tf_ulp_ulp_mapper_tfc.c.o -MF drivers/libtmp_rte_net_bnxt.a.p/net_bnxt_tf_ulp_ulp_mapper_tfc.c.o.d -o drivers/libtmp_rte_net_bnxt.a.p/net_bnxt_tf_ulp_ulp_mapper_tfc.c.o -c ../drivers/net/bnxt/tf_ulp/ulp_mapper_tfc.c
../drivers/net/bnxt/tf_ulp/ulp_mapper_tfc.c: In function ‘ulp_mapper_tfc_em_tbl_process’:
../drivers/net/bnxt/tf_ulp/ulp_mapper_tfc.c:659:1: error: invalid storage class for function ‘ulp_mapper_tfc_em_entry_free’
659 | ulp_mapper_tfc_em_entry_free(struct bnxt_ulp_context *ulp,
| ^~~~~~~~~~~~~~~~~~~~~~~~~~~~
../drivers/net/bnxt/tf_ulp/ulp_mapper_tfc.c:708:1: error: invalid storage class for function ‘ulp_mapper_tfc_dyn_blob_size_get’
708 | ulp_mapper_tfc_dyn_blob_size_get(struct bnxt_ulp_mapper_parms *mparms,
| ^~~~~~~~~~~~~~~~~~~~~~~~~~~~~~~~
../drivers/net/bnxt/tf_ulp/ulp_mapper_tfc.c:731:1: error: invalid storage class for function ‘ulp_mapper_tfc_index_tbl_process’
731 | ulp_mapper_tfc_index_tbl_process(struct bnxt_ulp_mapper_parms *parms,
| ^~~~~~~~~~~~~~~~~~~~~~~~~~~~~~~~
../drivers/net/bnxt/tf_ulp/ulp_mapper_tfc.c:1029:1: error: invalid storage class for function ‘ulp_mapper_tfc_index_entry_free’
1029 | ulp_mapper_tfc_index_entry_free(struct bnxt_ulp_context *ulp_ctx,
| ^~~~~~~~~~~~~~~~~~~~~~~~~~~~~~~
../drivers/net/bnxt/tf_ulp/ulp_mapper_tfc.c:1060:1: error: invalid storage class for function ‘ulp_mapper_tfc_cmm_tbl_process’
1060 | ulp_mapper_tfc_cmm_tbl_process(struct bnxt_ulp_mapper_parms *parms,
| ^~~~~~~~~~~~~~~~~~~~~~~~~~~~~~
../drivers/net/bnxt/tf_ulp/ulp_mapper_tfc.c:1368:1: error: invalid storage class for function ‘ulp_mapper_tfc_cmm_entry_free’
1368 | ulp_mapper_tfc_cmm_entry_free(struct bnxt_ulp_context *ulp_ctx,
| ^~~~~~~~~~~~~~~~~~~~~~~~~~~~~
../drivers/net/bnxt/tf_ulp/ulp_mapper_tfc.c:1418:1: error: invalid storage class for function ‘ulp_mapper_tfc_if_tbl_process’
1418 | ulp_mapper_tfc_if_tbl_process(struct bnxt_ulp_mapper_parms *parms,
| ^~~~~~~~~~~~~~~~~~~~~~~~~~~~~
../drivers/net/bnxt/tf_ulp/ulp_mapper_tfc.c:1519:1: error: invalid storage class for function ‘ulp_mapper_tfc_ident_alloc’
1519 | ulp_mapper_tfc_ident_alloc(struct bnxt_ulp_context *ulp_ctx,
| ^~~~~~~~~~~~~~~~~~~~~~~~~~
../drivers/net/bnxt/tf_ulp/ulp_mapper_tfc.c:1556:1: error: invalid storage class for function ‘ulp_mapper_tfc_ident_free’
1556 | ulp_mapper_tfc_ident_free(struct bnxt_ulp_context *ulp_ctx,
| ^~~~~~~~~~~~~~~~~~~~~~~~~
../drivers/net/bnxt/tf_ulp/ulp_mapper_tfc.c:1589:1: error: invalid storage class for function ‘ulp_mapper_tfc_global_ident_alloc’
1589 | ulp_mapper_tfc_global_ident_alloc(struct bnxt_ulp_context *ulp_ctx,
| ^~~~~~~~~~~~~~~~~~~~~~~~~~~~~~~~~
../drivers/net/bnxt/tf_ulp/ulp_mapper_tfc.c:1631:1: error: invalid storage class for function ‘ulp_mapper_tfc_global_ident_free’
1631 | ulp_mapper_tfc_global_ident_free(struct bnxt_ulp_context *ulp_ctx,
| ^~~~~~~~~~~~~~~~~~~~~~~~~~~~~~~~
../drivers/net/bnxt/tf_ulp/ulp_mapper_tfc.c:1665:1: error: invalid storage class for function ‘ulp_mapper_tfc_tcam_entry_free’
1665 | ulp_mapper_tfc_tcam_entry_free(struct bnxt_ulp_context *ulp,
| ^~~~~~~~~~~~~~~~~~~~~~~~~~~~~~
../drivers/net/bnxt/tf_ulp/ulp_mapper_tfc.c:1695:1: error: invalid storage class for function ‘ulp_mapper_tfc_dyn_tbl_type_get’
1695 | ulp_mapper_tfc_dyn_tbl_type_get(struct bnxt_ulp_mapper_parms *parm __rte_unused,
| ^~~~~~~~~~~~~~~~~~~~~~~~~~~~~~~
../drivers/net/bnxt/tf_ulp/ulp_mapper_tfc.c:1715:1: error: invalid storage class for function ‘ulp_mapper_tfc_index_tbl_alloc_process’
1715 | ulp_mapper_tfc_index_tbl_alloc_process(struct bnxt_ulp_context *ulp,
| ^~~~~~~~~~~~~~~~~~~~~~~~~~~~~~~~~~~~~~
../drivers/net/bnxt/tf_ulp/ulp_mapper_tfc.c:1753:1: error: invalid storage class for function ‘ulp_mapper_tfc_app_glb_resource_info_init’
1753 | ulp_mapper_tfc_app_glb_resource_info_init(struct bnxt_ulp_context
| ^~~~~~~~~~~~~~~~~~~~~~~~~~~~~~~~~~~~~~~~~
../drivers/net/bnxt/tf_ulp/ulp_mapper_tfc.c:1763:1: error: invalid storage class for function ‘ulp_mapper_tfc_handle_to_offset’
1763 | ulp_mapper_tfc_handle_to_offset(struct bnxt_ulp_mapper_parms *parms __rte_unused,
| ^~~~~~~~~~~~~~~~~~~~~~~~~~~~~~~
../drivers/net/bnxt/tf_ulp/ulp_mapper_tfc.c:1797:1: error: invalid storage class for function ‘ulp_mapper_tfc_mpc_batch_start’
1797 | ulp_mapper_tfc_mpc_batch_start(struct tfc_mpc_batch_info_t *batch_info)
| ^~~~~~~~~~~~~~~~~~~~~~~~~~~~~~
../drivers/net/bnxt/tf_ulp/ulp_mapper_tfc.c:1803:1: error: invalid storage class for function ‘ulp_mapper_tfc_mtr_stats_hndl_set’
1803 | ulp_mapper_tfc_mtr_stats_hndl_set(struct bnxt_ulp_mapper_parms *parms __rte_unused,
| ^~~~~~~~~~~~~~~~~~~~~~~~~~~~~~~~~
../drivers/net/bnxt/tf_ulp/ulp_mapper_tfc.c:1821:1: error: invalid storage class for function ‘ulp_mapper_tfc_mtr_stats_hndl_get’
1821 | ulp_mapper_tfc_mtr_stats_hndl_get(uint32_t mtr_id, uint64_t *stats_hndl)
| ^~~~~~~~~~~~~~~~~~~~~~~~~~~~~~~~~
../drivers/net/bnxt/tf_ulp/ulp_mapper_tfc.c:1837:1: error: invalid storage class for function ‘ulp_mapper_tfc_mtr_stats_hndl_del’
1837 | ulp_mapper_tfc_mtr_stats_hndl_del(uint32_t mtr_id)
| ^~~~~~~~~~~~~~~~~~~~~~~~~~~~~~~~~
../drivers/net/bnxt/tf_ulp/ulp_mapper_tfc.c:1852:1: error: invalid storage class for function ‘ulp_mapper_tfc_glb_idx_tbl_alloc’
1852 | ulp_mapper_tfc_glb_idx_tbl_alloc(struct bnxt_ulp_context *ulp_ctx,
| ^~~~~~~~~~~~~~~~~~~~~~~~~~~~~~~~
../drivers/net/bnxt/tf_ulp/ulp_mapper_tfc.c:1892:1: error: invalid storage class for function ‘ulp_mapper_tfc_glb_idx_tbl_free’
1892 | ulp_mapper_tfc_glb_idx_tbl_free(struct bnxt_ulp_context *ulp_ctx,
| ^~~~~~~~~~~~~~~~~~~~~~~~~~~~~~~
../drivers/net/bnxt/tf_ulp/ulp_mapper_tfc.c:1926:1: error: invalid storage class for function ‘ulp_mapper_tfc_tcam_prio_update’
1926 | ulp_mapper_tfc_tcam_prio_update(struct bnxt_ulp_mapper_parms *parms,
| ^~~~~~~~~~~~~~~~~~~~~~~~~~~~~~~
../drivers/net/bnxt/tf_ulp/ulp_mapper_tfc.c:1990:1: error: expected declaration or statement at end of input
1990 | };
| ^
../drivers/net/bnxt/tf_ulp/ulp_mapper_tfc.c:1961:34: error: unused variable ‘ulp_mapper_tfc_core_ops’ [-Werror=unused-variable]
1961 | const struct ulp_mapper_core_ops ulp_mapper_tfc_core_ops = {
| ^~~~~~~~~~~~~~~~~~~~~~~
../drivers/net/bnxt/tf_ulp/ulp_mapper_tfc.c: At top level:
../drivers/net/bnxt/tf_ulp/ulp_mapper_tfc.c:457:1: error: ‘ulp_mapper_tfc_em_tbl_process’ defined but not used [-Werror=unused-function]
457 | ulp_mapper_tfc_em_tbl_process(struct bnxt_ulp_mapper_parms *parms,
| ^~~~~~~~~~~~~~~~~~~~~~~~~~~~~
cc1: all warnings being treated as errors
[1353/3941] Compiling C object drivers/libtmp_rte_net_bnxt.a.p/net_bnxt_tf_ulp_bnxt_ulp_tf.c.o
[1354/3941] Compiling C object drivers/libtmp_rte_net_bnxt.a.p/net_bnxt_tf_ulp_ulp_mapper_tf.c.o
[1355/3941] Compiling C object drivers/libtmp_rte_net_bnxt.a.p/net_bnxt_tf_ulp_ulp_sc_mgr.c.o
[1356/3941] Compiling C object drivers/libtmp_rte_net_bnxt.a.p/net_bnxt_tf_ulp_ulp_fc_mgr_tfc.c.o
[1357/3941] Compiling C object drivers/libtmp_rte_net_bnxt.a.p/net_bnxt_tf_ulp_ulp_fc_mgr_tf.c.o
[1358/3941] Compiling C object drivers/libtmp_rte_net_bnxt.a.p/net_bnxt_tf_ulp_bnxt_ulp_tfc.c.o
[1359/3941] Compiling C object drivers/libtmp_rte_net_bnxt.a.p/net_bnxt_tf_ulp_ulp_alloc_tbl.c.o
[1360/3941] Compiling C object drivers/libtmp_rte_net_bnxt.a.p/net_bnxt_tf_ulp_ulp_mapper.c.o
[1361/3941] Compiling C object drivers/libtmp_rte_net_bnxt.a.p/net_bnxt_tf_ulp_ulp_rte_parser.c.o
ninja: build stopped
*Build Failed #17:
OS: UB2604-64
Target: x86_64-native-linuxapp-clang
FAILED: drivers/libtmp_rte_net_bnxt.a.p/net_bnxt_tf_ulp_ulp_mapper_tfc.c.o
clang -Idrivers/libtmp_rte_net_bnxt.a.p -Idrivers -I../drivers -Idrivers/net/bnxt -I../drivers/net/bnxt -Idrivers/net/bnxt/tf_ulp -I../drivers/net/bnxt/tf_ulp -Idrivers/net/bnxt/tf_ulp/generic_templates -I../drivers/net/bnxt/tf_ulp/generic_templates -Idrivers/net/bnxt/tf_core -I../drivers/net/bnxt/tf_core -Idrivers/net/bnxt/tf_core/v3 -I../drivers/net/bnxt/tf_core/v3 -Idrivers/net/bnxt/hcapi/cfa -I../drivers/net/bnxt/hcapi/cfa -Idrivers/net/bnxt/hcapi/cfa_v3 -I../drivers/net/bnxt/hcapi/cfa_v3 -I../drivers/net/bnxt/hcapi/cfa_v3/include -I../drivers/net/bnxt/hcapi/cfa_v3/include/platform/dpdk -I../drivers/net/bnxt/hcapi/cfa_v3/bld/p70 -I../drivers/net/bnxt/hcapi/cfa_v3/bld/p70/host -I../drivers/net/bnxt/hcapi/cfa_v3/bld/include -I../drivers/net/bnxt/hcapi/cfa_v3/bld/include/host -I../drivers/net/bnxt/hcapi/cfa_v3/bld/include/p70 -I../drivers/net/bnxt/hcapi/cfa_v3/mm/include -I../drivers/net/bnxt/hcapi/cfa_v3/tim/include -I../drivers/net/bnxt/hcapi/cfa_v3/tpm/include -Ilib/ethdev -I../lib/ethdev -Ilib/eal/common -I../lib/eal/common -I. -I.. -Iconfig -I../config -Ilib/eal/include -I../lib/eal/include -Ilib/eal/linux/include -I../lib/eal/linux/include -Ilib/eal/x86/include -I../lib/eal/x86/include -I../kernel/linux -Ilib/eal -I../lib/eal -Ilib/kvargs -I../lib/kvargs -Ilib/log -I../lib/log -Ilib/metrics -I../lib/metrics -Ilib/telemetry -I../lib/telemetry -Ilib/argparse -I../lib/argparse -Ilib/net -I../lib/net -Ilib/mbuf -I../lib/mbuf -Ilib/mempool -I../lib/mempool -Ilib/ring -I../lib/ring -Ilib/meter -I../lib/meter -Idrivers/bus/pci -I../drivers/bus/pci -I../drivers/bus/pci/linux -Ilib/pci -I../lib/pci -Idrivers/bus/vdev -I../drivers/bus/vdev -Ilib/hash -I../lib/hash -Ilib/rcu -I../lib/rcu -fdiagnostics-color=always -D_FILE_OFFSET_BITS=64 -Wall -Winvalid-pch -Wextra -Werror -std=c11 -O3 -include rte_config.h -Wvla -Wcast-qual -Wcomma -Wdeprecated -Wformat -Wformat-nonliteral -Wformat-security -Wmissing-declarations -Wmissing-prototypes -Wnested-externs -Wold-style-definition -Wpointer-arith -Wshadow -Wsign-compare -Wstrict-prototypes -Wundef -Wwrite-strings -Wno-missing-field-initializers -D_GNU_SOURCE -fPIC -march=native -mrtm -DALLOW_EXPERIMENTAL_API -DALLOW_INTERNAL_API -Wno-format-truncation -Wno-address-of-packed-member -Wno-vla -Wno-shadow -DBNXT_TF_APP_ID=0 -DSUPPORT_CFA_HW_P70=1 -DCFA_BLD_PRINT_OBJ=1 -DRTE_COMPONENT_CLASS=pmd_net -DRTE_COMPONENT_NAME=bnxt -DRTE_LOG_DEFAULT_LOGTYPE=pmd.net.bnxt -MD -MQ drivers/libtmp_rte_net_bnxt.a.p/net_bnxt_tf_ulp_ulp_mapper_tfc.c.o -MF drivers/libtmp_rte_net_bnxt.a.p/net_bnxt_tf_ulp_ulp_mapper_tfc.c.o.d -o drivers/libtmp_rte_net_bnxt.a.p/net_bnxt_tf_ulp_ulp_mapper_tfc.c.o -c ../drivers/net/bnxt/tf_ulp/ulp_mapper_tfc.c
../drivers/net/bnxt/tf_ulp/ulp_mapper_tfc.c:662:1: error: function definition is not allowed here
662 | {
| ^
../drivers/net/bnxt/tf_ulp/ulp_mapper_tfc.c:710:1: error: function definition is not allowed here
710 | {
| ^
../drivers/net/bnxt/tf_ulp/ulp_mapper_tfc.c:733:1: error: function definition is not allowed here
733 | {
| ^
../drivers/net/bnxt/tf_ulp/ulp_mapper_tfc.c:1031:1: error: function definition is not allowed here
1031 | {
| ^
../drivers/net/bnxt/tf_ulp/ulp_mapper_tfc.c:1063:1: error: function definition is not allowed here
1063 | {
| ^
../drivers/net/bnxt/tf_ulp/ulp_mapper_tfc.c:1371:1: error: function definition is not allowed here
1371 | {
| ^
../drivers/net/bnxt/tf_ulp/ulp_mapper_tfc.c:1420:1: error: function definition is not allowed here
1420 | {
| ^
../drivers/net/bnxt/tf_ulp/ulp_mapper_tfc.c:1525:1: error: function definition is not allowed here
1525 | {
| ^
../drivers/net/bnxt/tf_ulp/ulp_mapper_tfc.c:1558:1: error: function definition is not allowed here
1558 | {
| ^
../drivers/net/bnxt/tf_ulp/ulp_mapper_tfc.c:1595:1: error: function definition is not allowed here
1595 | {
| ^
../drivers/net/bnxt/tf_ulp/ulp_mapper_tfc.c:1633:1: error: function definition is not allowed here
1633 | {
| ^
../drivers/net/bnxt/tf_ulp/ulp_mapper_tfc.c:1667:1: error: function definition is not allowed here
1667 | {
| ^
../drivers/net/bnxt/tf_ulp/ulp_mapper_tfc.c:1699:1: error: function definition is not allowed here
1699 | {
| ^
../drivers/net/bnxt/tf_ulp/ulp_mapper_tfc.c:1720:1: error: function definition is not allowed here
1720 | {
| ^
../drivers/net/bnxt/tf_ulp/ulp_mapper_tfc.c:1757:1: error: function definition is not allowed here
1757 | {
| ^
../drivers/net/bnxt/tf_ulp/ulp_mapper_tfc.c:1767:1: error: function definition is not allowed here
1767 | {
| ^
../drivers/net/bnxt/tf_ulp/ulp_mapper_tfc.c:1798:1: error: function definition is not allowed here
1798 | {
| ^
../drivers/net/bnxt/tf_ulp/ulp_mapper_tfc.c:1805:1: error: function definition is not allowed here
1805 | {
| ^
../drivers/net/bnxt/tf_ulp/ulp_mapper_tfc.c:1822:1: error: function definition is not allowed here
1822 | {
| ^
fatal error: too many errors emitted, stopping now [-ferror-limit=]
20 errors generated.
[1353/3942] Compiling C object drivers/libtmp_rte_net_bnxt.a.p/net_bnxt_tf_ulp_ulp_mapper.c.o
[1354/3942] Compiling C object drivers/libtmp_rte_net_bnxt.a.p/net_bnxt_tf_ulp_ulp_sc_mgr.c.o
[1355/3942] Compiling C object drivers/libtmp_rte_net_bnxt.a.p/net_bnxt_tf_ulp_bnxt_ulp_tfc.c.o
[1356/3942] Compiling C object drivers/libtmp_rte_net_bnxt.a.p/net_bnxt_tf_ulp_bnxt_ulp_tf.c.o
[1357/3942] Compiling C object drivers/libtmp_rte_net_bnxt.a.p/net_bnxt_tf_ulp_ulp_mapper_tf.c.o
[1358/3942] Compiling C object drivers/libtmp_rte_net_bnxt.a.p/net_bnxt_tf_ulp_ulp_fc_mgr_tfc.c.o
[1359/3942] Compiling C object drivers/libtmp_rte_net_bnxt.a.p/net_bnxt_tf_ulp_ulp_rte_parser.c.o
[1360/3942] Compiling C object drivers/libtmp_rte_net_bnxt.a.p/net_bnxt_tf_ulp_ulp_fc_mgr_tf.c.o
[1361/3942] Compiling C object drivers/libtmp_rte_net_bnxt.a.p/net_bnxt_tf_ulp_ulp_alloc_tbl.c.o
ninja: build stopped
*Build Failed #18:
OS: UB2604-64
Target: x86_64-native-linuxapp-doc
FAILED: drivers/libtmp_rte_net_bnxt.a.p/net_bnxt_tf_ulp_ulp_mapper_tfc.c.o
gcc -Idrivers/libtmp_rte_net_bnxt.a.p -Idrivers -I../drivers -Idrivers/net/bnxt -I../drivers/net/bnxt -Idrivers/net/bnxt/tf_ulp -I../drivers/net/bnxt/tf_ulp -Idrivers/net/bnxt/tf_ulp/generic_templates -I../drivers/net/bnxt/tf_ulp/generic_templates -Idrivers/net/bnxt/tf_core -I../drivers/net/bnxt/tf_core -Idrivers/net/bnxt/tf_core/v3 -I../drivers/net/bnxt/tf_core/v3 -Idrivers/net/bnxt/hcapi/cfa -I../drivers/net/bnxt/hcapi/cfa -Idrivers/net/bnxt/hcapi/cfa_v3 -I../drivers/net/bnxt/hcapi/cfa_v3 -I../drivers/net/bnxt/hcapi/cfa_v3/include -I../drivers/net/bnxt/hcapi/cfa_v3/include/platform/dpdk -I../drivers/net/bnxt/hcapi/cfa_v3/bld/p70 -I../drivers/net/bnxt/hcapi/cfa_v3/bld/p70/host -I../drivers/net/bnxt/hcapi/cfa_v3/bld/include -I../drivers/net/bnxt/hcapi/cfa_v3/bld/include/host -I../drivers/net/bnxt/hcapi/cfa_v3/bld/include/p70 -I../drivers/net/bnxt/hcapi/cfa_v3/mm/include -I../drivers/net/bnxt/hcapi/cfa_v3/tim/include -I../drivers/net/bnxt/hcapi/cfa_v3/tpm/include -Ilib/ethdev -I../lib/ethdev -Ilib/eal/common -I../lib/eal/common -I. -I.. -Iconfig -I../config -Ilib/eal/include -I../lib/eal/include -Ilib/eal/linux/include -I../lib/eal/linux/include -Ilib/eal/x86/include -I../lib/eal/x86/include -I../kernel/linux -Ilib/eal -I../lib/eal -Ilib/kvargs -I../lib/kvargs -Ilib/log -I../lib/log -Ilib/metrics -I../lib/metrics -Ilib/telemetry -I../lib/telemetry -Ilib/argparse -I../lib/argparse -Ilib/net -I../lib/net -Ilib/mbuf -I../lib/mbuf -Ilib/mempool -I../lib/mempool -Ilib/ring -I../lib/ring -Ilib/meter -I../lib/meter -Idrivers/bus/pci -I../drivers/bus/pci -I../drivers/bus/pci/linux -Ilib/pci -I../lib/pci -Idrivers/bus/vdev -I../drivers/bus/vdev -Ilib/hash -I../lib/hash -Ilib/rcu -I../lib/rcu -fdiagnostics-color=always -D_FILE_OFFSET_BITS=64 -Wall -Winvalid-pch -Wextra -Werror -std=c11 -O3 -include rte_config.h -Wvla -Wcast-qual -Wdeprecated -Wformat -Wformat-nonliteral -Wformat-security -Wmissing-declarations -Wmissing-prototypes -Wnested-externs -Wold-style-definition -Wpointer-arith -Wshadow -Wsign-compare -Wstrict-prototypes -Wundef -Wwrite-strings -Wno-packed-not-aligned -Wno-missing-field-initializers -fzero-init-padding-bits=all -D_GNU_SOURCE -fPIC -march=native -mrtm -DALLOW_EXPERIMENTAL_API -DALLOW_INTERNAL_API -Wno-format-truncation -Wno-address-of-packed-member -Wno-vla -Wno-shadow -DBNXT_TF_APP_ID=0 -DSUPPORT_CFA_HW_P70=1 -DCFA_BLD_PRINT_OBJ=1 -DRTE_COMPONENT_CLASS=pmd_net -DRTE_COMPONENT_NAME=bnxt -DRTE_LOG_DEFAULT_LOGTYPE=pmd.net.bnxt -MD -MQ drivers/libtmp_rte_net_bnxt.a.p/net_bnxt_tf_ulp_ulp_mapper_tfc.c.o -MF drivers/libtmp_rte_net_bnxt.a.p/net_bnxt_tf_ulp_ulp_mapper_tfc.c.o.d -o drivers/libtmp_rte_net_bnxt.a.p/net_bnxt_tf_ulp_ulp_mapper_tfc.c.o -c ../drivers/net/bnxt/tf_ulp/ulp_mapper_tfc.c
../drivers/net/bnxt/tf_ulp/ulp_mapper_tfc.c: In function ‘ulp_mapper_tfc_em_tbl_process’:
../drivers/net/bnxt/tf_ulp/ulp_mapper_tfc.c:659:1: error: invalid storage class for function ‘ulp_mapper_tfc_em_entry_free’
659 | ulp_mapper_tfc_em_entry_free(struct bnxt_ulp_context *ulp,
| ^~~~~~~~~~~~~~~~~~~~~~~~~~~~
../drivers/net/bnxt/tf_ulp/ulp_mapper_tfc.c:708:1: error: invalid storage class for function ‘ulp_mapper_tfc_dyn_blob_size_get’
708 | ulp_mapper_tfc_dyn_blob_size_get(struct bnxt_ulp_mapper_parms *mparms,
| ^~~~~~~~~~~~~~~~~~~~~~~~~~~~~~~~
../drivers/net/bnxt/tf_ulp/ulp_mapper_tfc.c:731:1: error: invalid storage class for function ‘ulp_mapper_tfc_index_tbl_process’
731 | ulp_mapper_tfc_index_tbl_process(struct bnxt_ulp_mapper_parms *parms,
| ^~~~~~~~~~~~~~~~~~~~~~~~~~~~~~~~
../drivers/net/bnxt/tf_ulp/ulp_mapper_tfc.c:1029:1: error: invalid storage class for function ‘ulp_mapper_tfc_index_entry_free’
1029 | ulp_mapper_tfc_index_entry_free(struct bnxt_ulp_context *ulp_ctx,
| ^~~~~~~~~~~~~~~~~~~~~~~~~~~~~~~
../drivers/net/bnxt/tf_ulp/ulp_mapper_tfc.c:1060:1: error: invalid storage class for function ‘ulp_mapper_tfc_cmm_tbl_process’
1060 | ulp_mapper_tfc_cmm_tbl_process(struct bnxt_ulp_mapper_parms *parms,
| ^~~~~~~~~~~~~~~~~~~~~~~~~~~~~~
../drivers/net/bnxt/tf_ulp/ulp_mapper_tfc.c:1368:1: error: invalid storage class for function ‘ulp_mapper_tfc_cmm_entry_free’
1368 | ulp_mapper_tfc_cmm_entry_free(struct bnxt_ulp_context *ulp_ctx,
| ^~~~~~~~~~~~~~~~~~~~~~~~~~~~~
../drivers/net/bnxt/tf_ulp/ulp_mapper_tfc.c:1418:1: error: invalid storage class for function ‘ulp_mapper_tfc_if_tbl_process’
1418 | ulp_mapper_tfc_if_tbl_process(struct bnxt_ulp_mapper_parms *parms,
| ^~~~~~~~~~~~~~~~~~~~~~~~~~~~~
../drivers/net/bnxt/tf_ulp/ulp_mapper_tfc.c:1519:1: error: invalid storage class for function ‘ulp_mapper_tfc_ident_alloc’
1519 | ulp_mapper_tfc_ident_alloc(struct bnxt_ulp_context *ulp_ctx,
| ^~~~~~~~~~~~~~~~~~~~~~~~~~
../drivers/net/bnxt/tf_ulp/ulp_mapper_tfc.c:1556:1: error: invalid storage class for function ‘ulp_mapper_tfc_ident_free’
1556 | ulp_mapper_tfc_ident_free(struct bnxt_ulp_context *ulp_ctx,
| ^~~~~~~~~~~~~~~~~~~~~~~~~
../drivers/net/bnxt/tf_ulp/ulp_mapper_tfc.c:1589:1: error: invalid storage class for function ‘ulp_mapper_tfc_global_ident_alloc’
1589 | ulp_mapper_tfc_global_ident_alloc(struct bnxt_ulp_context *ulp_ctx,
| ^~~~~~~~~~~~~~~~~~~~~~~~~~~~~~~~~
../drivers/net/bnxt/tf_ulp/ulp_mapper_tfc.c:1631:1: error: invalid storage class for function ‘ulp_mapper_tfc_global_ident_free’
1631 | ulp_mapper_tfc_global_ident_free(struct bnxt_ulp_context *ulp_ctx,
| ^~~~~~~~~~~~~~~~~~~~~~~~~~~~~~~~
../drivers/net/bnxt/tf_ulp/ulp_mapper_tfc.c:1665:1: error: invalid storage class for function ‘ulp_mapper_tfc_tcam_entry_free’
1665 | ulp_mapper_tfc_tcam_entry_free(struct bnxt_ulp_context *ulp,
| ^~~~~~~~~~~~~~~~~~~~~~~~~~~~~~
../drivers/net/bnxt/tf_ulp/ulp_mapper_tfc.c:1695:1: error: invalid storage class for function ‘ulp_mapper_tfc_dyn_tbl_type_get’
1695 | ulp_mapper_tfc_dyn_tbl_type_get(struct bnxt_ulp_mapper_parms *parm __rte_unused,
| ^~~~~~~~~~~~~~~~~~~~~~~~~~~~~~~
../drivers/net/bnxt/tf_ulp/ulp_mapper_tfc.c:1715:1: error: invalid storage class for function ‘ulp_mapper_tfc_index_tbl_alloc_process’
1715 | ulp_mapper_tfc_index_tbl_alloc_process(struct bnxt_ulp_context *ulp,
| ^~~~~~~~~~~~~~~~~~~~~~~~~~~~~~~~~~~~~~
../drivers/net/bnxt/tf_ulp/ulp_mapper_tfc.c:1753:1: error: invalid storage class for function ‘ulp_mapper_tfc_app_glb_resource_info_init’
1753 | ulp_mapper_tfc_app_glb_resource_info_init(struct bnxt_ulp_context
| ^~~~~~~~~~~~~~~~~~~~~~~~~~~~~~~~~~~~~~~~~
../drivers/net/bnxt/tf_ulp/ulp_mapper_tfc.c:1763:1: error: invalid storage class for function ‘ulp_mapper_tfc_handle_to_offset’
1763 | ulp_mapper_tfc_handle_to_offset(struct bnxt_ulp_mapper_parms *parms __rte_unused,
| ^~~~~~~~~~~~~~~~~~~~~~~~~~~~~~~
../drivers/net/bnxt/tf_ulp/ulp_mapper_tfc.c:1797:1: error: invalid storage class for function ‘ulp_mapper_tfc_mpc_batch_start’
1797 | ulp_mapper_tfc_mpc_batch_start(struct tfc_mpc_batch_info_t *batch_info)
| ^~~~~~~~~~~~~~~~~~~~~~~~~~~~~~
../drivers/net/bnxt/tf_ulp/ulp_mapper_tfc.c:1803:1: error: invalid storage class for function ‘ulp_mapper_tfc_mtr_stats_hndl_set’
1803 | ulp_mapper_tfc_mtr_stats_hndl_set(struct bnxt_ulp_mapper_parms *parms __rte_unused,
| ^~~~~~~~~~~~~~~~~~~~~~~~~~~~~~~~~
../drivers/net/bnxt/tf_ulp/ulp_mapper_tfc.c:1821:1: error: invalid storage class for function ‘ulp_mapper_tfc_mtr_stats_hndl_get’
1821 | ulp_mapper_tfc_mtr_stats_hndl_get(uint32_t mtr_id, uint64_t *stats_hndl)
| ^~~~~~~~~~~~~~~~~~~~~~~~~~~~~~~~~
../drivers/net/bnxt/tf_ulp/ulp_mapper_tfc.c:1837:1: error: invalid storage class for function ‘ulp_mapper_tfc_mtr_stats_hndl_del’
1837 | ulp_mapper_tfc_mtr_stats_hndl_del(uint32_t mtr_id)
| ^~~~~~~~~~~~~~~~~~~~~~~~~~~~~~~~~
../drivers/net/bnxt/tf_ulp/ulp_mapper_tfc.c:1852:1: error: invalid storage class for function ‘ulp_mapper_tfc_glb_idx_tbl_alloc’
1852 | ulp_mapper_tfc_glb_idx_tbl_alloc(struct bnxt_ulp_context *ulp_ctx,
| ^~~~~~~~~~~~~~~~~~~~~~~~~~~~~~~~
../drivers/net/bnxt/tf_ulp/ulp_mapper_tfc.c:1892:1: error: invalid storage class for function ‘ulp_mapper_tfc_glb_idx_tbl_free’
1892 | ulp_mapper_tfc_glb_idx_tbl_free(struct bnxt_ulp_context *ulp_ctx,
| ^~~~~~~~~~~~~~~~~~~~~~~~~~~~~~~
../drivers/net/bnxt/tf_ulp/ulp_mapper_tfc.c:1926:1: error: invalid storage class for function ‘ulp_mapper_tfc_tcam_prio_update’
1926 | ulp_mapper_tfc_tcam_prio_update(struct bnxt_ulp_mapper_parms *parms,
| ^~~~~~~~~~~~~~~~~~~~~~~~~~~~~~~
../drivers/net/bnxt/tf_ulp/ulp_mapper_tfc.c:1990:1: error: expected declaration or statement at end of input
1990 | };
| ^
../drivers/net/bnxt/tf_ulp/ulp_mapper_tfc.c:1961:34: error: unused variable ‘ulp_mapper_tfc_core_ops’ [-Werror=unused-variable]
1961 | const struct ulp_mapper_core_ops ulp_mapper_tfc_core_ops = {
| ^~~~~~~~~~~~~~~~~~~~~~~
../drivers/net/bnxt/tf_ulp/ulp_mapper_tfc.c: At top level:
../drivers/net/bnxt/tf_ulp/ulp_mapper_tfc.c:457:1: error: ‘ulp_mapper_tfc_em_tbl_process’ defined but not used [-Werror=unused-function]
457 | ulp_mapper_tfc_em_tbl_process(struct bnxt_ulp_mapper_parms *parms,
| ^~~~~~~~~~~~~~~~~~~~~~~~~~~~~
cc1: all warnings being treated as errors
[1353/3750] Compiling C object drivers/libtmp_rte_net_bnxt.a.p/net_bnxt_tf_ulp_bnxt_ulp_tf.c.o
[1354/3750] Compiling C object drivers/libtmp_rte_net_bnxt.a.p/net_bnxt_tf_ulp_ulp_mapper_tf.c.o
[1355/3750] Compiling C object drivers/libtmp_rte_net_bnxt.a.p/net_bnxt_tf_ulp_ulp_sc_mgr.c.o
[1356/3750] Compiling C object drivers/libtmp_rte_net_bnxt.a.p/net_bnxt_tf_ulp_ulp_fc_mgr_tfc.c.o
[1357/3750] Compiling C object drivers/libtmp_rte_net_bnxt.a.p/net_bnxt_tf_ulp_ulp_fc_mgr_tf.c.o
[1358/3750] Compiling C object drivers/libtmp_rte_net_bnxt.a.p/net_bnxt_tf_ulp_ulp_alloc_tbl.c.o
[1359/3750] Compiling C object drivers/libtmp_rte_net_bnxt.a.p/net_bnxt_tf_ulp_bnxt_ulp_tfc.c.o
[1360/3750] Compiling C object drivers/libtmp_rte_net_bnxt.a.p/net_bnxt_tf_ulp_ulp_mapper.c.o
[1361/3750] Compiling C object drivers/libtmp_rte_net_bnxt.a.p/net_bnxt_tf_ulp_ulp_rte_parser.c.o
ninja: build stopped
*Build Failed #19:
OS: RHEL10-64RT
Target: x86_64-native-linuxapp-gcc
FAILED: drivers/libtmp_rte_net_bnxt.a.p/net_bnxt_tf_ulp_ulp_mapper_tfc.c.o
gcc -Idrivers/libtmp_rte_net_bnxt.a.p -Idrivers -I../drivers -Idrivers/net/bnxt -I../drivers/net/bnxt -Idrivers/net/bnxt/tf_ulp -I../drivers/net/bnxt/tf_ulp -Idrivers/net/bnxt/tf_ulp/generic_templates -I../drivers/net/bnxt/tf_ulp/generic_templates -Idrivers/net/bnxt/tf_core -I../drivers/net/bnxt/tf_core -Idrivers/net/bnxt/tf_core/v3 -I../drivers/net/bnxt/tf_core/v3 -Idrivers/net/bnxt/hcapi/cfa -I../drivers/net/bnxt/hcapi/cfa -Idrivers/net/bnxt/hcapi/cfa_v3 -I../drivers/net/bnxt/hcapi/cfa_v3 -I../drivers/net/bnxt/hcapi/cfa_v3/include -I../drivers/net/bnxt/hcapi/cfa_v3/include/platform/dpdk -I../drivers/net/bnxt/hcapi/cfa_v3/bld/p70 -I../drivers/net/bnxt/hcapi/cfa_v3/bld/p70/host -I../drivers/net/bnxt/hcapi/cfa_v3/bld/include -I../drivers/net/bnxt/hcapi/cfa_v3/bld/include/host -I../drivers/net/bnxt/hcapi/cfa_v3/bld/include/p70 -I../drivers/net/bnxt/hcapi/cfa_v3/mm/include -I../drivers/net/bnxt/hcapi/cfa_v3/tim/include -I../drivers/net/bnxt/hcapi/cfa_v3/tpm/include -Ilib/ethdev -I../lib/ethdev -Ilib/eal/common -I../lib/eal/common -I. -I.. -Iconfig -I../config -Ilib/eal/include -I../lib/eal/include -Ilib/eal/linux/include -I../lib/eal/linux/include -Ilib/eal/x86/include -I../lib/eal/x86/include -I../kernel/linux -Ilib/eal -I../lib/eal -Ilib/kvargs -I../lib/kvargs -Ilib/log -I../lib/log -Ilib/metrics -I../lib/metrics -Ilib/telemetry -I../lib/telemetry -Ilib/argparse -I../lib/argparse -Ilib/net -I../lib/net -Ilib/mbuf -I../lib/mbuf -Ilib/mempool -I../lib/mempool -Ilib/ring -I../lib/ring -Ilib/meter -I../lib/meter -Idrivers/bus/pci -I../drivers/bus/pci -I../drivers/bus/pci/linux -Ilib/pci -I../lib/pci -Idrivers/bus/vdev -I../drivers/bus/vdev -Ilib/hash -I../lib/hash -Ilib/rcu -I../lib/rcu -fdiagnostics-color=always -D_FILE_OFFSET_BITS=64 -Wall -Winvalid-pch -Wextra -Werror -std=c11 -O3 -include rte_config.h -Wvla -Wcast-qual -Wdeprecated -Wformat -Wformat-nonliteral -Wformat-security -Wmissing-declarations -Wmissing-prototypes -Wnested-externs -Wold-style-definition -Wpointer-arith -Wshadow -Wsign-compare -Wstrict-prototypes -Wundef -Wwrite-strings -Wno-packed-not-aligned -Wno-missing-field-initializers -D_GNU_SOURCE -fPIC -march=native -mrtm -DALLOW_EXPERIMENTAL_API -DALLOW_INTERNAL_API -Wno-format-truncation -Wno-address-of-packed-member -Wno-vla -Wno-shadow -DBNXT_TF_APP_ID=0 -DSUPPORT_CFA_HW_P70=1 -DCFA_BLD_PRINT_OBJ=1 -DRTE_COMPONENT_CLASS=pmd_net -DRTE_COMPONENT_NAME=bnxt -DRTE_LOG_DEFAULT_LOGTYPE=pmd.net.bnxt -MD -MQ drivers/libtmp_rte_net_bnxt.a.p/net_bnxt_tf_ulp_ulp_mapper_tfc.c.o -MF drivers/libtmp_rte_net_bnxt.a.p/net_bnxt_tf_ulp_ulp_mapper_tfc.c.o.d -o drivers/libtmp_rte_net_bnxt.a.p/net_bnxt_tf_ulp_ulp_mapper_tfc.c.o -c ../drivers/net/bnxt/tf_ulp/ulp_mapper_tfc.c
../drivers/net/bnxt/tf_ulp/ulp_mapper_tfc.c: In function ‘ulp_mapper_tfc_em_tbl_process’:
../drivers/net/bnxt/tf_ulp/ulp_mapper_tfc.c:659:1: error: invalid storage class for function ‘ulp_mapper_tfc_em_entry_free’
659 | ulp_mapper_tfc_em_entry_free(struct bnxt_ulp_context *ulp,
| ^~~~~~~~~~~~~~~~~~~~~~~~~~~~
../drivers/net/bnxt/tf_ulp/ulp_mapper_tfc.c:708:1: error: invalid storage class for function ‘ulp_mapper_tfc_dyn_blob_size_get’
708 | ulp_mapper_tfc_dyn_blob_size_get(struct bnxt_ulp_mapper_parms *mparms,
| ^~~~~~~~~~~~~~~~~~~~~~~~~~~~~~~~
../drivers/net/bnxt/tf_ulp/ulp_mapper_tfc.c:731:1: error: invalid storage class for function ‘ulp_mapper_tfc_index_tbl_process’
731 | ulp_mapper_tfc_index_tbl_process(struct bnxt_ulp_mapper_parms *parms,
| ^~~~~~~~~~~~~~~~~~~~~~~~~~~~~~~~
../drivers/net/bnxt/tf_ulp/ulp_mapper_tfc.c:1029:1: error: invalid storage class for function ‘ulp_mapper_tfc_index_entry_free’
1029 | ulp_mapper_tfc_index_entry_free(struct bnxt_ulp_context *ulp_ctx,
| ^~~~~~~~~~~~~~~~~~~~~~~~~~~~~~~
../drivers/net/bnxt/tf_ulp/ulp_mapper_tfc.c:1060:1: error: invalid storage class for function ‘ulp_mapper_tfc_cmm_tbl_process’
1060 | ulp_mapper_tfc_cmm_tbl_process(struct bnxt_ulp_mapper_parms *parms,
| ^~~~~~~~~~~~~~~~~~~~~~~~~~~~~~
../drivers/net/bnxt/tf_ulp/ulp_mapper_tfc.c:1368:1: error: invalid storage class for function ‘ulp_mapper_tfc_cmm_entry_free’
1368 | ulp_mapper_tfc_cmm_entry_free(struct bnxt_ulp_context *ulp_ctx,
| ^~~~~~~~~~~~~~~~~~~~~~~~~~~~~
../drivers/net/bnxt/tf_ulp/ulp_mapper_tfc.c:1418:1: error: invalid storage class for function ‘ulp_mapper_tfc_if_tbl_process’
1418 | ulp_mapper_tfc_if_tbl_process(struct bnxt_ulp_mapper_parms *parms,
| ^~~~~~~~~~~~~~~~~~~~~~~~~~~~~
../drivers/net/bnxt/tf_ulp/ulp_mapper_tfc.c:1519:1: error: invalid storage class for function ‘ulp_mapper_tfc_ident_alloc’
1519 | ulp_mapper_tfc_ident_alloc(struct bnxt_ulp_context *ulp_ctx,
| ^~~~~~~~~~~~~~~~~~~~~~~~~~
../drivers/net/bnxt/tf_ulp/ulp_mapper_tfc.c:1556:1: error: invalid storage class for function ‘ulp_mapper_tfc_ident_free’
1556 | ulp_mapper_tfc_ident_free(struct bnxt_ulp_context *ulp_ctx,
| ^~~~~~~~~~~~~~~~~~~~~~~~~
../drivers/net/bnxt/tf_ulp/ulp_mapper_tfc.c:1589:1: error: invalid storage class for function ‘ulp_mapper_tfc_global_ident_alloc’
1589 | ulp_mapper_tfc_global_ident_alloc(struct bnxt_ulp_context *ulp_ctx,
| ^~~~~~~~~~~~~~~~~~~~~~~~~~~~~~~~~
../drivers/net/bnxt/tf_ulp/ulp_mapper_tfc.c:1631:1: error: invalid storage class for function ‘ulp_mapper_tfc_global_ident_free’
1631 | ulp_mapper_tfc_global_ident_free(struct bnxt_ulp_context *ulp_ctx,
| ^~~~~~~~~~~~~~~~~~~~~~~~~~~~~~~~
../drivers/net/bnxt/tf_ulp/ulp_mapper_tfc.c:1665:1: error: invalid storage class for function ‘ulp_mapper_tfc_tcam_entry_free’
1665 | ulp_mapper_tfc_tcam_entry_free(struct bnxt_ulp_context *ulp,
| ^~~~~~~~~~~~~~~~~~~~~~~~~~~~~~
../drivers/net/bnxt/tf_ulp/ulp_mapper_tfc.c:1695:1: error: invalid storage class for function ‘ulp_mapper_tfc_dyn_tbl_type_get’
1695 | ulp_mapper_tfc_dyn_tbl_type_get(struct bnxt_ulp_mapper_parms *parm __rte_unused,
| ^~~~~~~~~~~~~~~~~~~~~~~~~~~~~~~
../drivers/net/bnxt/tf_ulp/ulp_mapper_tfc.c:1715:1: error: invalid storage class for function ‘ulp_mapper_tfc_index_tbl_alloc_process’
1715 | ulp_mapper_tfc_index_tbl_alloc_process(struct bnxt_ulp_context *ulp,
| ^~~~~~~~~~~~~~~~~~~~~~~~~~~~~~~~~~~~~~
../drivers/net/bnxt/tf_ulp/ulp_mapper_tfc.c:1753:1: error: invalid storage class for function ‘ulp_mapper_tfc_app_glb_resource_info_init’
1753 | ulp_mapper_tfc_app_glb_resource_info_init(struct bnxt_ulp_context
| ^~~~~~~~~~~~~~~~~~~~~~~~~~~~~~~~~~~~~~~~~
../drivers/net/bnxt/tf_ulp/ulp_mapper_tfc.c:1763:1: error: invalid storage class for function ‘ulp_mapper_tfc_handle_to_offset’
1763 | ulp_mapper_tfc_handle_to_offset(struct bnxt_ulp_mapper_parms *parms __rte_unused,
| ^~~~~~~~~~~~~~~~~~~~~~~~~~~~~~~
../drivers/net/bnxt/tf_ulp/ulp_mapper_tfc.c:1797:1: error: invalid storage class for function ‘ulp_mapper_tfc_mpc_batch_start’
1797 | ulp_mapper_tfc_mpc_batch_start(struct tfc_mpc_batch_info_t *batch_info)
| ^~~~~~~~~~~~~~~~~~~~~~~~~~~~~~
../drivers/net/bnxt/tf_ulp/ulp_mapper_tfc.c:1803:1: error: invalid storage class for function ‘ulp_mapper_tfc_mtr_stats_hndl_set’
1803 | ulp_mapper_tfc_mtr_stats_hndl_set(struct bnxt_ulp_mapper_parms *parms __rte_unused,
| ^~~~~~~~~~~~~~~~~~~~~~~~~~~~~~~~~
../drivers/net/bnxt/tf_ulp/ulp_mapper_tfc.c:1821:1: error: invalid storage class for function ‘ulp_mapper_tfc_mtr_stats_hndl_get’
1821 | ulp_mapper_tfc_mtr_stats_hndl_get(uint32_t mtr_id, uint64_t *stats_hndl)
| ^~~~~~~~~~~~~~~~~~~~~~~~~~~~~~~~~
../drivers/net/bnxt/tf_ulp/ulp_mapper_tfc.c:1837:1: error: invalid storage class for function ‘ulp_mapper_tfc_mtr_stats_hndl_del’
1837 | ulp_mapper_tfc_mtr_stats_hndl_del(uint32_t mtr_id)
| ^~~~~~~~~~~~~~~~~~~~~~~~~~~~~~~~~
../drivers/net/bnxt/tf_ulp/ulp_mapper_tfc.c:1852:1: error: invalid storage class for function ‘ulp_mapper_tfc_glb_idx_tbl_alloc’
1852 | ulp_mapper_tfc_glb_idx_tbl_alloc(struct bnxt_ulp_context *ulp_ctx,
| ^~~~~~~~~~~~~~~~~~~~~~~~~~~~~~~~
../drivers/net/bnxt/tf_ulp/ulp_mapper_tfc.c:1892:1: error: invalid storage class for function ‘ulp_mapper_tfc_glb_idx_tbl_free’
1892 | ulp_mapper_tfc_glb_idx_tbl_free(struct bnxt_ulp_context *ulp_ctx,
| ^~~~~~~~~~~~~~~~~~~~~~~~~~~~~~~
../drivers/net/bnxt/tf_ulp/ulp_mapper_tfc.c:1926:1: error: invalid storage class for function ‘ulp_mapper_tfc_tcam_prio_update’
1926 | ulp_mapper_tfc_tcam_prio_update(struct bnxt_ulp_mapper_parms *parms,
| ^~~~~~~~~~~~~~~~~~~~~~~~~~~~~~~
../drivers/net/bnxt/tf_ulp/ulp_mapper_tfc.c:1990:1: error: expected declaration or statement at end of input
1990 | };
| ^
../drivers/net/bnxt/tf_ulp/ulp_mapper_tfc.c:1961:34: error: unused variable ‘ulp_mapper_tfc_core_ops’ [-Werror=unused-variable]
1961 | const struct ulp_mapper_core_ops ulp_mapper_tfc_core_ops = {
| ^~~~~~~~~~~~~~~~~~~~~~~
../drivers/net/bnxt/tf_ulp/ulp_mapper_tfc.c: At top level:
../drivers/net/bnxt/tf_ulp/ulp_mapper_tfc.c:457:1: error: ‘ulp_mapper_tfc_em_tbl_process’ defined but not used [-Werror=unused-function]
457 | ulp_mapper_tfc_em_tbl_process(struct bnxt_ulp_mapper_parms *parms,
| ^~~~~~~~~~~~~~~~~~~~~~~~~~~~~
cc1: all warnings being treated as errors
[1328/3700] Compiling C object drivers/libtmp_rte_net_bnxt.a.p/net_bnxt_tf_ulp_bnxt_ulp_tf.c.o
[1329/3700] Compiling C object drivers/libtmp_rte_net_bnxt.a.p/net_bnxt_tf_ulp_ulp_mapper_tf.c.o
[1330/3700] Compiling C object drivers/libtmp_rte_net_bnxt.a.p/net_bnxt_tf_ulp_ulp_sc_mgr.c.o
[1331/3700] Compiling C object drivers/libtmp_rte_net_bnxt.a.p/net_bnxt_tf_ulp_ulp_fc_mgr_tfc.c.o
[1332/3700] Compiling C object drivers/libtmp_rte_net_bnxt.a.p/net_bnxt_tf_ulp_ulp_fc_mgr_tf.c.o
[1333/3700] Compiling C object drivers/libtmp_rte_net_bnxt.a.p/net_bnxt_tf_ulp_ulp_mapper.c.o
[1334/3700] Compiling C object drivers/libtmp_rte_net_bnxt.a.p/net_bnxt_tf_ulp_ulp_alloc_tbl.c.o
[1335/3700] Compiling C object drivers/libtmp_rte_net_bnxt.a.p/net_bnxt_tf_ulp_bnxt_ulp_tfc.c.o
[1336/3700] Compiling C object drivers/libtmp_rte_net_bnxt.a.p/net_bnxt_tf_ulp_ulp_rte_parser.c.o
ninja: build stopped
*Build Failed #20:
OS: UB2510-64
Target: x86_64-native-linuxapp-gcc
FAILED: drivers/libtmp_rte_net_bnxt.a.p/net_bnxt_tf_ulp_ulp_mapper_tfc.c.o
gcc -Idrivers/libtmp_rte_net_bnxt.a.p -Idrivers -I../drivers -Idrivers/net/bnxt -I../drivers/net/bnxt -Idrivers/net/bnxt/tf_ulp -I../drivers/net/bnxt/tf_ulp -Idrivers/net/bnxt/tf_ulp/generic_templates -I../drivers/net/bnxt/tf_ulp/generic_templates -Idrivers/net/bnxt/tf_core -I../drivers/net/bnxt/tf_core -Idrivers/net/bnxt/tf_core/v3 -I../drivers/net/bnxt/tf_core/v3 -Idrivers/net/bnxt/hcapi/cfa -I../drivers/net/bnxt/hcapi/cfa -Idrivers/net/bnxt/hcapi/cfa_v3 -I../drivers/net/bnxt/hcapi/cfa_v3 -I../drivers/net/bnxt/hcapi/cfa_v3/include -I../drivers/net/bnxt/hcapi/cfa_v3/include/platform/dpdk -I../drivers/net/bnxt/hcapi/cfa_v3/bld/p70 -I../drivers/net/bnxt/hcapi/cfa_v3/bld/p70/host -I../drivers/net/bnxt/hcapi/cfa_v3/bld/include -I../drivers/net/bnxt/hcapi/cfa_v3/bld/include/host -I../drivers/net/bnxt/hcapi/cfa_v3/bld/include/p70 -I../drivers/net/bnxt/hcapi/cfa_v3/mm/include -I../drivers/net/bnxt/hcapi/cfa_v3/tim/include -I../drivers/net/bnxt/hcapi/cfa_v3/tpm/include -Ilib/ethdev -I../lib/ethdev -Ilib/eal/common -I../lib/eal/common -I. -I.. -Iconfig -I../config -Ilib/eal/include -I../lib/eal/include -Ilib/eal/linux/include -I../lib/eal/linux/include -Ilib/eal/x86/include -I../lib/eal/x86/include -I../kernel/linux -Ilib/eal -I../lib/eal -Ilib/kvargs -I../lib/kvargs -Ilib/log -I../lib/log -Ilib/metrics -I../lib/metrics -Ilib/telemetry -I../lib/telemetry -Ilib/argparse -I../lib/argparse -Ilib/net -I../lib/net -Ilib/mbuf -I../lib/mbuf -Ilib/mempool -I../lib/mempool -Ilib/ring -I../lib/ring -Ilib/meter -I../lib/meter -Idrivers/bus/pci -I../drivers/bus/pci -I../drivers/bus/pci/linux -Ilib/pci -I../lib/pci -Idrivers/bus/vdev -I../drivers/bus/vdev -Ilib/hash -I../lib/hash -Ilib/rcu -I../lib/rcu -fdiagnostics-color=always -D_FILE_OFFSET_BITS=64 -Wall -Winvalid-pch -Wextra -Werror -std=c11 -O3 -include rte_config.h -Wvla -Wcast-qual -Wdeprecated -Wformat -Wformat-nonliteral -Wformat-security -Wmissing-declarations -Wmissing-prototypes -Wnested-externs -Wold-style-definition -Wpointer-arith -Wshadow -Wsign-compare -Wstrict-prototypes -Wundef -Wwrite-strings -Wno-packed-not-aligned -Wno-missing-field-initializers -fzero-init-padding-bits=all -D_GNU_SOURCE -fPIC -march=native -mrtm -DALLOW_EXPERIMENTAL_API -DALLOW_INTERNAL_API -Wno-format-truncation -Wno-address-of-packed-member -Wno-vla -Wno-shadow -DBNXT_TF_APP_ID=0 -DSUPPORT_CFA_HW_P70=1 -DCFA_BLD_PRINT_OBJ=1 -DRTE_COMPONENT_CLASS=pmd_net -DRTE_COMPONENT_NAME=bnxt -DRTE_LOG_DEFAULT_LOGTYPE=pmd.net.bnxt -MD -MQ drivers/libtmp_rte_net_bnxt.a.p/net_bnxt_tf_ulp_ulp_mapper_tfc.c.o -MF drivers/libtmp_rte_net_bnxt.a.p/net_bnxt_tf_ulp_ulp_mapper_tfc.c.o.d -o drivers/libtmp_rte_net_bnxt.a.p/net_bnxt_tf_ulp_ulp_mapper_tfc.c.o -c ../drivers/net/bnxt/tf_ulp/ulp_mapper_tfc.c
../drivers/net/bnxt/tf_ulp/ulp_mapper_tfc.c: In function ‘ulp_mapper_tfc_em_tbl_process’:
../drivers/net/bnxt/tf_ulp/ulp_mapper_tfc.c:659:1: error: invalid storage class for function ‘ulp_mapper_tfc_em_entry_free’
659 | ulp_mapper_tfc_em_entry_free(struct bnxt_ulp_context *ulp,
| ^~~~~~~~~~~~~~~~~~~~~~~~~~~~
../drivers/net/bnxt/tf_ulp/ulp_mapper_tfc.c:708:1: error: invalid storage class for function ‘ulp_mapper_tfc_dyn_blob_size_get’
708 | ulp_mapper_tfc_dyn_blob_size_get(struct bnxt_ulp_mapper_parms *mparms,
| ^~~~~~~~~~~~~~~~~~~~~~~~~~~~~~~~
../drivers/net/bnxt/tf_ulp/ulp_mapper_tfc.c:731:1: error: invalid storage class for function ‘ulp_mapper_tfc_index_tbl_process’
731 | ulp_mapper_tfc_index_tbl_process(struct bnxt_ulp_mapper_parms *parms,
| ^~~~~~~~~~~~~~~~~~~~~~~~~~~~~~~~
../drivers/net/bnxt/tf_ulp/ulp_mapper_tfc.c:1029:1: error: invalid storage class for function ‘ulp_mapper_tfc_index_entry_free’
1029 | ulp_mapper_tfc_index_entry_free(struct bnxt_ulp_context *ulp_ctx,
| ^~~~~~~~~~~~~~~~~~~~~~~~~~~~~~~
../drivers/net/bnxt/tf_ulp/ulp_mapper_tfc.c:1060:1: error: invalid storage class for function ‘ulp_mapper_tfc_cmm_tbl_process’
1060 | ulp_mapper_tfc_cmm_tbl_process(struct bnxt_ulp_mapper_parms *parms,
| ^~~~~~~~~~~~~~~~~~~~~~~~~~~~~~
../drivers/net/bnxt/tf_ulp/ulp_mapper_tfc.c:1368:1: error: invalid storage class for function ‘ulp_mapper_tfc_cmm_entry_free’
1368 | ulp_mapper_tfc_cmm_entry_free(struct bnxt_ulp_context *ulp_ctx,
| ^~~~~~~~~~~~~~~~~~~~~~~~~~~~~
../drivers/net/bnxt/tf_ulp/ulp_mapper_tfc.c:1418:1: error: invalid storage class for function ‘ulp_mapper_tfc_if_tbl_process’
1418 | ulp_mapper_tfc_if_tbl_process(struct bnxt_ulp_mapper_parms *parms,
| ^~~~~~~~~~~~~~~~~~~~~~~~~~~~~
../drivers/net/bnxt/tf_ulp/ulp_mapper_tfc.c:1519:1: error: invalid storage class for function ‘ulp_mapper_tfc_ident_alloc’
1519 | ulp_mapper_tfc_ident_alloc(struct bnxt_ulp_context *ulp_ctx,
| ^~~~~~~~~~~~~~~~~~~~~~~~~~
../drivers/net/bnxt/tf_ulp/ulp_mapper_tfc.c:1556:1: error: invalid storage class for function ‘ulp_mapper_tfc_ident_free’
1556 | ulp_mapper_tfc_ident_free(struct bnxt_ulp_context *ulp_ctx,
| ^~~~~~~~~~~~~~~~~~~~~~~~~
../drivers/net/bnxt/tf_ulp/ulp_mapper_tfc.c:1589:1: error: invalid storage class for function ‘ulp_mapper_tfc_global_ident_alloc’
1589 | ulp_mapper_tfc_global_ident_alloc(struct bnxt_ulp_context *ulp_ctx,
| ^~~~~~~~~~~~~~~~~~~~~~~~~~~~~~~~~
../drivers/net/bnxt/tf_ulp/ulp_mapper_tfc.c:1631:1: error: invalid storage class for function ‘ulp_mapper_tfc_global_ident_free’
1631 | ulp_mapper_tfc_global_ident_free(struct bnxt_ulp_context *ulp_ctx,
| ^~~~~~~~~~~~~~~~~~~~~~~~~~~~~~~~
../drivers/net/bnxt/tf_ulp/ulp_mapper_tfc.c:1665:1: error: invalid storage class for function ‘ulp_mapper_tfc_tcam_entry_free’
1665 | ulp_mapper_tfc_tcam_entry_free(struct bnxt_ulp_context *ulp,
| ^~~~~~~~~~~~~~~~~~~~~~~~~~~~~~
../drivers/net/bnxt/tf_ulp/ulp_mapper_tfc.c:1695:1: error: invalid storage class for function ‘ulp_mapper_tfc_dyn_tbl_type_get’
1695 | ulp_mapper_tfc_dyn_tbl_type_get(struct bnxt_ulp_mapper_parms *parm __rte_unused,
| ^~~~~~~~~~~~~~~~~~~~~~~~~~~~~~~
../drivers/net/bnxt/tf_ulp/ulp_mapper_tfc.c:1715:1: error: invalid storage class for function ‘ulp_mapper_tfc_index_tbl_alloc_process’
1715 | ulp_mapper_tfc_index_tbl_alloc_process(struct bnxt_ulp_context *ulp,
| ^~~~~~~~~~~~~~~~~~~~~~~~~~~~~~~~~~~~~~
../drivers/net/bnxt/tf_ulp/ulp_mapper_tfc.c:1753:1: error: invalid storage class for function ‘ulp_mapper_tfc_app_glb_resource_info_init’
1753 | ulp_mapper_tfc_app_glb_resource_info_init(struct bnxt_ulp_context
| ^~~~~~~~~~~~~~~~~~~~~~~~~~~~~~~~~~~~~~~~~
../drivers/net/bnxt/tf_ulp/ulp_mapper_tfc.c:1763:1: error: invalid storage class for function ‘ulp_mapper_tfc_handle_to_offset’
1763 | ulp_mapper_tfc_handle_to_offset(struct bnxt_ulp_mapper_parms *parms __rte_unused,
| ^~~~~~~~~~~~~~~~~~~~~~~~~~~~~~~
../drivers/net/bnxt/tf_ulp/ulp_mapper_tfc.c:1797:1: error: invalid storage class for function ‘ulp_mapper_tfc_mpc_batch_start’
1797 | ulp_mapper_tfc_mpc_batch_start(struct tfc_mpc_batch_info_t *batch_info)
| ^~~~~~~~~~~~~~~~~~~~~~~~~~~~~~
../drivers/net/bnxt/tf_ulp/ulp_mapper_tfc.c:1803:1: error: invalid storage class for function ‘ulp_mapper_tfc_mtr_stats_hndl_set’
1803 | ulp_mapper_tfc_mtr_stats_hndl_set(struct bnxt_ulp_mapper_parms *parms __rte_unused,
| ^~~~~~~~~~~~~~~~~~~~~~~~~~~~~~~~~
../drivers/net/bnxt/tf_ulp/ulp_mapper_tfc.c:1821:1: error: invalid storage class for function ‘ulp_mapper_tfc_mtr_stats_hndl_get’
1821 | ulp_mapper_tfc_mtr_stats_hndl_get(uint32_t mtr_id, uint64_t *stats_hndl)
| ^~~~~~~~~~~~~~~~~~~~~~~~~~~~~~~~~
../drivers/net/bnxt/tf_ulp/ulp_mapper_tfc.c:1837:1: error: invalid storage class for function ‘ulp_mapper_tfc_mtr_stats_hndl_del’
1837 | ulp_mapper_tfc_mtr_stats_hndl_del(uint32_t mtr_id)
| ^~~~~~~~~~~~~~~~~~~~~~~~~~~~~~~~~
../drivers/net/bnxt/tf_ulp/ulp_mapper_tfc.c:1852:1: error: invalid storage class for function ‘ulp_mapper_tfc_glb_idx_tbl_alloc’
1852 | ulp_mapper_tfc_glb_idx_tbl_alloc(struct bnxt_ulp_context *ulp_ctx,
| ^~~~~~~~~~~~~~~~~~~~~~~~~~~~~~~~
../drivers/net/bnxt/tf_ulp/ulp_mapper_tfc.c:1892:1: error: invalid storage class for function ‘ulp_mapper_tfc_glb_idx_tbl_free’
1892 | ulp_mapper_tfc_glb_idx_tbl_free(struct bnxt_ulp_context *ulp_ctx,
| ^~~~~~~~~~~~~~~~~~~~~~~~~~~~~~~
../drivers/net/bnxt/tf_ulp/ulp_mapper_tfc.c:1926:1: error: invalid storage class for function ‘ulp_mapper_tfc_tcam_prio_update’
1926 | ulp_mapper_tfc_tcam_prio_update(struct bnxt_ulp_mapper_parms *parms,
| ^~~~~~~~~~~~~~~~~~~~~~~~~~~~~~~
../drivers/net/bnxt/tf_ulp/ulp_mapper_tfc.c:1990:1: error: expected declaration or statement at end of input
1990 | };
| ^
../drivers/net/bnxt/tf_ulp/ulp_mapper_tfc.c:1961:34: error: unused variable ‘ulp_mapper_tfc_core_ops’ [-Werror=unused-variable]
1961 | const struct ulp_mapper_core_ops ulp_mapper_tfc_core_ops = {
| ^~~~~~~~~~~~~~~~~~~~~~~
../drivers/net/bnxt/tf_ulp/ulp_mapper_tfc.c: At top level:
../drivers/net/bnxt/tf_ulp/ulp_mapper_tfc.c:457:1: error: ‘ulp_mapper_tfc_em_tbl_process’ defined but not used [-Werror=unused-function]
457 | ulp_mapper_tfc_em_tbl_process(struct bnxt_ulp_mapper_parms *parms,
| ^~~~~~~~~~~~~~~~~~~~~~~~~~~~~
cc1: all warnings being treated as errors
[1359/3937] Compiling C object drivers/libtmp_rte_net_bnxt.a.p/net_bnxt_tf_core_bitalloc.c.o
[1360/3937] Compiling C object drivers/libtmp_rte_net_bnxt.a.p/net_bnxt_tf_ulp_ulp_sc_mgr.c.o
[1361/3937] Compiling C object drivers/libtmp_rte_net_bnxt.a.p/net_bnxt_tf_ulp_ulp_alloc_tbl.c.o
[1362/3937] Compiling C object drivers/libtmp_rte_net_bnxt.a.p/net_bnxt_tf_ulp_ulp_sc_mgr_tfc.c.o
[1363/3937] Compiling C object drivers/libtmp_rte_net_bnxt.a.p/net_bnxt_tf_ulp_generic_templates_ulp_template_db_class.c.o
[1364/3937] Compiling C object drivers/libtmp_rte_net_bnxt.a.p/net_bnxt_tf_ulp_ulp_tfc_ha_mgr.c.o
[1365/3937] Compiling C object drivers/libtmp_rte_net_bnxt.a.p/net_bnxt_tf_ulp_ulp_fc_mgr_tf.c.o
[1366/3937] Compiling C object drivers/libtmp_rte_net_bnxt.a.p/net_bnxt_tf_ulp_generic_templates_ulp_template_db_act.c.o
[1367/3937] Compiling C object drivers/libtmp_rte_net_bnxt.a.p/net_bnxt_tf_ulp_ulp_rte_parser.c.o
ninja: build stopped
*Build Failed #21:
OS: Fedora43-64
Target: x86_64-native-linuxapp-gcc
FAILED: drivers/libtmp_rte_net_bnxt.a.p/net_bnxt_tf_ulp_ulp_mapper_tfc.c.o
gcc -Idrivers/libtmp_rte_net_bnxt.a.p -Idrivers -I../drivers -Idrivers/net/bnxt -I../drivers/net/bnxt -Idrivers/net/bnxt/tf_ulp -I../drivers/net/bnxt/tf_ulp -Idrivers/net/bnxt/tf_ulp/generic_templates -I../drivers/net/bnxt/tf_ulp/generic_templates -Idrivers/net/bnxt/tf_core -I../drivers/net/bnxt/tf_core -Idrivers/net/bnxt/tf_core/v3 -I../drivers/net/bnxt/tf_core/v3 -Idrivers/net/bnxt/hcapi/cfa -I../drivers/net/bnxt/hcapi/cfa -Idrivers/net/bnxt/hcapi/cfa_v3 -I../drivers/net/bnxt/hcapi/cfa_v3 -I../drivers/net/bnxt/hcapi/cfa_v3/include -I../drivers/net/bnxt/hcapi/cfa_v3/include/platform/dpdk -I../drivers/net/bnxt/hcapi/cfa_v3/bld/p70 -I../drivers/net/bnxt/hcapi/cfa_v3/bld/p70/host -I../drivers/net/bnxt/hcapi/cfa_v3/bld/include -I../drivers/net/bnxt/hcapi/cfa_v3/bld/include/host -I../drivers/net/bnxt/hcapi/cfa_v3/bld/include/p70 -I../drivers/net/bnxt/hcapi/cfa_v3/mm/include -I../drivers/net/bnxt/hcapi/cfa_v3/tim/include -I../drivers/net/bnxt/hcapi/cfa_v3/tpm/include -Ilib/ethdev -I../lib/ethdev -Ilib/eal/common -I../lib/eal/common -I. -I.. -Iconfig -I../config -Ilib/eal/include -I../lib/eal/include -Ilib/eal/linux/include -I../lib/eal/linux/include -Ilib/eal/x86/include -I../lib/eal/x86/include -I../kernel/linux -Ilib/eal -I../lib/eal -Ilib/kvargs -I../lib/kvargs -Ilib/log -I../lib/log -Ilib/metrics -I../lib/metrics -Ilib/telemetry -I../lib/telemetry -Ilib/argparse -I../lib/argparse -Ilib/net -I../lib/net -Ilib/mbuf -I../lib/mbuf -Ilib/mempool -I../lib/mempool -Ilib/ring -I../lib/ring -Ilib/meter -I../lib/meter -Idrivers/bus/pci -I../drivers/bus/pci -I../drivers/bus/pci/linux -Ilib/pci -I../lib/pci -Idrivers/bus/vdev -I../drivers/bus/vdev -Ilib/hash -I../lib/hash -Ilib/rcu -I../lib/rcu -fdiagnostics-color=always -D_FILE_OFFSET_BITS=64 -Wall -Winvalid-pch -Wextra -Werror -std=c11 -O3 -include rte_config.h -Wvla -Wcast-qual -Wdeprecated -Wformat -Wformat-nonliteral -Wformat-security -Wmissing-declarations -Wmissing-prototypes -Wnested-externs -Wold-style-definition -Wpointer-arith -Wshadow -Wsign-compare -Wstrict-prototypes -Wundef -Wwrite-strings -Wno-packed-not-aligned -Wno-missing-field-initializers -fzero-init-padding-bits=all -D_GNU_SOURCE -fPIC -march=native -mrtm -DALLOW_EXPERIMENTAL_API -DALLOW_INTERNAL_API -Wno-format-truncation -Wno-address-of-packed-member -Wno-vla -Wno-shadow -DBNXT_TF_APP_ID=0 -DSUPPORT_CFA_HW_P70=1 -DCFA_BLD_PRINT_OBJ=1 -DRTE_COMPONENT_CLASS=pmd_net -DRTE_COMPONENT_NAME=bnxt -DRTE_LOG_DEFAULT_LOGTYPE=pmd.net.bnxt -MD -MQ drivers/libtmp_rte_net_bnxt.a.p/net_bnxt_tf_ulp_ulp_mapper_tfc.c.o -MF drivers/libtmp_rte_net_bnxt.a.p/net_bnxt_tf_ulp_ulp_mapper_tfc.c.o.d -o drivers/libtmp_rte_net_bnxt.a.p/net_bnxt_tf_ulp_ulp_mapper_tfc.c.o -c ../drivers/net/bnxt/tf_ulp/ulp_mapper_tfc.c
../drivers/net/bnxt/tf_ulp/ulp_mapper_tfc.c: In function ‘ulp_mapper_tfc_em_tbl_process’:
../drivers/net/bnxt/tf_ulp/ulp_mapper_tfc.c:659:1: error: invalid storage class for function ‘ulp_mapper_tfc_em_entry_free’
659 | ulp_mapper_tfc_em_entry_free(struct bnxt_ulp_context *ulp,
| ^~~~~~~~~~~~~~~~~~~~~~~~~~~~
../drivers/net/bnxt/tf_ulp/ulp_mapper_tfc.c:708:1: error: invalid storage class for function ‘ulp_mapper_tfc_dyn_blob_size_get’
708 | ulp_mapper_tfc_dyn_blob_size_get(struct bnxt_ulp_mapper_parms *mparms,
| ^~~~~~~~~~~~~~~~~~~~~~~~~~~~~~~~
../drivers/net/bnxt/tf_ulp/ulp_mapper_tfc.c:731:1: error: invalid storage class for function ‘ulp_mapper_tfc_index_tbl_process’
731 | ulp_mapper_tfc_index_tbl_process(struct bnxt_ulp_mapper_parms *parms,
| ^~~~~~~~~~~~~~~~~~~~~~~~~~~~~~~~
../drivers/net/bnxt/tf_ulp/ulp_mapper_tfc.c:1029:1: error: invalid storage class for function ‘ulp_mapper_tfc_index_entry_free’
1029 | ulp_mapper_tfc_index_entry_free(struct bnxt_ulp_context *ulp_ctx,
| ^~~~~~~~~~~~~~~~~~~~~~~~~~~~~~~
../drivers/net/bnxt/tf_ulp/ulp_mapper_tfc.c:1060:1: error: invalid storage class for function ‘ulp_mapper_tfc_cmm_tbl_process’
1060 | ulp_mapper_tfc_cmm_tbl_process(struct bnxt_ulp_mapper_parms *parms,
| ^~~~~~~~~~~~~~~~~~~~~~~~~~~~~~
../drivers/net/bnxt/tf_ulp/ulp_mapper_tfc.c:1368:1: error: invalid storage class for function ‘ulp_mapper_tfc_cmm_entry_free’
1368 | ulp_mapper_tfc_cmm_entry_free(struct bnxt_ulp_context *ulp_ctx,
| ^~~~~~~~~~~~~~~~~~~~~~~~~~~~~
../drivers/net/bnxt/tf_ulp/ulp_mapper_tfc.c:1418:1: error: invalid storage class for function ‘ulp_mapper_tfc_if_tbl_process’
1418 | ulp_mapper_tfc_if_tbl_process(struct bnxt_ulp_mapper_parms *parms,
| ^~~~~~~~~~~~~~~~~~~~~~~~~~~~~
../drivers/net/bnxt/tf_ulp/ulp_mapper_tfc.c:1519:1: error: invalid storage class for function ‘ulp_mapper_tfc_ident_alloc’
1519 | ulp_mapper_tfc_ident_alloc(struct bnxt_ulp_context *ulp_ctx,
| ^~~~~~~~~~~~~~~~~~~~~~~~~~
../drivers/net/bnxt/tf_ulp/ulp_mapper_tfc.c:1556:1: error: invalid storage class for function ‘ulp_mapper_tfc_ident_free’
1556 | ulp_mapper_tfc_ident_free(struct bnxt_ulp_context *ulp_ctx,
| ^~~~~~~~~~~~~~~~~~~~~~~~~
../drivers/net/bnxt/tf_ulp/ulp_mapper_tfc.c:1589:1: error: invalid storage class for function ‘ulp_mapper_tfc_global_ident_alloc’
1589 | ulp_mapper_tfc_global_ident_alloc(struct bnxt_ulp_context *ulp_ctx,
| ^~~~~~~~~~~~~~~~~~~~~~~~~~~~~~~~~
../drivers/net/bnxt/tf_ulp/ulp_mapper_tfc.c:1631:1: error: invalid storage class for function ‘ulp_mapper_tfc_global_ident_free’
1631 | ulp_mapper_tfc_global_ident_free(struct bnxt_ulp_context *ulp_ctx,
| ^~~~~~~~~~~~~~~~~~~~~~~~~~~~~~~~
../drivers/net/bnxt/tf_ulp/ulp_mapper_tfc.c:1665:1: error: invalid storage class for function ‘ulp_mapper_tfc_tcam_entry_free’
1665 | ulp_mapper_tfc_tcam_entry_free(struct bnxt_ulp_context *ulp,
| ^~~~~~~~~~~~~~~~~~~~~~~~~~~~~~
../drivers/net/bnxt/tf_ulp/ulp_mapper_tfc.c:1695:1: error: invalid storage class for function ‘ulp_mapper_tfc_dyn_tbl_type_get’
1695 | ulp_mapper_tfc_dyn_tbl_type_get(struct bnxt_ulp_mapper_parms *parm __rte_unused,
| ^~~~~~~~~~~~~~~~~~~~~~~~~~~~~~~
../drivers/net/bnxt/tf_ulp/ulp_mapper_tfc.c:1715:1: error: invalid storage class for function ‘ulp_mapper_tfc_index_tbl_alloc_process’
1715 | ulp_mapper_tfc_index_tbl_alloc_process(struct bnxt_ulp_context *ulp,
| ^~~~~~~~~~~~~~~~~~~~~~~~~~~~~~~~~~~~~~
../drivers/net/bnxt/tf_ulp/ulp_mapper_tfc.c:1753:1: error: invalid storage class for function ‘ulp_mapper_tfc_app_glb_resource_info_init’
1753 | ulp_mapper_tfc_app_glb_resource_info_init(struct bnxt_ulp_context
| ^~~~~~~~~~~~~~~~~~~~~~~~~~~~~~~~~~~~~~~~~
../drivers/net/bnxt/tf_ulp/ulp_mapper_tfc.c:1763:1: error: invalid storage class for function ‘ulp_mapper_tfc_handle_to_offset’
1763 | ulp_mapper_tfc_handle_to_offset(struct bnxt_ulp_mapper_parms *parms __rte_unused,
| ^~~~~~~~~~~~~~~~~~~~~~~~~~~~~~~
../drivers/net/bnxt/tf_ulp/ulp_mapper_tfc.c:1797:1: error: invalid storage class for function ‘ulp_mapper_tfc_mpc_batch_start’
1797 | ulp_mapper_tfc_mpc_batch_start(struct tfc_mpc_batch_info_t *batch_info)
| ^~~~~~~~~~~~~~~~~~~~~~~~~~~~~~
../drivers/net/bnxt/tf_ulp/ulp_mapper_tfc.c:1803:1: error: invalid storage class for function ‘ulp_mapper_tfc_mtr_stats_hndl_set’
1803 | ulp_mapper_tfc_mtr_stats_hndl_set(struct bnxt_ulp_mapper_parms *parms __rte_unused,
| ^~~~~~~~~~~~~~~~~~~~~~~~~~~~~~~~~
../drivers/net/bnxt/tf_ulp/ulp_mapper_tfc.c:1821:1: error: invalid storage class for function ‘ulp_mapper_tfc_mtr_stats_hndl_get’
1821 | ulp_mapper_tfc_mtr_stats_hndl_get(uint32_t mtr_id, uint64_t *stats_hndl)
| ^~~~~~~~~~~~~~~~~~~~~~~~~~~~~~~~~
../drivers/net/bnxt/tf_ulp/ulp_mapper_tfc.c:1837:1: error: invalid storage class for function ‘ulp_mapper_tfc_mtr_stats_hndl_del’
1837 | ulp_mapper_tfc_mtr_stats_hndl_del(uint32_t mtr_id)
| ^~~~~~~~~~~~~~~~~~~~~~~~~~~~~~~~~
../drivers/net/bnxt/tf_ulp/ulp_mapper_tfc.c:1852:1: error: invalid storage class for function ‘ulp_mapper_tfc_glb_idx_tbl_alloc’
1852 | ulp_mapper_tfc_glb_idx_tbl_alloc(struct bnxt_ulp_context *ulp_ctx,
| ^~~~~~~~~~~~~~~~~~~~~~~~~~~~~~~~
../drivers/net/bnxt/tf_ulp/ulp_mapper_tfc.c:1892:1: error: invalid storage class for function ‘ulp_mapper_tfc_glb_idx_tbl_free’
1892 | ulp_mapper_tfc_glb_idx_tbl_free(struct bnxt_ulp_context *ulp_ctx,
| ^~~~~~~~~~~~~~~~~~~~~~~~~~~~~~~
../drivers/net/bnxt/tf_ulp/ulp_mapper_tfc.c:1926:1: error: invalid storage class for function ‘ulp_mapper_tfc_tcam_prio_update’
1926 | ulp_mapper_tfc_tcam_prio_update(struct bnxt_ulp_mapper_parms *parms,
| ^~~~~~~~~~~~~~~~~~~~~~~~~~~~~~~
../drivers/net/bnxt/tf_ulp/ulp_mapper_tfc.c:1990:1: error: expected declaration or statement at end of input
1990 | };
| ^
../drivers/net/bnxt/tf_ulp/ulp_mapper_tfc.c:1961:34: error: unused variable ‘ulp_mapper_tfc_core_ops’ [-Werror=unused-variable]
1961 | const struct ulp_mapper_core_ops ulp_mapper_tfc_core_ops = {
| ^~~~~~~~~~~~~~~~~~~~~~~
../drivers/net/bnxt/tf_ulp/ulp_mapper_tfc.c: At top level:
../drivers/net/bnxt/tf_ulp/ulp_mapper_tfc.c:457:1: error: ‘ulp_mapper_tfc_em_tbl_process’ defined but not used [-Werror=unused-function]
457 | ulp_mapper_tfc_em_tbl_process(struct bnxt_ulp_mapper_parms *parms,
| ^~~~~~~~~~~~~~~~~~~~~~~~~~~~~
cc1: all warnings being treated as errors
[1320/3681] Compiling C object drivers/libtmp_rte_net_bnxt.a.p/net_bnxt_tf_ulp_bnxt_ulp_tf.c.o
[1321/3681] Compiling C object drivers/libtmp_rte_net_bnxt.a.p/net_bnxt_tf_ulp_ulp_mapper_tf.c.o
[1322/3681] Compiling C object drivers/libtmp_rte_net_bnxt.a.p/net_bnxt_tf_ulp_ulp_fc_mgr_tfc.c.o
[1323/3681] Compiling C object drivers/libtmp_rte_net_bnxt.a.p/net_bnxt_tf_ulp_ulp_sc_mgr.c.o
[1324/3681] Compiling C object drivers/libtmp_rte_net_bnxt.a.p/net_bnxt_tf_ulp_ulp_alloc_tbl.c.o
[1325/3681] Compiling C object drivers/libtmp_rte_net_bnxt.a.p/net_bnxt_tf_ulp_bnxt_ulp_tfc.c.o
[1326/3681] Compiling C object drivers/libtmp_rte_net_bnxt.a.p/net_bnxt_tf_ulp_ulp_fc_mgr_tf.c.o
[1327/3681] Compiling C object drivers/libtmp_rte_net_bnxt.a.p/net_bnxt_tf_ulp_ulp_mapper.c.o
[1328/3681] Compiling C object drivers/libtmp_rte_net_bnxt.a.p/net_bnxt_tf_ulp_ulp_rte_parser.c.o
ninja: build stopped
*Build Failed #22:
OS: Fedora43-64
Target: x86_64-native-linuxapp-clang
FAILED: drivers/libtmp_rte_net_bnxt.a.p/net_bnxt_tf_ulp_ulp_mapper_tfc.c.o
clang -Idrivers/libtmp_rte_net_bnxt.a.p -Idrivers -I../drivers -Idrivers/net/bnxt -I../drivers/net/bnxt -Idrivers/net/bnxt/tf_ulp -I../drivers/net/bnxt/tf_ulp -Idrivers/net/bnxt/tf_ulp/generic_templates -I../drivers/net/bnxt/tf_ulp/generic_templates -Idrivers/net/bnxt/tf_core -I../drivers/net/bnxt/tf_core -Idrivers/net/bnxt/tf_core/v3 -I../drivers/net/bnxt/tf_core/v3 -Idrivers/net/bnxt/hcapi/cfa -I../drivers/net/bnxt/hcapi/cfa -Idrivers/net/bnxt/hcapi/cfa_v3 -I../drivers/net/bnxt/hcapi/cfa_v3 -I../drivers/net/bnxt/hcapi/cfa_v3/include -I../drivers/net/bnxt/hcapi/cfa_v3/include/platform/dpdk -I../drivers/net/bnxt/hcapi/cfa_v3/bld/p70 -I../drivers/net/bnxt/hcapi/cfa_v3/bld/p70/host -I../drivers/net/bnxt/hcapi/cfa_v3/bld/include -I../drivers/net/bnxt/hcapi/cfa_v3/bld/include/host -I../drivers/net/bnxt/hcapi/cfa_v3/bld/include/p70 -I../drivers/net/bnxt/hcapi/cfa_v3/mm/include -I../drivers/net/bnxt/hcapi/cfa_v3/tim/include -I../drivers/net/bnxt/hcapi/cfa_v3/tpm/include -Ilib/ethdev -I../lib/ethdev -Ilib/eal/common -I../lib/eal/common -I. -I.. -Iconfig -I../config -Ilib/eal/include -I../lib/eal/include -Ilib/eal/linux/include -I../lib/eal/linux/include -Ilib/eal/x86/include -I../lib/eal/x86/include -I../kernel/linux -Ilib/eal -I../lib/eal -Ilib/kvargs -I../lib/kvargs -Ilib/log -I../lib/log -Ilib/metrics -I../lib/metrics -Ilib/telemetry -I../lib/telemetry -Ilib/argparse -I../lib/argparse -Ilib/net -I../lib/net -Ilib/mbuf -I../lib/mbuf -Ilib/mempool -I../lib/mempool -Ilib/ring -I../lib/ring -Ilib/meter -I../lib/meter -Idrivers/bus/pci -I../drivers/bus/pci -I../drivers/bus/pci/linux -Ilib/pci -I../lib/pci -Idrivers/bus/vdev -I../drivers/bus/vdev -Ilib/hash -I../lib/hash -Ilib/rcu -I../lib/rcu -fdiagnostics-color=always -D_FILE_OFFSET_BITS=64 -Wall -Winvalid-pch -Wextra -Werror -std=c11 -O3 -include rte_config.h -Wvla -Wcast-qual -Wcomma -Wdeprecated -Wformat -Wformat-nonliteral -Wformat-security -Wmissing-declarations -Wmissing-prototypes -Wnested-externs -Wold-style-definition -Wpointer-arith -Wshadow -Wsign-compare -Wstrict-prototypes -Wundef -Wwrite-strings -Wno-missing-field-initializers -D_GNU_SOURCE -fPIC -march=native -mrtm -DALLOW_EXPERIMENTAL_API -DALLOW_INTERNAL_API -Wno-format-truncation -Wno-address-of-packed-member -Wno-vla -Wno-shadow -DBNXT_TF_APP_ID=0 -DSUPPORT_CFA_HW_P70=1 -DCFA_BLD_PRINT_OBJ=1 -DRTE_COMPONENT_CLASS=pmd_net -DRTE_COMPONENT_NAME=bnxt -DRTE_LOG_DEFAULT_LOGTYPE=pmd.net.bnxt -MD -MQ drivers/libtmp_rte_net_bnxt.a.p/net_bnxt_tf_ulp_ulp_mapper_tfc.c.o -MF drivers/libtmp_rte_net_bnxt.a.p/net_bnxt_tf_ulp_ulp_mapper_tfc.c.o.d -o drivers/libtmp_rte_net_bnxt.a.p/net_bnxt_tf_ulp_ulp_mapper_tfc.c.o -c ../drivers/net/bnxt/tf_ulp/ulp_mapper_tfc.c
../drivers/net/bnxt/tf_ulp/ulp_mapper_tfc.c:662:1: error: function definition is not allowed here
662 | {
| ^
../drivers/net/bnxt/tf_ulp/ulp_mapper_tfc.c:710:1: error: function definition is not allowed here
710 | {
| ^
../drivers/net/bnxt/tf_ulp/ulp_mapper_tfc.c:733:1: error: function definition is not allowed here
733 | {
| ^
../drivers/net/bnxt/tf_ulp/ulp_mapper_tfc.c:1031:1: error: function definition is not allowed here
1031 | {
| ^
../drivers/net/bnxt/tf_ulp/ulp_mapper_tfc.c:1063:1: error: function definition is not allowed here
1063 | {
| ^
../drivers/net/bnxt/tf_ulp/ulp_mapper_tfc.c:1371:1: error: function definition is not allowed here
1371 | {
| ^
../drivers/net/bnxt/tf_ulp/ulp_mapper_tfc.c:1420:1: error: function definition is not allowed here
1420 | {
| ^
../drivers/net/bnxt/tf_ulp/ulp_mapper_tfc.c:1525:1: error: function definition is not allowed here
1525 | {
| ^
../drivers/net/bnxt/tf_ulp/ulp_mapper_tfc.c:1558:1: error: function definition is not allowed here
1558 | {
| ^
../drivers/net/bnxt/tf_ulp/ulp_mapper_tfc.c:1595:1: error: function definition is not allowed here
1595 | {
| ^
../drivers/net/bnxt/tf_ulp/ulp_mapper_tfc.c:1633:1: error: function definition is not allowed here
1633 | {
| ^
../drivers/net/bnxt/tf_ulp/ulp_mapper_tfc.c:1667:1: error: function definition is not allowed here
1667 | {
| ^
../drivers/net/bnxt/tf_ulp/ulp_mapper_tfc.c:1699:1: error: function definition is not allowed here
1699 | {
| ^
../drivers/net/bnxt/tf_ulp/ulp_mapper_tfc.c:1720:1: error: function definition is not allowed here
1720 | {
| ^
../drivers/net/bnxt/tf_ulp/ulp_mapper_tfc.c:1757:1: error: function definition is not allowed here
1757 | {
| ^
../drivers/net/bnxt/tf_ulp/ulp_mapper_tfc.c:1767:1: error: function definition is not allowed here
1767 | {
| ^
../drivers/net/bnxt/tf_ulp/ulp_mapper_tfc.c:1798:1: error: function definition is not allowed here
1798 | {
| ^
../drivers/net/bnxt/tf_ulp/ulp_mapper_tfc.c:1805:1: error: function definition is not allowed here
1805 | {
| ^
../drivers/net/bnxt/tf_ulp/ulp_mapper_tfc.c:1822:1: error: function definition is not allowed here
1822 | {
| ^
fatal error: too many errors emitted, stopping now [-ferror-limit=]
20 errors generated.
[1321/3681] Compiling C object drivers/libtmp_rte_net_bnxt.a.p/net_bnxt_tf_ulp_ulp_sc_mgr.c.o
[1322/3681] Compiling C object drivers/libtmp_rte_net_bnxt.a.p/net_bnxt_tf_ulp_bnxt_ulp_tf.c.o
[1323/3681] Compiling C object drivers/libtmp_rte_net_bnxt.a.p/net_bnxt_tf_ulp_ulp_mapper_tf.c.o
[1324/3681] Compiling C object drivers/libtmp_rte_net_bnxt.a.p/net_bnxt_tf_ulp_ulp_mapper.c.o
[1325/3681] Compiling C object drivers/libtmp_rte_net_bnxt.a.p/net_bnxt_tf_ulp_ulp_fc_mgr_tfc.c.o
[1326/3681] Compiling C object drivers/libtmp_rte_net_bnxt.a.p/net_bnxt_tf_ulp_bnxt_ulp_tfc.c.o
[1327/3681] Compiling C object drivers/libtmp_rte_net_bnxt.a.p/net_bnxt_tf_ulp_ulp_fc_mgr_tf.c.o
[1328/3681] Compiling C object drivers/libtmp_rte_net_bnxt.a.p/net_bnxt_tf_ulp_ulp_alloc_tbl.c.o
[1329/3681] Compiling C object drivers/libtmp_rte_net_bnxt.a.p/net_bnxt_tf_ulp_ulp_rte_parser.c.o
ninja: build stopped
*Build Failed #23:
OS: OpenEuler2404-64
Target: x86_64-native-linuxapp-gcc
FAILED: drivers/libtmp_rte_net_bnxt.a.p/net_bnxt_tf_ulp_ulp_mapper_tfc.c.o
gcc -Idrivers/libtmp_rte_net_bnxt.a.p -Idrivers -I../drivers -Idrivers/net/bnxt -I../drivers/net/bnxt -Idrivers/net/bnxt/tf_ulp -I../drivers/net/bnxt/tf_ulp -Idrivers/net/bnxt/tf_ulp/generic_templates -I../drivers/net/bnxt/tf_ulp/generic_templates -Idrivers/net/bnxt/tf_core -I../drivers/net/bnxt/tf_core -Idrivers/net/bnxt/tf_core/v3 -I../drivers/net/bnxt/tf_core/v3 -Idrivers/net/bnxt/hcapi/cfa -I../drivers/net/bnxt/hcapi/cfa -Idrivers/net/bnxt/hcapi/cfa_v3 -I../drivers/net/bnxt/hcapi/cfa_v3 -I../drivers/net/bnxt/hcapi/cfa_v3/include -I../drivers/net/bnxt/hcapi/cfa_v3/include/platform/dpdk -I../drivers/net/bnxt/hcapi/cfa_v3/bld/p70 -I../drivers/net/bnxt/hcapi/cfa_v3/bld/p70/host -I../drivers/net/bnxt/hcapi/cfa_v3/bld/include -I../drivers/net/bnxt/hcapi/cfa_v3/bld/include/host -I../drivers/net/bnxt/hcapi/cfa_v3/bld/include/p70 -I../drivers/net/bnxt/hcapi/cfa_v3/mm/include -I../drivers/net/bnxt/hcapi/cfa_v3/tim/include -I../drivers/net/bnxt/hcapi/cfa_v3/tpm/include -Ilib/ethdev -I../lib/ethdev -Ilib/eal/common -I../lib/eal/common -I. -I.. -Iconfig -I../config -Ilib/eal/include -I../lib/eal/include -Ilib/eal/linux/include -I../lib/eal/linux/include -Ilib/eal/x86/include -I../lib/eal/x86/include -I../kernel/linux -Ilib/eal -I../lib/eal -Ilib/kvargs -I../lib/kvargs -Ilib/log -I../lib/log -Ilib/metrics -I../lib/metrics -Ilib/telemetry -I../lib/telemetry -Ilib/argparse -I../lib/argparse -Ilib/net -I../lib/net -Ilib/mbuf -I../lib/mbuf -Ilib/mempool -I../lib/mempool -Ilib/ring -I../lib/ring -Ilib/meter -I../lib/meter -Idrivers/bus/pci -I../drivers/bus/pci -I../drivers/bus/pci/linux -Ilib/pci -I../lib/pci -Idrivers/bus/vdev -I../drivers/bus/vdev -Ilib/hash -I../lib/hash -Ilib/rcu -I../lib/rcu -fdiagnostics-color=always -D_FILE_OFFSET_BITS=64 -Wall -Winvalid-pch -Wextra -Werror -std=c11 -O3 -include rte_config.h -Wvla -Wcast-qual -Wdeprecated -Wformat -Wformat-nonliteral -Wformat-security -Wmissing-declarations -Wmissing-prototypes -Wnested-externs -Wold-style-definition -Wpointer-arith -Wshadow -Wsign-compare -Wstrict-prototypes -Wundef -Wwrite-strings -Wno-packed-not-aligned -Wno-missing-field-initializers -D_GNU_SOURCE -fPIC -march=native -mrtm -DALLOW_EXPERIMENTAL_API -DALLOW_INTERNAL_API -Wno-format-truncation -Wno-address-of-packed-member -Wno-vla -Wno-shadow -DBNXT_TF_APP_ID=0 -DSUPPORT_CFA_HW_P70=1 -DCFA_BLD_PRINT_OBJ=1 -DRTE_COMPONENT_CLASS=pmd_net -DRTE_COMPONENT_NAME=bnxt -DRTE_LOG_DEFAULT_LOGTYPE=pmd.net.bnxt -MD -MQ drivers/libtmp_rte_net_bnxt.a.p/net_bnxt_tf_ulp_ulp_mapper_tfc.c.o -MF drivers/libtmp_rte_net_bnxt.a.p/net_bnxt_tf_ulp_ulp_mapper_tfc.c.o.d -o drivers/libtmp_rte_net_bnxt.a.p/net_bnxt_tf_ulp_ulp_mapper_tfc.c.o -c ../drivers/net/bnxt/tf_ulp/ulp_mapper_tfc.c
../drivers/net/bnxt/tf_ulp/ulp_mapper_tfc.c: In function ‘ulp_mapper_tfc_em_tbl_process’:
../drivers/net/bnxt/tf_ulp/ulp_mapper_tfc.c:659:1: error: invalid storage class for function ‘ulp_mapper_tfc_em_entry_free’
659 | ulp_mapper_tfc_em_entry_free(struct bnxt_ulp_context *ulp,
| ^~~~~~~~~~~~~~~~~~~~~~~~~~~~
../drivers/net/bnxt/tf_ulp/ulp_mapper_tfc.c:708:1: error: invalid storage class for function ‘ulp_mapper_tfc_dyn_blob_size_get’
708 | ulp_mapper_tfc_dyn_blob_size_get(struct bnxt_ulp_mapper_parms *mparms,
| ^~~~~~~~~~~~~~~~~~~~~~~~~~~~~~~~
../drivers/net/bnxt/tf_ulp/ulp_mapper_tfc.c:731:1: error: invalid storage class for function ‘ulp_mapper_tfc_index_tbl_process’
731 | ulp_mapper_tfc_index_tbl_process(struct bnxt_ulp_mapper_parms *parms,
| ^~~~~~~~~~~~~~~~~~~~~~~~~~~~~~~~
../drivers/net/bnxt/tf_ulp/ulp_mapper_tfc.c:1029:1: error: invalid storage class for function ‘ulp_mapper_tfc_index_entry_free’
1029 | ulp_mapper_tfc_index_entry_free(struct bnxt_ulp_context *ulp_ctx,
| ^~~~~~~~~~~~~~~~~~~~~~~~~~~~~~~
../drivers/net/bnxt/tf_ulp/ulp_mapper_tfc.c:1060:1: error: invalid storage class for function ‘ulp_mapper_tfc_cmm_tbl_process’
1060 | ulp_mapper_tfc_cmm_tbl_process(struct bnxt_ulp_mapper_parms *parms,
| ^~~~~~~~~~~~~~~~~~~~~~~~~~~~~~
../drivers/net/bnxt/tf_ulp/ulp_mapper_tfc.c:1368:1: error: invalid storage class for function ‘ulp_mapper_tfc_cmm_entry_free’
1368 | ulp_mapper_tfc_cmm_entry_free(struct bnxt_ulp_context *ulp_ctx,
| ^~~~~~~~~~~~~~~~~~~~~~~~~~~~~
../drivers/net/bnxt/tf_ulp/ulp_mapper_tfc.c:1418:1: error: invalid storage class for function ‘ulp_mapper_tfc_if_tbl_process’
1418 | ulp_mapper_tfc_if_tbl_process(struct bnxt_ulp_mapper_parms *parms,
| ^~~~~~~~~~~~~~~~~~~~~~~~~~~~~
../drivers/net/bnxt/tf_ulp/ulp_mapper_tfc.c:1519:1: error: invalid storage class for function ‘ulp_mapper_tfc_ident_alloc’
1519 | ulp_mapper_tfc_ident_alloc(struct bnxt_ulp_context *ulp_ctx,
| ^~~~~~~~~~~~~~~~~~~~~~~~~~
../drivers/net/bnxt/tf_ulp/ulp_mapper_tfc.c:1556:1: error: invalid storage class for function ‘ulp_mapper_tfc_ident_free’
1556 | ulp_mapper_tfc_ident_free(struct bnxt_ulp_context *ulp_ctx,
| ^~~~~~~~~~~~~~~~~~~~~~~~~
../drivers/net/bnxt/tf_ulp/ulp_mapper_tfc.c:1589:1: error: invalid storage class for function ‘ulp_mapper_tfc_global_ident_alloc’
1589 | ulp_mapper_tfc_global_ident_alloc(struct bnxt_ulp_context *ulp_ctx,
| ^~~~~~~~~~~~~~~~~~~~~~~~~~~~~~~~~
../drivers/net/bnxt/tf_ulp/ulp_mapper_tfc.c:1631:1: error: invalid storage class for function ‘ulp_mapper_tfc_global_ident_free’
1631 | ulp_mapper_tfc_global_ident_free(struct bnxt_ulp_context *ulp_ctx,
| ^~~~~~~~~~~~~~~~~~~~~~~~~~~~~~~~
../drivers/net/bnxt/tf_ulp/ulp_mapper_tfc.c:1665:1: error: invalid storage class for function ‘ulp_mapper_tfc_tcam_entry_free’
1665 | ulp_mapper_tfc_tcam_entry_free(struct bnxt_ulp_context *ulp,
| ^~~~~~~~~~~~~~~~~~~~~~~~~~~~~~
../drivers/net/bnxt/tf_ulp/ulp_mapper_tfc.c:1695:1: error: invalid storage class for function ‘ulp_mapper_tfc_dyn_tbl_type_get’
1695 | ulp_mapper_tfc_dyn_tbl_type_get(struct bnxt_ulp_mapper_parms *parm __rte_unused,
| ^~~~~~~~~~~~~~~~~~~~~~~~~~~~~~~
../drivers/net/bnxt/tf_ulp/ulp_mapper_tfc.c:1715:1: error: invalid storage class for function ‘ulp_mapper_tfc_index_tbl_alloc_process’
1715 | ulp_mapper_tfc_index_tbl_alloc_process(struct bnxt_ulp_context *ulp,
| ^~~~~~~~~~~~~~~~~~~~~~~~~~~~~~~~~~~~~~
../drivers/net/bnxt/tf_ulp/ulp_mapper_tfc.c:1753:1: error: invalid storage class for function ‘ulp_mapper_tfc_app_glb_resource_info_init’
1753 | ulp_mapper_tfc_app_glb_resource_info_init(struct bnxt_ulp_context
| ^~~~~~~~~~~~~~~~~~~~~~~~~~~~~~~~~~~~~~~~~
../drivers/net/bnxt/tf_ulp/ulp_mapper_tfc.c:1763:1: error: invalid storage class for function ‘ulp_mapper_tfc_handle_to_offset’
1763 | ulp_mapper_tfc_handle_to_offset(struct bnxt_ulp_mapper_parms *parms __rte_unused,
| ^~~~~~~~~~~~~~~~~~~~~~~~~~~~~~~
../drivers/net/bnxt/tf_ulp/ulp_mapper_tfc.c:1797:1: error: invalid storage class for function ‘ulp_mapper_tfc_mpc_batch_start’
1797 | ulp_mapper_tfc_mpc_batch_start(struct tfc_mpc_batch_info_t *batch_info)
| ^~~~~~~~~~~~~~~~~~~~~~~~~~~~~~
../drivers/net/bnxt/tf_ulp/ulp_mapper_tfc.c:1803:1: error: invalid storage class for function ‘ulp_mapper_tfc_mtr_stats_hndl_set’
1803 | ulp_mapper_tfc_mtr_stats_hndl_set(struct bnxt_ulp_mapper_parms *parms __rte_unused,
| ^~~~~~~~~~~~~~~~~~~~~~~~~~~~~~~~~
../drivers/net/bnxt/tf_ulp/ulp_mapper_tfc.c:1821:1: error: invalid storage class for function ‘ulp_mapper_tfc_mtr_stats_hndl_get’
1821 | ulp_mapper_tfc_mtr_stats_hndl_get(uint32_t mtr_id, uint64_t *stats_hndl)
| ^~~~~~~~~~~~~~~~~~~~~~~~~~~~~~~~~
../drivers/net/bnxt/tf_ulp/ulp_mapper_tfc.c:1837:1: error: invalid storage class for function ‘ulp_mapper_tfc_mtr_stats_hndl_del’
1837 | ulp_mapper_tfc_mtr_stats_hndl_del(uint32_t mtr_id)
| ^~~~~~~~~~~~~~~~~~~~~~~~~~~~~~~~~
../drivers/net/bnxt/tf_ulp/ulp_mapper_tfc.c:1852:1: error: invalid storage class for function ‘ulp_mapper_tfc_glb_idx_tbl_alloc’
1852 | ulp_mapper_tfc_glb_idx_tbl_alloc(struct bnxt_ulp_context *ulp_ctx,
| ^~~~~~~~~~~~~~~~~~~~~~~~~~~~~~~~
../drivers/net/bnxt/tf_ulp/ulp_mapper_tfc.c:1892:1: error: invalid storage class for function ‘ulp_mapper_tfc_glb_idx_tbl_free’
1892 | ulp_mapper_tfc_glb_idx_tbl_free(struct bnxt_ulp_context *ulp_ctx,
| ^~~~~~~~~~~~~~~~~~~~~~~~~~~~~~~
../drivers/net/bnxt/tf_ulp/ulp_mapper_tfc.c:1926:1: error: invalid storage class for function ‘ulp_mapper_tfc_tcam_prio_update’
1926 | ulp_mapper_tfc_tcam_prio_update(struct bnxt_ulp_mapper_parms *parms,
| ^~~~~~~~~~~~~~~~~~~~~~~~~~~~~~~
../drivers/net/bnxt/tf_ulp/ulp_mapper_tfc.c:1990:1: error: expected declaration or statement at end of input
1990 | };
| ^
../drivers/net/bnxt/tf_ulp/ulp_mapper_tfc.c:1961:34: error: unused variable ‘ulp_mapper_tfc_core_ops’ [-Werror=unused-variable]
1961 | const struct ulp_mapper_core_ops ulp_mapper_tfc_core_ops = {
| ^~~~~~~~~~~~~~~~~~~~~~~
../drivers/net/bnxt/tf_ulp/ulp_mapper_tfc.c: At top level:
../drivers/net/bnxt/tf_ulp/ulp_mapper_tfc.c:457:1: error: ‘ulp_mapper_tfc_em_tbl_process’ defined but not used [-Werror=unused-function]
457 | ulp_mapper_tfc_em_tbl_process(struct bnxt_ulp_mapper_parms *parms,
| ^~~~~~~~~~~~~~~~~~~~~~~~~~~~~
cc1: all warnings being treated as errors
[1329/3700] Compiling C object drivers/libtmp_rte_net_bnxt.a.p/net_bnxt_tf_ulp_bnxt_ulp_tf.c.o
[1330/3700] Compiling C object drivers/libtmp_rte_net_bnxt.a.p/net_bnxt_tf_ulp_ulp_mapper_tf.c.o
[1331/3700] Compiling C object drivers/libtmp_rte_net_bnxt.a.p/net_bnxt_tf_ulp_ulp_sc_mgr.c.o
[1332/3700] Compiling C object drivers/libtmp_rte_net_bnxt.a.p/net_bnxt_tf_ulp_ulp_fc_mgr_tfc.c.o
[1333/3700] Compiling C object drivers/libtmp_rte_net_bnxt.a.p/net_bnxt_tf_ulp_ulp_fc_mgr_tf.c.o
[1334/3700] Compiling C object drivers/libtmp_rte_net_bnxt.a.p/net_bnxt_tf_ulp_ulp_alloc_tbl.c.o
[1335/3700] Compiling C object drivers/libtmp_rte_net_bnxt.a.p/net_bnxt_tf_ulp_ulp_mapper.c.o
[1336/3700] Compiling C object drivers/libtmp_rte_net_bnxt.a.p/net_bnxt_tf_ulp_bnxt_ulp_tfc.c.o
[1337/3700] Compiling C object drivers/libtmp_rte_net_bnxt.a.p/net_bnxt_tf_ulp_ulp_rte_parser.c.o
ninja: build stopped
DPDK STV team
More information about the test-report
mailing list