|FAILURE| pw169564-169564 Description: Build error encountered
al-sw-devops at alabs.net
al-sw-devops at alabs.net
Tue Sep 15 21:02:12 CEST 2026
Test-Name: DPDK Fast test suite
Test-Label: aws-unit-testing
Test-Status: FAILURE
_Unit Testing Build error encountered _
https://dpdk.org/patch/169564
Test Status Summary:
+--------------+------------------+
| Architecture | DPDK Unit Test |
+--------------+------------------+
| x86_64 | FAILURE |
+--------------+------------------+
| arm64 | FAILURE |
+--------------+------------------+
Test environment (aarch64):
Description: Build error encountered
OS : Ubuntu 24.04.1 LTS
Kernel : 7.0.0-1011-aws
NIC : Elastic Network Adapter
GCC : 13.3.0-6ubuntu2~24.04
Test last 100 lines (aarch64)
../drivers/net/bnxt/tf_ulp/ulp_mapper_tfc.c:1418:1: error: invalid storage class for function ‘ulp_mapper_tfc_if_tbl_process’
1418 | ulp_mapper_tfc_if_tbl_process(struct bnxt_ulp_mapper_parms *parms,
| ^~~~~~~~~~~~~~~~~~~~~~~~~~~~~
../drivers/net/bnxt/tf_ulp/ulp_mapper_tfc.c:1519:1: error: invalid storage class for function ‘ulp_mapper_tfc_ident_alloc’
1519 | ulp_mapper_tfc_ident_alloc(struct bnxt_ulp_context *ulp_ctx,
| ^~~~~~~~~~~~~~~~~~~~~~~~~~
../drivers/net/bnxt/tf_ulp/ulp_mapper_tfc.c:1556:1: error: invalid storage class for function ‘ulp_mapper_tfc_ident_free’
1556 | ulp_mapper_tfc_ident_free(struct bnxt_ulp_context *ulp_ctx,
| ^~~~~~~~~~~~~~~~~~~~~~~~~
../drivers/net/bnxt/tf_ulp/ulp_mapper_tfc.c:1589:1: error: invalid storage class for function ‘ulp_mapper_tfc_global_ident_alloc’
1589 | ulp_mapper_tfc_global_ident_alloc(struct bnxt_ulp_context *ulp_ctx,
| ^~~~~~~~~~~~~~~~~~~~~~~~~~~~~~~~~
../drivers/net/bnxt/tf_ulp/ulp_mapper_tfc.c:1631:1: error: invalid storage class for function ‘ulp_mapper_tfc_global_ident_free’
1631 | ulp_mapper_tfc_global_ident_free(struct bnxt_ulp_context *ulp_ctx,
| ^~~~~~~~~~~~~~~~~~~~~~~~~~~~~~~~
../drivers/net/bnxt/tf_ulp/ulp_mapper_tfc.c:1665:1: error: invalid storage class for function ‘ulp_mapper_tfc_tcam_entry_free’
1665 | ulp_mapper_tfc_tcam_entry_free(struct bnxt_ulp_context *ulp,
| ^~~~~~~~~~~~~~~~~~~~~~~~~~~~~~
../drivers/net/bnxt/tf_ulp/ulp_mapper_tfc.c:1695:1: error: invalid storage class for function ‘ulp_mapper_tfc_dyn_tbl_type_get’
1695 | ulp_mapper_tfc_dyn_tbl_type_get(struct bnxt_ulp_mapper_parms *parm __rte_unused,
| ^~~~~~~~~~~~~~~~~~~~~~~~~~~~~~~
../drivers/net/bnxt/tf_ulp/ulp_mapper_tfc.c:1715:1: error: invalid storage class for function ‘ulp_mapper_tfc_index_tbl_alloc_process’
1715 | ulp_mapper_tfc_index_tbl_alloc_process(struct bnxt_ulp_context *ulp,
| ^~~~~~~~~~~~~~~~~~~~~~~~~~~~~~~~~~~~~~
../drivers/net/bnxt/tf_ulp/ulp_mapper_tfc.c:1753:1: error: invalid storage class for function ‘ulp_mapper_tfc_app_glb_resource_info_init’
1753 | ulp_mapper_tfc_app_glb_resource_info_init(struct bnxt_ulp_context
| ^~~~~~~~~~~~~~~~~~~~~~~~~~~~~~~~~~~~~~~~~
../drivers/net/bnxt/tf_ulp/ulp_mapper_tfc.c:1763:1: error: invalid storage class for function ‘ulp_mapper_tfc_handle_to_offset’
1763 | ulp_mapper_tfc_handle_to_offset(struct bnxt_ulp_mapper_parms *parms __rte_unused,
| ^~~~~~~~~~~~~~~~~~~~~~~~~~~~~~~
../drivers/net/bnxt/tf_ulp/ulp_mapper_tfc.c:1797:1: error: invalid storage class for function ‘ulp_mapper_tfc_mpc_batch_start’
1797 | ulp_mapper_tfc_mpc_batch_start(struct tfc_mpc_batch_info_t *batch_info)
| ^~~~~~~~~~~~~~~~~~~~~~~~~~~~~~
../drivers/net/bnxt/tf_ulp/ulp_mapper_tfc.c:1803:1: error: invalid storage class for function ‘ulp_mapper_tfc_mtr_stats_hndl_set’
1803 | ulp_mapper_tfc_mtr_stats_hndl_set(struct bnxt_ulp_mapper_parms *parms __rte_unused,
| ^~~~~~~~~~~~~~~~~~~~~~~~~~~~~~~~~
../drivers/net/bnxt/tf_ulp/ulp_mapper_tfc.c:1821:1: error: invalid storage class for function ‘ulp_mapper_tfc_mtr_stats_hndl_get’
1821 | ulp_mapper_tfc_mtr_stats_hndl_get(uint32_t mtr_id, uint64_t *stats_hndl)
| ^~~~~~~~~~~~~~~~~~~~~~~~~~~~~~~~~
../drivers/net/bnxt/tf_ulp/ulp_mapper_tfc.c:1837:1: error: invalid storage class for function ‘ulp_mapper_tfc_mtr_stats_hndl_del’
1837 | ulp_mapper_tfc_mtr_stats_hndl_del(uint32_t mtr_id)
| ^~~~~~~~~~~~~~~~~~~~~~~~~~~~~~~~~
../drivers/net/bnxt/tf_ulp/ulp_mapper_tfc.c:1852:1: error: invalid storage class for function ‘ulp_mapper_tfc_glb_idx_tbl_alloc’
1852 | ulp_mapper_tfc_glb_idx_tbl_alloc(struct bnxt_ulp_context *ulp_ctx,
| ^~~~~~~~~~~~~~~~~~~~~~~~~~~~~~~~
../drivers/net/bnxt/tf_ulp/ulp_mapper_tfc.c:1892:1: error: invalid storage class for function ‘ulp_mapper_tfc_glb_idx_tbl_free’
1892 | ulp_mapper_tfc_glb_idx_tbl_free(struct bnxt_ulp_context *ulp_ctx,
| ^~~~~~~~~~~~~~~~~~~~~~~~~~~~~~~
../drivers/net/bnxt/tf_ulp/ulp_mapper_tfc.c:1926:1: error: invalid storage class for function ‘ulp_mapper_tfc_tcam_prio_update’
1926 | ulp_mapper_tfc_tcam_prio_update(struct bnxt_ulp_mapper_parms *parms,
| ^~~~~~~~~~~~~~~~~~~~~~~~~~~~~~~
../drivers/net/bnxt/tf_ulp/ulp_mapper_tfc.c:1990:1: error: expected declaration or statement at end of input
1990 | };
| ^
../drivers/net/bnxt/tf_ulp/ulp_mapper_tfc.c:1961:34: warning: unused variable ‘ulp_mapper_tfc_core_ops’ [-Wunused-variable]
1961 | const struct ulp_mapper_core_ops ulp_mapper_tfc_core_ops = {
| ^~~~~~~~~~~~~~~~~~~~~~~
../drivers/net/bnxt/tf_ulp/ulp_mapper_tfc.c: At top level:
../drivers/net/bnxt/tf_ulp/ulp_mapper_tfc.c:457:1: warning: ‘ulp_mapper_tfc_em_tbl_process’ defined but not used [-Wunused-function]
457 | ulp_mapper_tfc_em_tbl_process(struct bnxt_ulp_mapper_parms *parms,
| ^~~~~~~~~~~~~~~~~~~~~~~~~~~~~
[1208/3243] Generating drivers/rte_net_avp.sym_chk with a custom command (wrapped by meson to capture output)
[1209/3243] Compiling C object drivers/libtmp_rte_net_bnxt.a.p/net_bnxt_tf_ulp_generic_templates_ulp_template_db_act.c.o
[1210/3243] Compiling C object drivers/libtmp_rte_net_bnxt.a.p/net_bnxt_tf_ulp_ulp_flow_db.c.o
[1211/3243] Compiling C object drivers/libtmp_rte_net_bnxt.a.p/net_bnxt_bnxt_rxr.c.o
[1212/3243] Generating drivers/rte_dma_cnxk.sym_chk with a custom command (wrapped by meson to capture output)
[1213/3243] Compiling C object drivers/libtmp_rte_net_bnxt.a.p/net_bnxt_tf_ulp_generic_templates_ulp_template_db_tbl.c.o
[1214/3243] Compiling C object drivers/libtmp_rte_net_bnxt.a.p/net_bnxt_tf_ulp_ulp_port_db.c.o
[1215/3243] Generating drivers/rte_net_axgbe.pmd.c with a custom command
[1216/3243] Compiling C object drivers/libtmp_rte_dma_dpaa.a.p/dma_dpaa_dpaa_qdma.c.o
[1217/3243] Compiling C object drivers/libtmp_rte_net_bnxt.a.p/net_bnxt_tf_ulp_generic_templates_ulp_template_db_class.c.o
[1218/3243] Generating drivers/rte_dma_skeleton.sym_chk with a custom command (wrapped by meson to capture output)
[1219/3243] Compiling C object drivers/libtmp_rte_net_bnxt.a.p/net_bnxt_tf_ulp_ulp_tun.c.o
[1220/3243] Compiling C object drivers/libtmp_rte_net_bnxt.a.p/net_bnxt_tf_ulp_ulp_fc_mgr_tfc.c.o
[1221/3243] Compiling C object drivers/libtmp_rte_net_bnxt.a.p/net_bnxt_tf_ulp_generic_templates_ulp_template_db_wh_plus_act.c.o
[1222/3243] Generating drivers/rte_mempool_bucket.sym_chk with a custom command (wrapped by meson to capture output)
[1223/3243] Compiling C object drivers/libtmp_rte_net_bnxt.a.p/net_bnxt_tf_ulp_ulp_sc_mgr_tfc.c.o
[1224/3243] Compiling C object drivers/libtmp_rte_net_bnxt.a.p/net_bnxt_tf_ulp_ulp_fc_mgr_tf.c.o
[1225/3243] Compiling C object drivers/libtmp_rte_net_bnxt.a.p/net_bnxt_tf_ulp_generic_templates_ulp_template_db_wh_plus_class.c.o
[1226/3243] Compiling C object drivers/libtmp_rte_net_bnxt.a.p/net_bnxt_tf_ulp_ulp_alloc_tbl.c.o
[1227/3243] Compiling C object drivers/libtmp_rte_net_bnxt.a.p/net_bnxt_tf_ulp_generic_templates_ulp_template_db_thor_act.c.o
[1228/3243] Compiling C object drivers/libtmp_rte_net_bnxt.a.p/net_bnxt_tf_ulp_ulp_tfc_ha_mgr.c.o
[1229/3243] Compiling C object drivers/libtmp_rte_net_bnxt.a.p/net_bnxt_tf_ulp_ulp_sc_mgr.c.o
[1230/3243] Compiling C object drivers/libtmp_rte_net_bnxt.a.p/net_bnxt_tf_ulp_bnxt_ulp_tfc.c.o
[1231/3243] Compiling C object drivers/libtmp_rte_net_bnxt.a.p/net_bnxt_tf_ulp_bnxt_ulp_tf.c.o
[1232/3243] Compiling C object drivers/libtmp_rte_net_bnxt.a.p/net_bnxt_tf_ulp_ulp_mapper_tf.c.o
[1233/3243] Compiling C object lib/librte_pipeline.a.p/pipeline_rte_swx_pipeline.c.o
[1234/3243] Generating drivers/rte_common_sfc_efx.sym_chk with a custom command (wrapped by meson to capture output)
[1235/3243] Compiling C object drivers/libtmp_rte_net_bnxt.a.p/net_bnxt_bnxt_ethdev.c.o
[1236/3243] Compiling C object drivers/libtmp_rte_net_bnxt.a.p/net_bnxt_tf_ulp_ulp_rte_parser.c.o
[1237/3243] Compiling C object drivers/libtmp_rte_net_bnxt.a.p/net_bnxt_tf_ulp_ulp_mapper.c.o
[1238/3243] Generating drivers/rte_common_cnxk.sym_chk with a custom command (wrapped by meson to capture output)
[1239/3243] Compiling C object drivers/libtmp_rte_net_bnxt.a.p/net_bnxt_bnxt_hwrm.c.o
[1240/3243] Compiling C object lib/librte_vhost.a.p/vhost_virtio_net.c.o
ninja: build stopped: subcommand failed.
Test build failed.
FAILURE
Test environment (x86_64):
Description: Build error encountered
OS : Ubuntu 24.04.3 LTS
Kernel : 7.0.0-1011-aws
NIC : Elastic Network Adapter
GCC : 13.3.0-6ubuntu2~24.04
Test last 100 lines (x86_64)
| ^~~~~~~~~~~~~~~~~~~~~~~~~~~~
../drivers/net/bnxt/tf_ulp/ulp_mapper_tfc.c:708:1: error: invalid storage class for function ‘ulp_mapper_tfc_dyn_blob_size_get’
708 | ulp_mapper_tfc_dyn_blob_size_get(struct bnxt_ulp_mapper_parms *mparms,
| ^~~~~~~~~~~~~~~~~~~~~~~~~~~~~~~~
../drivers/net/bnxt/tf_ulp/ulp_mapper_tfc.c:731:1: error: invalid storage class for function ‘ulp_mapper_tfc_index_tbl_process’
731 | ulp_mapper_tfc_index_tbl_process(struct bnxt_ulp_mapper_parms *parms,
| ^~~~~~~~~~~~~~~~~~~~~~~~~~~~~~~~
../drivers/net/bnxt/tf_ulp/ulp_mapper_tfc.c:1029:1: error: invalid storage class for function ‘ulp_mapper_tfc_index_entry_free’
1029 | ulp_mapper_tfc_index_entry_free(struct bnxt_ulp_context *ulp_ctx,
| ^~~~~~~~~~~~~~~~~~~~~~~~~~~~~~~
../drivers/net/bnxt/tf_ulp/ulp_mapper_tfc.c:1060:1: error: invalid storage class for function ‘ulp_mapper_tfc_cmm_tbl_process’
1060 | ulp_mapper_tfc_cmm_tbl_process(struct bnxt_ulp_mapper_parms *parms,
| ^~~~~~~~~~~~~~~~~~~~~~~~~~~~~~
../drivers/net/bnxt/tf_ulp/ulp_mapper_tfc.c:1368:1: error: invalid storage class for function ‘ulp_mapper_tfc_cmm_entry_free’
1368 | ulp_mapper_tfc_cmm_entry_free(struct bnxt_ulp_context *ulp_ctx,
| ^~~~~~~~~~~~~~~~~~~~~~~~~~~~~
../drivers/net/bnxt/tf_ulp/ulp_mapper_tfc.c:1418:1: error: invalid storage class for function ‘ulp_mapper_tfc_if_tbl_process’
1418 | ulp_mapper_tfc_if_tbl_process(struct bnxt_ulp_mapper_parms *parms,
| ^~~~~~~~~~~~~~~~~~~~~~~~~~~~~
../drivers/net/bnxt/tf_ulp/ulp_mapper_tfc.c:1519:1: error: invalid storage class for function ‘ulp_mapper_tfc_ident_alloc’
1519 | ulp_mapper_tfc_ident_alloc(struct bnxt_ulp_context *ulp_ctx,
| ^~~~~~~~~~~~~~~~~~~~~~~~~~
../drivers/net/bnxt/tf_ulp/ulp_mapper_tfc.c:1556:1: error: invalid storage class for function ‘ulp_mapper_tfc_ident_free’
1556 | ulp_mapper_tfc_ident_free(struct bnxt_ulp_context *ulp_ctx,
| ^~~~~~~~~~~~~~~~~~~~~~~~~
../drivers/net/bnxt/tf_ulp/ulp_mapper_tfc.c:1589:1: error: invalid storage class for function ‘ulp_mapper_tfc_global_ident_alloc’
1589 | ulp_mapper_tfc_global_ident_alloc(struct bnxt_ulp_context *ulp_ctx,
| ^~~~~~~~~~~~~~~~~~~~~~~~~~~~~~~~~
../drivers/net/bnxt/tf_ulp/ulp_mapper_tfc.c:1631:1: error: invalid storage class for function ‘ulp_mapper_tfc_global_ident_free’
1631 | ulp_mapper_tfc_global_ident_free(struct bnxt_ulp_context *ulp_ctx,
| ^~~~~~~~~~~~~~~~~~~~~~~~~~~~~~~~
../drivers/net/bnxt/tf_ulp/ulp_mapper_tfc.c:1665:1: error: invalid storage class for function ‘ulp_mapper_tfc_tcam_entry_free’
1665 | ulp_mapper_tfc_tcam_entry_free(struct bnxt_ulp_context *ulp,
| ^~~~~~~~~~~~~~~~~~~~~~~~~~~~~~
../drivers/net/bnxt/tf_ulp/ulp_mapper_tfc.c:1695:1: error: invalid storage class for function ‘ulp_mapper_tfc_dyn_tbl_type_get’
1695 | ulp_mapper_tfc_dyn_tbl_type_get(struct bnxt_ulp_mapper_parms *parm __rte_unused,
| ^~~~~~~~~~~~~~~~~~~~~~~~~~~~~~~
../drivers/net/bnxt/tf_ulp/ulp_mapper_tfc.c:1715:1: error: invalid storage class for function ‘ulp_mapper_tfc_index_tbl_alloc_process’
1715 | ulp_mapper_tfc_index_tbl_alloc_process(struct bnxt_ulp_context *ulp,
| ^~~~~~~~~~~~~~~~~~~~~~~~~~~~~~~~~~~~~~
../drivers/net/bnxt/tf_ulp/ulp_mapper_tfc.c:1753:1: error: invalid storage class for function ‘ulp_mapper_tfc_app_glb_resource_info_init’
1753 | ulp_mapper_tfc_app_glb_resource_info_init(struct bnxt_ulp_context
| ^~~~~~~~~~~~~~~~~~~~~~~~~~~~~~~~~~~~~~~~~
../drivers/net/bnxt/tf_ulp/ulp_mapper_tfc.c:1763:1: error: invalid storage class for function ‘ulp_mapper_tfc_handle_to_offset’
1763 | ulp_mapper_tfc_handle_to_offset(struct bnxt_ulp_mapper_parms *parms __rte_unused,
| ^~~~~~~~~~~~~~~~~~~~~~~~~~~~~~~
../drivers/net/bnxt/tf_ulp/ulp_mapper_tfc.c:1797:1: error: invalid storage class for function ‘ulp_mapper_tfc_mpc_batch_start’
1797 | ulp_mapper_tfc_mpc_batch_start(struct tfc_mpc_batch_info_t *batch_info)
| ^~~~~~~~~~~~~~~~~~~~~~~~~~~~~~
../drivers/net/bnxt/tf_ulp/ulp_mapper_tfc.c:1803:1: error: invalid storage class for function ‘ulp_mapper_tfc_mtr_stats_hndl_set’
1803 | ulp_mapper_tfc_mtr_stats_hndl_set(struct bnxt_ulp_mapper_parms *parms __rte_unused,
| ^~~~~~~~~~~~~~~~~~~~~~~~~~~~~~~~~
../drivers/net/bnxt/tf_ulp/ulp_mapper_tfc.c:1821:1: error: invalid storage class for function ‘ulp_mapper_tfc_mtr_stats_hndl_get’
1821 | ulp_mapper_tfc_mtr_stats_hndl_get(uint32_t mtr_id, uint64_t *stats_hndl)
| ^~~~~~~~~~~~~~~~~~~~~~~~~~~~~~~~~
../drivers/net/bnxt/tf_ulp/ulp_mapper_tfc.c:1837:1: error: invalid storage class for function ‘ulp_mapper_tfc_mtr_stats_hndl_del’
1837 | ulp_mapper_tfc_mtr_stats_hndl_del(uint32_t mtr_id)
| ^~~~~~~~~~~~~~~~~~~~~~~~~~~~~~~~~
../drivers/net/bnxt/tf_ulp/ulp_mapper_tfc.c:1852:1: error: invalid storage class for function ‘ulp_mapper_tfc_glb_idx_tbl_alloc’
1852 | ulp_mapper_tfc_glb_idx_tbl_alloc(struct bnxt_ulp_context *ulp_ctx,
| ^~~~~~~~~~~~~~~~~~~~~~~~~~~~~~~~
../drivers/net/bnxt/tf_ulp/ulp_mapper_tfc.c:1892:1: error: invalid storage class for function ‘ulp_mapper_tfc_glb_idx_tbl_free’
1892 | ulp_mapper_tfc_glb_idx_tbl_free(struct bnxt_ulp_context *ulp_ctx,
| ^~~~~~~~~~~~~~~~~~~~~~~~~~~~~~~
../drivers/net/bnxt/tf_ulp/ulp_mapper_tfc.c:1926:1: error: invalid storage class for function ‘ulp_mapper_tfc_tcam_prio_update’
1926 | ulp_mapper_tfc_tcam_prio_update(struct bnxt_ulp_mapper_parms *parms,
| ^~~~~~~~~~~~~~~~~~~~~~~~~~~~~~~
../drivers/net/bnxt/tf_ulp/ulp_mapper_tfc.c:1990:1: error: expected declaration or statement at end of input
1990 | };
| ^
../drivers/net/bnxt/tf_ulp/ulp_mapper_tfc.c:1961:34: warning: unused variable ‘ulp_mapper_tfc_core_ops’ [-Wunused-variable]
1961 | const struct ulp_mapper_core_ops ulp_mapper_tfc_core_ops = {
| ^~~~~~~~~~~~~~~~~~~~~~~
../drivers/net/bnxt/tf_ulp/ulp_mapper_tfc.c: At top level:
../drivers/net/bnxt/tf_ulp/ulp_mapper_tfc.c:457:1: warning: ‘ulp_mapper_tfc_em_tbl_process’ defined but not used [-Wunused-function]
457 | ulp_mapper_tfc_em_tbl_process(struct bnxt_ulp_mapper_parms *parms,
| ^~~~~~~~~~~~~~~~~~~~~~~~~~~~~
[798/3423] Compiling C object drivers/libtmp_rte_net_bnxt.a.p/net_bnxt_tf_ulp_ulp_alloc_tbl.c.o
[799/3423] Compiling C object drivers/libtmp_rte_net_bnxt.a.p/net_bnxt_tf_ulp_ulp_fc_mgr_tf.c.o
[800/3423] Compiling C object drivers/libtmp_rte_net_bnxt.a.p/net_bnxt_tf_ulp_ulp_fc_mgr_tfc.c.o
[801/3423] Compiling C object drivers/libtmp_rte_net_bnxt.a.p/net_bnxt_tf_ulp_ulp_mapper_tf.c.o
[802/3423] Compiling C object drivers/libtmp_rte_net_bnxt.a.p/net_bnxt_tf_ulp_ulp_sc_mgr_tfc.c.o
[803/3423] Compiling C object drivers/libtmp_rte_net_bnxt.a.p/net_bnxt_tf_ulp_bnxt_ulp_tf.c.o
[804/3423] Compiling C object drivers/libtmp_rte_net_bnxt.a.p/net_bnxt_tf_ulp_bnxt_ulp_tfc.c.o
[805/3423] Compiling C object drivers/libtmp_rte_net_bnxt.a.p/net_bnxt_tf_ulp_ulp_sc_mgr.c.o
[806/3423] Compiling C object drivers/libtmp_rte_net_bnxt.a.p/net_bnxt_tf_ulp_ulp_tfc_ha_mgr.c.o
[807/3423] Compiling C object drivers/libtmp_rte_crypto_octeontx.a.p/crypto_octeontx_otx_cryptodev_ops.c.o
[808/3423] Generating drivers/rte_common_cnxk.sym_chk with a custom command (wrapped by meson to capture output)
[809/3423] Compiling C object drivers/libtmp_rte_net_bnxt.a.p/net_bnxt_tf_ulp_ulp_mapper.c.o
[810/3423] Compiling C object drivers/libtmp_rte_net_bnxt.a.p/net_bnxt_tf_ulp_ulp_rte_parser.c.o
[811/3423] Compiling C object drivers/libtmp_rte_net_bnxt.a.p/net_bnxt_bnxt_hwrm.c.o
[812/3423] Compiling C object drivers/libtmp_rte_crypto_cnxk.a.p/crypto_cnxk_cn9k_cryptodev_ops.c.o
[813/3423] Compiling C object drivers/libtmp_rte_crypto_cnxk.a.p/crypto_cnxk_cn20k_cryptodev_ops.c.o
[814/3423] Compiling C object drivers/libtmp_rte_crypto_cnxk.a.p/crypto_cnxk_cn10k_cryptodev_ops.c.o
ninja: build stopped: subcommand failed.
Test build failed.
FAILURE
More information about the test-report
mailing list