compilation|FAILURE| pw(169807) sid(39337) job(PER_PATCH_BUILD20211)[2/2] net/e1000: maintain caches on non-coherent DMA

sys_stv at intel.com sys_stv at intel.com
Sat Sep 19 11:00:14 CEST 2026


Test-Label: Intel-compilation
Test-Status: FAILURE
http://dpdk.org/patch/169807

_Compilation issues_

Submitter: Md Rayhanul Islam <r97yhan at gmail.com>
Date: 2026-09-18 22:50:44
Reply_mail: <20260918225045.177125-3-r97yhan at gmail.com>

DPDK git baseline: Repo:dpdk, CommitID: 6bbb7b38b17f9ea4c981b5d374612a16833df41e


Meson Build Summary: 23 Builds Done, 13 Successful, 10 Failures, 0 Blocked

+-------------------+------------+--------------+------------+------------+-----------+----------+------------+
| os                | gcc-static | clang-static | icc-static | gcc-shared | gcc-debug | document | gcc-16byte |
+-------------------+------------+--------------+------------+------------+-----------+----------+------------+
| OpenAnolis8.10-64 | pass       |              |            |            |           |          |            |
| FreeBSD15-64      | pass       | pass         |            | pass       | pass      |          |            |
| RHEL9.8-64        | pass       | pass         |            | pass       | pass      |          |            |
| SUSE16-64         | fail       | pass         |            |            |           |          |            |
| AzureLinux4.0-64  | fail       |              |            |            |           |          |            |
| UB2604-32         | fail       |              |            |            |           |          |            |
| RHEL10.2-64       | fail       |              |            |            |           |          |            |
| UB2604-64         | fail       | pass         |            |            |           | fail     | fail       |
| RHEL10.2-64RT     | fail       |              |            |            |           |          |            |
| UB2404-64         | fail       |              |            |            |           |          |            |
| Fedora44-64       | pass       | pass         |            |            |           |          |            |
| OpenEuler2404-64  | fail       |              |            |            |           |          |            |
+-------------------+------------+--------------+------------+------------+-----------+----------+------------+

Comments: 
Because of DPDK bug (https://bugs.dpdk.org/show_bug.cgi?id=928),
All the dpdk-next-* branch add `Ddisable_drivers=event/cnxk` option when build with ICC complier. 
 
Test environment and configuration as below:


OS: OpenAnolis8.10-64
	Kernel Version: 5.10.134-18.an8.x86_64
	GCC Version: gcc (GCC) 8.5.0 20210514 (Anolis 8.5.0-24.0.1)
	Clang Version: 18.1.8 (Red Hat 18.1.8-1.0.1.module+an8.9.0+11287+9d0292d3)
	x86_64-native-linuxapp-gcc

OS: FreeBSD15-64
	Kernel Version: 15.1-RELEASE-p3
	GCC Version: gcc (FreeBSD Ports Collection) 14.2.0
	Clang Version: 19.1.7 (https://github.com/llvm/llvm-project.git llvmorg-19.1.7-0-gcd708029e0b2)
	x86_64-native-bsdapp-gcc
	x86_64-native-bsdapp-clang
	x86_64-native-bsdapp-gcc+shared
	x86_64-native-bsdapp-gcc+debug

OS: RHEL9.8-64
	Kernel Version: 5.14.0-687.5.3.el9_8.x86_64
	GCC Version: gcc (GCC) 11.5.0 20240719 (Red Hat 11.5.0-14)
	Clang Version: 21.1.8 (Red Hat, Inc. 21.1.8-2.el9)
	x86_64-native-linuxapp-gcc
	x86_64-native-linuxapp-clang
	x86_64-native-linuxapp-gcc+shared
	x86_64-native-linuxapp-gcc+debug

OS: SUSE16-64
	Kernel Version: 6.12.0-160000.26-default
	GCC Version: gcc (SUSE Linux) 15.2.0
	Clang Version: 19.1.7
	x86_64-native-linuxapp-clang
	x86_64-native-linuxapp-gcc

OS: AzureLinux4.0-64
	Kernel Version: 6.18.31-1.3.azl4.x86_64
	GCC Version: gcc (GCC) 15.2.1 20260123 (Red Hat 15.2.1-7)
	Clang Version: 21.1.8 (Microsoft Corporation 21.1.8-8.azl4)
	x86_64-native-linuxapp-gcc

OS: UB2604-32
	Kernel Version: 7.0.0-31-generic
	GCC Version: gcc (Ubuntu 15.2.0-16ubuntu1) 15.2.0
	Clang Version: 21.1.8 (6ubuntu1)
	i686-native-linuxapp-gcc

OS: RHEL10.2-64
	Kernel Version: 6.12.0-211.7.3.el10_2.x86_64
	GCC Version: gcc (GCC) 14.3.1 20251022 (Red Hat 14.3.1-4)
	Clang Version: 21.1.8 (Red Hat, Inc. 21.1.8-1.el10)
	x86_64-native-linuxapp-gcc

OS: UB2604-64
	Kernel Version: 7.0.0-31-generic
	GCC Version: gcc (Ubuntu 15.2.0-16ubuntu1) 15.2.0
	Clang Version: 21.1.8 (6ubuntu1)
	x86_64-native-linuxapp-gcc+16byte
	x86_64-native-linuxapp-gcc
	x86_64-native-linuxapp-clang
	x86_64-native-linuxapp-doc

OS: RHEL10.2-64RT
	Kernel Version: 6.12.0-211.7.3.el10_2.x86_64+rt
	GCC Version: gcc (GCC) 14.3.1 20251022 (Red Hat 14.3.1-4)
	Clang Version: 21.1.8 (Red Hat, Inc. 21.1.8-1.el10)
	x86_64-native-linuxapp-gcc

OS: UB2404-64
	Kernel Version: 6.8.0-139-generic
	GCC Version: gcc (Ubuntu 13.3.0-6ubuntu2~24.04.1) 13.3.0
	Clang Version: 18.1.3 (1ubuntu1)
	x86_64-native-linuxapp-gcc

OS: Fedora44-64
	Kernel Version: 6.19.10-300.fc44.x86_64
	GCC Version: gcc (GCC) 16.0.1 20260321 (Red Hat 16.0.1-0)
	Clang Version: 22.1.8 (Fedora 22.1.8-4.fc44)
	x86_64-native-linuxapp-gcc
	x86_64-native-linuxapp-clang

OS: OpenEuler2404-64
	Kernel Version: 6.6.0-159.4.13.167.oe2403sp4.x86_64
	GCC Version: gcc (GCC) 12.3.1 (openEuler 12.3.1-110.oe2403sp4)
	Clang Version: 17.0.6 ( 17.0.6-67.oe2403sp4)
	x86_64-native-linuxapp-gcc



*Build Failed #1:
OS: SUSE16-64
Target: x86_64-native-linuxapp-gcc
FAILED: lib/librte_eal.a.p/eal_linux_eal_memory.c.o 
gcc -Ilib/librte_eal.a.p -Ilib -I../lib -Ilib/eal/common -I../lib/eal/common -I. -I.. -Iconfig -I../config -Ilib/eal/include -I../lib/eal/include -Ilib/eal/linux/include -I../lib/eal/linux/include -Ilib/eal/x86/include -I../lib/eal/x86/include -I../kernel/linux -Ilib/eal -I../lib/eal -Ilib/kvargs -I../lib/kvargs -Ilib/log -I../lib/log -Ilib/metrics -I../lib/metrics -Ilib/telemetry -I../lib/telemetry -Ilib/argparse -I../lib/argparse -fdiagnostics-color=always -D_FILE_OFFSET_BITS=64 -Wall -Winvalid-pch -Wextra -Werror -std=c11 -O3 -include rte_config.h -Wvla -Wcast-qual -Wdeprecated -Wformat -Wformat-nonliteral -Wformat-security -Wmissing-declarations -Wmissing-prototypes -Wnested-externs -Wold-style-definition -Wpointer-arith -Wshadow -Wsign-compare -Wstrict-prototypes -Wundef -Wwrite-strings -Wno-packed-not-aligned -Wno-missing-field-initializers -fzero-init-padding-bits=all -D_GNU_SOURCE -fPIC -march=native -mrtm -DALLOW_EXPERIMENTAL_API -DALLOW_INTERNAL_API '-DABI_VERSION="27.0"' -DRTE_EAL_PTHREAD_ATTR_SETAFFINITY_NP -DRTE_LOG_DEFAULT_LOGTYPE=lib.eal -DRTE_COMPONENT_CLASS=lib -DRTE_COMPONENT_NAME=eal -MD -MQ lib/librte_eal.a.p/eal_linux_eal_memory.c.o -MF lib/librte_eal.a.p/eal_linux_eal_memory.c.o.d -o lib/librte_eal.a.p/eal_linux_eal_memory.c.o -c ../lib/eal/linux/eal_memory.c
In function ‘dt_scan_pci_dma_offset’,
    inlined from ‘dt_scan_pci_dma_offset’ at ../lib/eal/linux/eal_memory.c:284:7,
    inlined from ‘dt_scan_pci_dma_offset’ at ../lib/eal/linux/eal_memory.c:284:7,
    inlined from ‘dt_scan_pci_dma_offset’ at ../lib/eal/linux/eal_memory.c:284:7,
    inlined from ‘dt_scan_pci_dma_offset’ at ../lib/eal/linux/eal_memory.c:284:7,
    inlined from ‘eal_iova_pa_offset’ at ../lib/eal/linux/eal_memory.c:321:13:
../lib/eal/linux/eal_memory.c:281:21: error: ‘%s’ directive output may be truncated writing up to 255 bytes into a region of size between 0 and 4095 [-Werror=format-truncation=]
  281 |                 if (snprintf(child, sizeof(child), "%s/%s", dir,
      |                     ^~~~~~~~~~~~~~~~~~~~~~~~~~~~~~~~~~~~~~~~~~~~
  282 |                                 ent->d_name) >= (int)sizeof(child))
      |                                 ~~~~~~~~~~~~
../lib/eal/linux/eal_memory.c:281:21: note: ‘snprintf’ output between 2 and 4352 bytes into a destination of size 4096
cc1: all warnings being treated as errors
[104/3682] Compiling C object lib/librte_eal.a.p/eal_x86_rte_mmu.c.o
[105/3682] Compiling C object lib/librte_eal.a.p/eal_x86_rte_cycles.c.o
[106/3682] Compiling C object lib/librte_eal.a.p/eal_x86_rte_power_intrinsics.c.o
[107/3682] Compiling C object lib/librte_acl.a.p/acl_tb_mem.c.o
[108/3682] Compiling C object lib/librte_ring.a.p/ring_rte_ring.c.o
[109/3682] Compiling C object lib/librte_ring.a.p/ring_rte_soring.c.o
[110/3682] Compiling C object lib/librte_eal.a.p/eal_linux_eal_vfio.c.o
[111/3682] Compiling C object lib/librte_acl.a.p/acl_acl_run_scalar.c.o
[112/3682] Compiling C object lib/librte_rcu.a.p/rcu_rte_rcu_qsbr.c.o
ninja: build stopped




*Build Failed #2:
OS: AzureLinux4.0-64
Target: x86_64-native-linuxapp-gcc
FAILED: lib/librte_eal.a.p/eal_linux_eal_memory.c.o 
gcc -Ilib/librte_eal.a.p -Ilib -I../lib -Ilib/eal/common -I../lib/eal/common -I. -I.. -Iconfig -I../config -Ilib/eal/include -I../lib/eal/include -Ilib/eal/linux/include -I../lib/eal/linux/include -Ilib/eal/x86/include -I../lib/eal/x86/include -I../kernel/linux -Ilib/eal -I../lib/eal -Ilib/kvargs -I../lib/kvargs -Ilib/log -I../lib/log -Ilib/metrics -I../lib/metrics -Ilib/telemetry -I../lib/telemetry -Ilib/argparse -I../lib/argparse -fdiagnostics-color=always -D_FILE_OFFSET_BITS=64 -Wall -Winvalid-pch -Wextra -Werror -std=c11 -O3 -include rte_config.h -Wvla -Wcast-qual -Wdeprecated -Wformat -Wformat-nonliteral -Wformat-security -Wmissing-declarations -Wmissing-prototypes -Wnested-externs -Wold-style-definition -Wpointer-arith -Wshadow -Wsign-compare -Wstrict-prototypes -Wundef -Wwrite-strings -Wno-packed-not-aligned -Wno-missing-field-initializers -fzero-init-padding-bits=all -D_GNU_SOURCE -fPIC -march=native -mrtm -DALLOW_EXPERIMENTAL_API -DALLOW_INTERNAL_API '-DABI_VERSION="27.0"' -DRTE_EAL_PTHREAD_ATTR_SETAFFINITY_NP -DRTE_LOG_DEFAULT_LOGTYPE=lib.eal -DRTE_COMPONENT_CLASS=lib -DRTE_COMPONENT_NAME=eal -MD -MQ lib/librte_eal.a.p/eal_linux_eal_memory.c.o -MF lib/librte_eal.a.p/eal_linux_eal_memory.c.o.d -o lib/librte_eal.a.p/eal_linux_eal_memory.c.o -c ../lib/eal/linux/eal_memory.c
In function ‘dt_scan_pci_dma_offset’,
    inlined from ‘dt_scan_pci_dma_offset’ at ../lib/eal/linux/eal_memory.c:284:7,
    inlined from ‘dt_scan_pci_dma_offset’ at ../lib/eal/linux/eal_memory.c:284:7,
    inlined from ‘dt_scan_pci_dma_offset’ at ../lib/eal/linux/eal_memory.c:284:7,
    inlined from ‘dt_scan_pci_dma_offset’ at ../lib/eal/linux/eal_memory.c:284:7,
    inlined from ‘eal_iova_pa_offset’ at ../lib/eal/linux/eal_memory.c:321:13:
../lib/eal/linux/eal_memory.c:281:21: error: ‘%s’ directive output may be truncated writing up to 255 bytes into a region of size between 0 and 4095 [-Werror=format-truncation=]
  281 |                 if (snprintf(child, sizeof(child), "%s/%s", dir,
      |                     ^~~~~~~~~~~~~~~~~~~~~~~~~~~~~~~~~~~~~~~~~~~~
  282 |                                 ent->d_name) >= (int)sizeof(child))
      |                                 ~~~~~~~~~~~~
../lib/eal/linux/eal_memory.c:281:21: note: ‘snprintf’ output between 2 and 4352 bytes into a destination of size 4096
cc1: all warnings being treated as errors
[104/3700] Compiling C object lib/librte_eal.a.p/eal_x86_rte_cycles.c.o
[105/3700] Compiling C object lib/librte_eal.a.p/eal_x86_rte_mmu.c.o
[106/3700] Compiling C object lib/librte_eal.a.p/eal_x86_rte_power_intrinsics.c.o
[107/3700] Compiling C object lib/librte_ring.a.p/ring_rte_soring.c.o
[108/3700] Compiling C object lib/librte_acl.a.p/acl_rte_acl.c.o
[109/3700] Compiling C object lib/librte_eal.a.p/eal_linux_eal_vfio.c.o
[110/3700] Compiling C object lib/librte_ring.a.p/ring_rte_ring.c.o
[111/3700] Compiling C object lib/librte_rcu.a.p/rcu_rte_rcu_qsbr.c.o
[112/3700] Compiling C object lib/librte_ring.a.p/ring_soring.c.o
ninja: build stopped




*Build Failed #3:
OS: UB2604-32
Target: i686-native-linuxapp-gcc
FAILED: lib/librte_eal.a.p/eal_linux_eal_memory.c.o 
gcc -Ilib/librte_eal.a.p -Ilib -I../lib -Ilib/eal/common -I../lib/eal/common -I. -I.. -Iconfig -I../config -Ilib/eal/include -I../lib/eal/include -Ilib/eal/linux/include -I../lib/eal/linux/include -Ilib/eal/x86/include -I../lib/eal/x86/include -I../kernel/linux -Ilib/eal -I../lib/eal -Ilib/kvargs -I../lib/kvargs -Ilib/log -I../lib/log -Ilib/metrics -I../lib/metrics -Ilib/telemetry -I../lib/telemetry -Ilib/argparse -I../lib/argparse -fdiagnostics-color=always -D_FILE_OFFSET_BITS=64 -Wall -Winvalid-pch -Wextra -Werror -std=c11 -O3 -include rte_config.h -Wvla -Wcast-qual -Wdeprecated -Wformat -Wformat-nonliteral -Wformat-security -Wmissing-declarations -Wmissing-prototypes -Wnested-externs -Wold-style-definition -Wpointer-arith -Wshadow -Wsign-compare -Wstrict-prototypes -Wundef -Wwrite-strings -Wno-packed-not-aligned -Wno-missing-field-initializers -fzero-init-padding-bits=all -Wno-pointer-to-int-cast -D_GNU_SOURCE -m32 -fPIC -march=native -mrtm -DALLOW_EXPERIMENTAL_API -DALLOW_INTERNAL_API '-DABI_VERSION="27.0"' -DRTE_EAL_PTHREAD_ATTR_SETAFFINITY_NP -DRTE_LOG_DEFAULT_LOGTYPE=lib.eal -DRTE_COMPONENT_CLASS=lib -DRTE_COMPONENT_NAME=eal -MD -MQ lib/librte_eal.a.p/eal_linux_eal_memory.c.o -MF lib/librte_eal.a.p/eal_linux_eal_memory.c.o.d -o lib/librte_eal.a.p/eal_linux_eal_memory.c.o -c ../lib/eal/linux/eal_memory.c
In function ‘dt_scan_pci_dma_offset’,
    inlined from ‘dt_scan_pci_dma_offset’ at ../lib/eal/linux/eal_memory.c:284:7,
    inlined from ‘dt_scan_pci_dma_offset’ at ../lib/eal/linux/eal_memory.c:284:7,
    inlined from ‘dt_scan_pci_dma_offset’ at ../lib/eal/linux/eal_memory.c:284:7,
    inlined from ‘dt_scan_pci_dma_offset’ at ../lib/eal/linux/eal_memory.c:284:7,
    inlined from ‘eal_iova_pa_offset’ at ../lib/eal/linux/eal_memory.c:321:13:
../lib/eal/linux/eal_memory.c:281:21: error: ‘%s’ directive output may be truncated writing up to 255 bytes into a region of size between 0 and 4095 [-Werror=format-truncation=]
  281 |                 if (snprintf(child, sizeof(child), "%s/%s", dir,
      |                     ^~~~~~~~~~~~~~~~~~~~~~~~~~~~~~~~~~~~~~~~~~~~
  282 |                                 ent->d_name) >= (int)sizeof(child))
      |                                 ~~~~~~~~~~~~
In file included from /usr/include/stdio.h:974,
                 from ../lib/eal/linux/eal_memory.c:11:
In function ‘snprintf’,
    inlined from ‘dt_scan_pci_dma_offset’ at ../lib/eal/linux/eal_memory.c:281:7,
    inlined from ‘dt_scan_pci_dma_offset’ at ../lib/eal/linux/eal_memory.c:284:7,
    inlined from ‘dt_scan_pci_dma_offset’ at ../lib/eal/linux/eal_memory.c:284:7,
    inlined from ‘dt_scan_pci_dma_offset’ at ../lib/eal/linux/eal_memory.c:284:7,
    inlined from ‘dt_scan_pci_dma_offset’ at ../lib/eal/linux/eal_memory.c:284:7,
    inlined from ‘eal_iova_pa_offset’ at ../lib/eal/linux/eal_memory.c:321:13:
/usr/include/i386-linux-gnu/bits/stdio2.h:68:10: note: ‘__builtin___snprintf_chk’ output between 2 and 4352 bytes into a destination of size 4096
   68 |   return __builtin___snprintf_chk (__s, __n, __USE_FORTIFY_LEVEL - 1,
      |          ^~~~~~~~~~~~~~~~~~~~~~~~~~~~~~~~~~~~~~~~~~~~~~~~~~~~~~~~~~~~
   69 |                                    __glibc_objsize (__s), __fmt,
      |                                    ~~~~~~~~~~~~~~~~~~~~~~~~~~~~~
   70 |                                    __va_arg_pack ());
      |                                    ~~~~~~~~~~~~~~~~~
cc1: all warnings being treated as errors
[107/2795] Generating lib/rte_rcu_map with a custom command
[108/2795] Compiling C object lib/librte_eal.a.p/eal_x86_rte_power_intrinsics.c.o
[109/2795] Compiling C object lib/librte_ring.a.p/ring_rte_ring.c.o
[110/2795] Compiling C object lib/librte_ring.a.p/ring_rte_soring.c.o
[111/2795] Compiling C object lib/librte_eal.a.p/eal_linux_eal_vfio.c.o
[112/2795] Compiling C object lib/librte_mempool.a.p/mempool_rte_mempool.c.o
[113/2795] Compiling C object lib/librte_acl.a.p/acl_acl_run_sse.c.o
[114/2795] Compiling C object lib/librte_rcu.a.p/rcu_rte_rcu_qsbr.c.o
[115/2795] Compiling C object lib/librte_ring.a.p/ring_soring.c.o
ninja: build stopped




*Build Failed #4:
OS: RHEL10.2-64
Target: x86_64-native-linuxapp-gcc
FAILED: lib/librte_eal.a.p/eal_linux_eal_memory.c.o 
gcc -Ilib/librte_eal.a.p -Ilib -I../lib -Ilib/eal/common -I../lib/eal/common -I. -I.. -Iconfig -I../config -Ilib/eal/include -I../lib/eal/include -Ilib/eal/linux/include -I../lib/eal/linux/include -Ilib/eal/x86/include -I../lib/eal/x86/include -I../kernel/linux -Ilib/eal -I../lib/eal -Ilib/kvargs -I../lib/kvargs -Ilib/log -I../lib/log -Ilib/metrics -I../lib/metrics -Ilib/telemetry -I../lib/telemetry -Ilib/argparse -I../lib/argparse -fdiagnostics-color=always -D_FILE_OFFSET_BITS=64 -Wall -Winvalid-pch -Wextra -Werror -std=c11 -O3 -include rte_config.h -Wvla -Wcast-qual -Wdeprecated -Wformat -Wformat-nonliteral -Wformat-security -Wmissing-declarations -Wmissing-prototypes -Wnested-externs -Wold-style-definition -Wpointer-arith -Wshadow -Wsign-compare -Wstrict-prototypes -Wundef -Wwrite-strings -Wno-packed-not-aligned -Wno-missing-field-initializers -D_GNU_SOURCE -fPIC -march=native -mrtm -DALLOW_EXPERIMENTAL_API -DALLOW_INTERNAL_API '-DABI_VERSION="27.0"' -DRTE_EAL_PTHREAD_ATTR_SETAFFINITY_NP -DRTE_LOG_DEFAULT_LOGTYPE=lib.eal -DRTE_COMPONENT_CLASS=lib -DRTE_COMPONENT_NAME=eal -MD -MQ lib/librte_eal.a.p/eal_linux_eal_memory.c.o -MF lib/librte_eal.a.p/eal_linux_eal_memory.c.o.d -o lib/librte_eal.a.p/eal_linux_eal_memory.c.o -c ../lib/eal/linux/eal_memory.c
In function ‘dt_scan_pci_dma_offset’,
    inlined from ‘dt_scan_pci_dma_offset’ at ../lib/eal/linux/eal_memory.c:284:7,
    inlined from ‘dt_scan_pci_dma_offset’ at ../lib/eal/linux/eal_memory.c:284:7,
    inlined from ‘dt_scan_pci_dma_offset’ at ../lib/eal/linux/eal_memory.c:284:7,
    inlined from ‘dt_scan_pci_dma_offset’ at ../lib/eal/linux/eal_memory.c:284:7,
    inlined from ‘eal_iova_pa_offset’ at ../lib/eal/linux/eal_memory.c:321:13:
../lib/eal/linux/eal_memory.c:281:21: error: ‘%s’ directive output may be truncated writing up to 255 bytes into a region of size between 0 and 4095 [-Werror=format-truncation=]
  281 |                 if (snprintf(child, sizeof(child), "%s/%s", dir,
      |                     ^~~~~~~~~~~~~~~~~~~~~~~~~~~~~~~~~~~~~~~~~~~~
  282 |                                 ent->d_name) >= (int)sizeof(child))
      |                                 ~~~~~~~~~~~~
../lib/eal/linux/eal_memory.c:281:21: note: ‘snprintf’ output between 2 and 4352 bytes into a destination of size 4096
cc1: all warnings being treated as errors
[108/3700] Compiling C object lib/librte_eal.a.p/eal_x86_rte_power_intrinsics.c.o
[109/3700] Compiling C object lib/librte_acl.a.p/acl_rte_acl.c.o
[110/3700] Compiling C object lib/librte_eal.a.p/eal_linux_eal_vfio.c.o
[111/3700] Compiling C object lib/librte_ring.a.p/ring_rte_soring.c.o
[112/3700] Compiling C object lib/librte_ring.a.p/ring_rte_ring.c.o
[113/3700] Compiling C object lib/librte_mempool.a.p/mempool_rte_mempool_ops_default.c.o
[114/3700] Compiling C object lib/librte_mempool.a.p/mempool_rte_mempool_ops.c.o
[115/3700] Compiling C object lib/librte_mempool.a.p/mempool_rte_mempool.c.o
[116/3700] Compiling C object lib/librte_rcu.a.p/rcu_rte_rcu_qsbr.c.o
ninja: build stopped




*Build Failed #5:
OS: UB2604-64
Target: x86_64-native-linuxapp-gcc+16byte
FAILED: lib/librte_eal.a.p/eal_linux_eal_memory.c.o 
gcc -Ilib/librte_eal.a.p -Ilib -I../lib -Ilib/eal/common -I../lib/eal/common -I. -I.. -Iconfig -I../config -Ilib/eal/include -I../lib/eal/include -Ilib/eal/linux/include -I../lib/eal/linux/include -Ilib/eal/x86/include -I../lib/eal/x86/include -I../kernel/linux -Ilib/eal -I../lib/eal -Ilib/kvargs -I../lib/kvargs -Ilib/log -I../lib/log -Ilib/metrics -I../lib/metrics -Ilib/telemetry -I../lib/telemetry -Ilib/argparse -I../lib/argparse -fdiagnostics-color=always -D_FILE_OFFSET_BITS=64 -Wall -Winvalid-pch -Wextra -Werror -std=c11 -O3 -include rte_config.h -Wvla -Wcast-qual -Wdeprecated -Wformat -Wformat-nonliteral -Wformat-security -Wmissing-declarations -Wmissing-prototypes -Wnested-externs -Wold-style-definition -Wpointer-arith -Wshadow -Wsign-compare -Wstrict-prototypes -Wundef -Wwrite-strings -Wno-packed-not-aligned -Wno-missing-field-initializers -fzero-init-padding-bits=all -D_GNU_SOURCE -DRTE_LIBRTE_I40E_16BYTE_RX_DESC -DRTE_LIBRTE_ICE_16BYTE_RX_DESC -fPIC -march=native -mrtm -DALLOW_EXPERIMENTAL_API -DALLOW_INTERNAL_API '-DABI_VERSION="27.0"' -DRTE_EAL_PTHREAD_ATTR_SETAFFINITY_NP -DRTE_LOG_DEFAULT_LOGTYPE=lib.eal -DRTE_COMPONENT_CLASS=lib -DRTE_COMPONENT_NAME=eal -MD -MQ lib/librte_eal.a.p/eal_linux_eal_memory.c.o -MF lib/librte_eal.a.p/eal_linux_eal_memory.c.o.d -o lib/librte_eal.a.p/eal_linux_eal_memory.c.o -c ../lib/eal/linux/eal_memory.c
In function ‘dt_scan_pci_dma_offset’,
    inlined from ‘dt_scan_pci_dma_offset’ at ../lib/eal/linux/eal_memory.c:284:7,
    inlined from ‘dt_scan_pci_dma_offset’ at ../lib/eal/linux/eal_memory.c:284:7,
    inlined from ‘dt_scan_pci_dma_offset’ at ../lib/eal/linux/eal_memory.c:284:7,
    inlined from ‘dt_scan_pci_dma_offset’ at ../lib/eal/linux/eal_memory.c:284:7,
    inlined from ‘eal_iova_pa_offset’ at ../lib/eal/linux/eal_memory.c:321:13:
../lib/eal/linux/eal_memory.c:281:21: error: ‘%s’ directive output may be truncated writing up to 255 bytes into a region of size between 0 and 4095 [-Werror=format-truncation=]
  281 |                 if (snprintf(child, sizeof(child), "%s/%s", dir,
      |                     ^~~~~~~~~~~~~~~~~~~~~~~~~~~~~~~~~~~~~~~~~~~~
  282 |                                 ent->d_name) >= (int)sizeof(child))
      |                                 ~~~~~~~~~~~~
In file included from /usr/include/stdio.h:974,
                 from ../lib/eal/linux/eal_memory.c:11:
In function ‘snprintf’,
    inlined from ‘dt_scan_pci_dma_offset’ at ../lib/eal/linux/eal_memory.c:281:7,
    inlined from ‘dt_scan_pci_dma_offset’ at ../lib/eal/linux/eal_memory.c:284:7,
    inlined from ‘dt_scan_pci_dma_offset’ at ../lib/eal/linux/eal_memory.c:284:7,
    inlined from ‘dt_scan_pci_dma_offset’ at ../lib/eal/linux/eal_memory.c:284:7,
    inlined from ‘dt_scan_pci_dma_offset’ at ../lib/eal/linux/eal_memory.c:284:7,
    inlined from ‘eal_iova_pa_offset’ at ../lib/eal/linux/eal_memory.c:321:13:
/usr/include/x86_64-linux-gnu/bits/stdio2.h:68:10: note: ‘__builtin___snprintf_chk’ output between 2 and 4352 bytes into a destination of size 4096
   68 |   return __builtin___snprintf_chk (__s, __n, __USE_FORTIFY_LEVEL - 1,
      |          ^~~~~~~~~~~~~~~~~~~~~~~~~~~~~~~~~~~~~~~~~~~~~~~~~~~~~~~~~~~~
   69 |                                    __glibc_objsize (__s), __fmt,
      |                                    ~~~~~~~~~~~~~~~~~~~~~~~~~~~~~
   70 |                                    __va_arg_pack ());
      |                                    ~~~~~~~~~~~~~~~~~
cc1: all warnings being treated as errors
[104/3941] Compiling C object lib/librte_eal.a.p/eal_x86_rte_mmu.c.o
[105/3941] Compiling C object lib/librte_eal.a.p/eal_x86_rte_cycles.c.o
[106/3941] Compiling C object lib/librte_acl.a.p/acl_acl_run_scalar.c.o
[107/3941] Compiling C object lib/librte_ring.a.p/ring_rte_soring.c.o
[108/3941] Compiling C object lib/librte_ring.a.p/ring_rte_ring.c.o
[109/3941] Compiling C object lib/librte_eal.a.p/eal_linux_eal_vfio.c.o
[110/3941] Compiling C object lib/librte_acl.a.p/acl_acl_bld.c.o
[111/3941] Compiling C object lib/librte_rcu.a.p/rcu_rte_rcu_qsbr.c.o
[112/3941] Compiling C object lib/librte_ring.a.p/ring_soring.c.o
ninja: build stopped




*Build Failed #6:
OS: UB2604-64
Target: x86_64-native-linuxapp-gcc
FAILED: lib/librte_eal.a.p/eal_linux_eal_memory.c.o 
gcc -Ilib/librte_eal.a.p -Ilib -I../lib -Ilib/eal/common -I../lib/eal/common -I. -I.. -Iconfig -I../config -Ilib/eal/include -I../lib/eal/include -Ilib/eal/linux/include -I../lib/eal/linux/include -Ilib/eal/x86/include -I../lib/eal/x86/include -I../kernel/linux -Ilib/eal -I../lib/eal -Ilib/kvargs -I../lib/kvargs -Ilib/log -I../lib/log -Ilib/metrics -I../lib/metrics -Ilib/telemetry -I../lib/telemetry -Ilib/argparse -I../lib/argparse -fdiagnostics-color=always -D_FILE_OFFSET_BITS=64 -Wall -Winvalid-pch -Wextra -Werror -std=c11 -O3 -include rte_config.h -Wvla -Wcast-qual -Wdeprecated -Wformat -Wformat-nonliteral -Wformat-security -Wmissing-declarations -Wmissing-prototypes -Wnested-externs -Wold-style-definition -Wpointer-arith -Wshadow -Wsign-compare -Wstrict-prototypes -Wundef -Wwrite-strings -Wno-packed-not-aligned -Wno-missing-field-initializers -fzero-init-padding-bits=all -D_GNU_SOURCE -fPIC -march=native -mrtm -DALLOW_EXPERIMENTAL_API -DALLOW_INTERNAL_API '-DABI_VERSION="27.0"' -DRTE_EAL_PTHREAD_ATTR_SETAFFINITY_NP -DRTE_LOG_DEFAULT_LOGTYPE=lib.eal -DRTE_COMPONENT_CLASS=lib -DRTE_COMPONENT_NAME=eal -MD -MQ lib/librte_eal.a.p/eal_linux_eal_memory.c.o -MF lib/librte_eal.a.p/eal_linux_eal_memory.c.o.d -o lib/librte_eal.a.p/eal_linux_eal_memory.c.o -c ../lib/eal/linux/eal_memory.c
In function ‘dt_scan_pci_dma_offset’,
    inlined from ‘dt_scan_pci_dma_offset’ at ../lib/eal/linux/eal_memory.c:284:7,
    inlined from ‘dt_scan_pci_dma_offset’ at ../lib/eal/linux/eal_memory.c:284:7,
    inlined from ‘dt_scan_pci_dma_offset’ at ../lib/eal/linux/eal_memory.c:284:7,
    inlined from ‘dt_scan_pci_dma_offset’ at ../lib/eal/linux/eal_memory.c:284:7,
    inlined from ‘eal_iova_pa_offset’ at ../lib/eal/linux/eal_memory.c:321:13:
../lib/eal/linux/eal_memory.c:281:21: error: ‘%s’ directive output may be truncated writing up to 255 bytes into a region of size between 0 and 4095 [-Werror=format-truncation=]
  281 |                 if (snprintf(child, sizeof(child), "%s/%s", dir,
      |                     ^~~~~~~~~~~~~~~~~~~~~~~~~~~~~~~~~~~~~~~~~~~~
  282 |                                 ent->d_name) >= (int)sizeof(child))
      |                                 ~~~~~~~~~~~~
In file included from /usr/include/stdio.h:974,
                 from ../lib/eal/linux/eal_memory.c:11:
In function ‘snprintf’,
    inlined from ‘dt_scan_pci_dma_offset’ at ../lib/eal/linux/eal_memory.c:281:7,
    inlined from ‘dt_scan_pci_dma_offset’ at ../lib/eal/linux/eal_memory.c:284:7,
    inlined from ‘dt_scan_pci_dma_offset’ at ../lib/eal/linux/eal_memory.c:284:7,
    inlined from ‘dt_scan_pci_dma_offset’ at ../lib/eal/linux/eal_memory.c:284:7,
    inlined from ‘dt_scan_pci_dma_offset’ at ../lib/eal/linux/eal_memory.c:284:7,
    inlined from ‘eal_iova_pa_offset’ at ../lib/eal/linux/eal_memory.c:321:13:
/usr/include/x86_64-linux-gnu/bits/stdio2.h:68:10: note: ‘__builtin___snprintf_chk’ output between 2 and 4352 bytes into a destination of size 4096
   68 |   return __builtin___snprintf_chk (__s, __n, __USE_FORTIFY_LEVEL - 1,
      |          ^~~~~~~~~~~~~~~~~~~~~~~~~~~~~~~~~~~~~~~~~~~~~~~~~~~~~~~~~~~~
   69 |                                    __glibc_objsize (__s), __fmt,
      |                                    ~~~~~~~~~~~~~~~~~~~~~~~~~~~~~
   70 |                                    __va_arg_pack ());
      |                                    ~~~~~~~~~~~~~~~~~
cc1: all warnings being treated as errors
[106/3941] Compiling C object lib/librte_eal.a.p/eal_x86_rte_mmu.c.o
[107/3941] Compiling C object lib/librte_eal.a.p/eal_x86_rte_cycles.c.o
[108/3941] Compiling C object lib/librte_ring.a.p/ring_rte_soring.c.o
[109/3941] Compiling C object lib/librte_ring.a.p/ring_rte_ring.c.o
[110/3941] Compiling C object lib/librte_eal.a.p/eal_linux_eal_vfio.c.o
[111/3941] Compiling C object lib/librte_mempool.a.p/mempool_rte_mempool_ops.c.o
[112/3941] Compiling C object lib/librte_mempool.a.p/mempool_rte_mempool.c.o
[113/3941] Compiling C object lib/librte_rcu.a.p/rcu_rte_rcu_qsbr.c.o
[114/3941] Compiling C object lib/librte_ring.a.p/ring_soring.c.o
ninja: build stopped




*Build Failed #7:
OS: UB2604-64
Target: x86_64-native-linuxapp-doc
FAILED: lib/librte_eal.a.p/eal_linux_eal_memory.c.o 
gcc -Ilib/librte_eal.a.p -Ilib -I../lib -Ilib/eal/common -I../lib/eal/common -I. -I.. -Iconfig -I../config -Ilib/eal/include -I../lib/eal/include -Ilib/eal/linux/include -I../lib/eal/linux/include -Ilib/eal/x86/include -I../lib/eal/x86/include -I../kernel/linux -Ilib/eal -I../lib/eal -Ilib/kvargs -I../lib/kvargs -Ilib/log -I../lib/log -Ilib/metrics -I../lib/metrics -Ilib/telemetry -I../lib/telemetry -Ilib/argparse -I../lib/argparse -fdiagnostics-color=always -D_FILE_OFFSET_BITS=64 -Wall -Winvalid-pch -Wextra -Werror -std=c11 -O3 -include rte_config.h -Wvla -Wcast-qual -Wdeprecated -Wformat -Wformat-nonliteral -Wformat-security -Wmissing-declarations -Wmissing-prototypes -Wnested-externs -Wold-style-definition -Wpointer-arith -Wshadow -Wsign-compare -Wstrict-prototypes -Wundef -Wwrite-strings -Wno-packed-not-aligned -Wno-missing-field-initializers -fzero-init-padding-bits=all -D_GNU_SOURCE -fPIC -march=native -mrtm -DALLOW_EXPERIMENTAL_API -DALLOW_INTERNAL_API '-DABI_VERSION="27.0"' -DRTE_EAL_PTHREAD_ATTR_SETAFFINITY_NP -DRTE_LOG_DEFAULT_LOGTYPE=lib.eal -DRTE_COMPONENT_CLASS=lib -DRTE_COMPONENT_NAME=eal -MD -MQ lib/librte_eal.a.p/eal_linux_eal_memory.c.o -MF lib/librte_eal.a.p/eal_linux_eal_memory.c.o.d -o lib/librte_eal.a.p/eal_linux_eal_memory.c.o -c ../lib/eal/linux/eal_memory.c
In function ‘dt_scan_pci_dma_offset’,
    inlined from ‘dt_scan_pci_dma_offset’ at ../lib/eal/linux/eal_memory.c:284:7,
    inlined from ‘dt_scan_pci_dma_offset’ at ../lib/eal/linux/eal_memory.c:284:7,
    inlined from ‘dt_scan_pci_dma_offset’ at ../lib/eal/linux/eal_memory.c:284:7,
    inlined from ‘dt_scan_pci_dma_offset’ at ../lib/eal/linux/eal_memory.c:284:7,
    inlined from ‘eal_iova_pa_offset’ at ../lib/eal/linux/eal_memory.c:321:13:
../lib/eal/linux/eal_memory.c:281:21: error: ‘%s’ directive output may be truncated writing up to 255 bytes into a region of size between 0 and 4095 [-Werror=format-truncation=]
  281 |                 if (snprintf(child, sizeof(child), "%s/%s", dir,
      |                     ^~~~~~~~~~~~~~~~~~~~~~~~~~~~~~~~~~~~~~~~~~~~
  282 |                                 ent->d_name) >= (int)sizeof(child))
      |                                 ~~~~~~~~~~~~
In file included from /usr/include/stdio.h:974,
                 from ../lib/eal/linux/eal_memory.c:11:
In function ‘snprintf’,
    inlined from ‘dt_scan_pci_dma_offset’ at ../lib/eal/linux/eal_memory.c:281:7,
    inlined from ‘dt_scan_pci_dma_offset’ at ../lib/eal/linux/eal_memory.c:284:7,
    inlined from ‘dt_scan_pci_dma_offset’ at ../lib/eal/linux/eal_memory.c:284:7,
    inlined from ‘dt_scan_pci_dma_offset’ at ../lib/eal/linux/eal_memory.c:284:7,
    inlined from ‘dt_scan_pci_dma_offset’ at ../lib/eal/linux/eal_memory.c:284:7,
    inlined from ‘eal_iova_pa_offset’ at ../lib/eal/linux/eal_memory.c:321:13:
/usr/include/x86_64-linux-gnu/bits/stdio2.h:68:10: note: ‘__builtin___snprintf_chk’ output between 2 and 4352 bytes into a destination of size 4096
   68 |   return __builtin___snprintf_chk (__s, __n, __USE_FORTIFY_LEVEL - 1,
      |          ^~~~~~~~~~~~~~~~~~~~~~~~~~~~~~~~~~~~~~~~~~~~~~~~~~~~~~~~~~~~
   69 |                                    __glibc_objsize (__s), __fmt,
      |                                    ~~~~~~~~~~~~~~~~~~~~~~~~~~~~~
   70 |                                    __va_arg_pack ());
      |                                    ~~~~~~~~~~~~~~~~~
cc1: all warnings being treated as errors
[108/3750] Compiling C object lib/librte_ring.a.p/ring_rte_ring.c.o
[109/3750] Compiling C object lib/librte_ring.a.p/ring_rte_soring.c.o
[110/3750] Compiling C object lib/librte_mempool.a.p/mempool_rte_mempool_ops.c.o
[111/3750] Compiling C object lib/librte_mempool.a.p/mempool_mempool_trace_points.c.o
[112/3750] Compiling C object lib/librte_mempool.a.p/mempool_rte_mempool_ops_default.c.o
[113/3750] Compiling C object lib/librte_eal.a.p/eal_linux_eal_vfio.c.o
[114/3750] Compiling C object lib/librte_mempool.a.p/mempool_rte_mempool.c.o
[115/3750] Compiling C object lib/librte_rcu.a.p/rcu_rte_rcu_qsbr.c.o
[116/3750] Compiling C object lib/librte_ring.a.p/ring_soring.c.o
ninja: build stopped




*Build Failed #8:
OS: RHEL10.2-64RT
Target: x86_64-native-linuxapp-gcc
FAILED: lib/librte_eal.a.p/eal_linux_eal_memory.c.o 
gcc -Ilib/librte_eal.a.p -Ilib -I../lib -Ilib/eal/common -I../lib/eal/common -I. -I.. -Iconfig -I../config -Ilib/eal/include -I../lib/eal/include -Ilib/eal/linux/include -I../lib/eal/linux/include -Ilib/eal/x86/include -I../lib/eal/x86/include -I../kernel/linux -Ilib/eal -I../lib/eal -Ilib/kvargs -I../lib/kvargs -Ilib/log -I../lib/log -Ilib/metrics -I../lib/metrics -Ilib/telemetry -I../lib/telemetry -Ilib/argparse -I../lib/argparse -fdiagnostics-color=always -D_FILE_OFFSET_BITS=64 -Wall -Winvalid-pch -Wextra -Werror -std=c11 -O3 -include rte_config.h -Wvla -Wcast-qual -Wdeprecated -Wformat -Wformat-nonliteral -Wformat-security -Wmissing-declarations -Wmissing-prototypes -Wnested-externs -Wold-style-definition -Wpointer-arith -Wshadow -Wsign-compare -Wstrict-prototypes -Wundef -Wwrite-strings -Wno-packed-not-aligned -Wno-missing-field-initializers -D_GNU_SOURCE -fPIC -march=native -mrtm -DALLOW_EXPERIMENTAL_API -DALLOW_INTERNAL_API '-DABI_VERSION="27.0"' -DRTE_EAL_PTHREAD_ATTR_SETAFFINITY_NP -DRTE_LOG_DEFAULT_LOGTYPE=lib.eal -DRTE_COMPONENT_CLASS=lib -DRTE_COMPONENT_NAME=eal -MD -MQ lib/librte_eal.a.p/eal_linux_eal_memory.c.o -MF lib/librte_eal.a.p/eal_linux_eal_memory.c.o.d -o lib/librte_eal.a.p/eal_linux_eal_memory.c.o -c ../lib/eal/linux/eal_memory.c
In function ‘dt_scan_pci_dma_offset’,
    inlined from ‘dt_scan_pci_dma_offset’ at ../lib/eal/linux/eal_memory.c:284:7,
    inlined from ‘dt_scan_pci_dma_offset’ at ../lib/eal/linux/eal_memory.c:284:7,
    inlined from ‘dt_scan_pci_dma_offset’ at ../lib/eal/linux/eal_memory.c:284:7,
    inlined from ‘dt_scan_pci_dma_offset’ at ../lib/eal/linux/eal_memory.c:284:7,
    inlined from ‘eal_iova_pa_offset’ at ../lib/eal/linux/eal_memory.c:321:13:
../lib/eal/linux/eal_memory.c:281:21: error: ‘%s’ directive output may be truncated writing up to 255 bytes into a region of size between 0 and 4095 [-Werror=format-truncation=]
  281 |                 if (snprintf(child, sizeof(child), "%s/%s", dir,
      |                     ^~~~~~~~~~~~~~~~~~~~~~~~~~~~~~~~~~~~~~~~~~~~
  282 |                                 ent->d_name) >= (int)sizeof(child))
      |                                 ~~~~~~~~~~~~
../lib/eal/linux/eal_memory.c:281:21: note: ‘snprintf’ output between 2 and 4352 bytes into a destination of size 4096
cc1: all warnings being treated as errors
[104/3700] Compiling C object lib/librte_eal.a.p/eal_linux_eal_vfio_mp_sync.c.o
[105/3700] Compiling C object lib/librte_eal.a.p/eal_x86_rte_cycles.c.o
[106/3700] Compiling C object lib/librte_eal.a.p/eal_x86_rte_mmu.c.o
[107/3700] Compiling C object lib/librte_eal.a.p/eal_x86_rte_power_intrinsics.c.o
[108/3700] Compiling C object lib/librte_acl.a.p/acl_rte_acl.c.o
[109/3700] Compiling C object lib/librte_eal.a.p/eal_linux_eal_vfio.c.o
[110/3700] Compiling C object lib/librte_ring.a.p/ring_rte_ring.c.o
[111/3700] Compiling C object lib/librte_rcu.a.p/rcu_rte_rcu_qsbr.c.o
[112/3700] Compiling C object lib/librte_ring.a.p/ring_soring.c.o
ninja: build stopped




*Build Failed #9:
OS: UB2404-64
Target: x86_64-native-linuxapp-gcc
FAILED: lib/librte_eal.a.p/eal_linux_eal_memory.c.o 
gcc -Ilib/librte_eal.a.p -Ilib -I../lib -Ilib/eal/common -I../lib/eal/common -I. -I.. -Iconfig -I../config -Ilib/eal/include -I../lib/eal/include -Ilib/eal/linux/include -I../lib/eal/linux/include -Ilib/eal/x86/include -I../lib/eal/x86/include -I../kernel/linux -Ilib/eal -I../lib/eal -Ilib/kvargs -I../lib/kvargs -Ilib/log -I../lib/log -Ilib/metrics -I../lib/metrics -Ilib/telemetry -I../lib/telemetry -Ilib/argparse -I../lib/argparse -fdiagnostics-color=always -D_FILE_OFFSET_BITS=64 -Wall -Winvalid-pch -Wextra -Werror -std=c11 -O3 -include rte_config.h -Wvla -Wcast-qual -Wdeprecated -Wformat -Wformat-nonliteral -Wformat-security -Wmissing-declarations -Wmissing-prototypes -Wnested-externs -Wold-style-definition -Wpointer-arith -Wshadow -Wsign-compare -Wstrict-prototypes -Wundef -Wwrite-strings -Wno-packed-not-aligned -Wno-missing-field-initializers -D_GNU_SOURCE -fPIC -march=native -mrtm -DALLOW_EXPERIMENTAL_API -DALLOW_INTERNAL_API '-DABI_VERSION="27.0"' -DRTE_EAL_PTHREAD_ATTR_SETAFFINITY_NP -DRTE_LOG_DEFAULT_LOGTYPE=lib.eal -DRTE_COMPONENT_CLASS=lib -DRTE_COMPONENT_NAME=eal -MD -MQ lib/librte_eal.a.p/eal_linux_eal_memory.c.o -MF lib/librte_eal.a.p/eal_linux_eal_memory.c.o.d -o lib/librte_eal.a.p/eal_linux_eal_memory.c.o -c ../lib/eal/linux/eal_memory.c
In function ‘dt_scan_pci_dma_offset’,
    inlined from ‘dt_scan_pci_dma_offset’ at ../lib/eal/linux/eal_memory.c:284:7,
    inlined from ‘dt_scan_pci_dma_offset’ at ../lib/eal/linux/eal_memory.c:284:7,
    inlined from ‘dt_scan_pci_dma_offset’ at ../lib/eal/linux/eal_memory.c:284:7,
    inlined from ‘dt_scan_pci_dma_offset’ at ../lib/eal/linux/eal_memory.c:284:7,
    inlined from ‘eal_iova_pa_offset’ at ../lib/eal/linux/eal_memory.c:321:13:
../lib/eal/linux/eal_memory.c:281:21: error: ‘%s’ directive output may be truncated writing up to 255 bytes into a region of size between 0 and 4095 [-Werror=format-truncation=]
  281 |                 if (snprintf(child, sizeof(child), "%s/%s", dir,
      |                     ^~~~~~~~~~~~~~~~~~~~~~~~~~~~~~~~~~~~~~~~~~~~
  282 |                                 ent->d_name) >= (int)sizeof(child))
      |                                 ~~~~~~~~~~~~
In file included from /usr/include/stdio.h:980,
                 from ../lib/eal/linux/eal_memory.c:11:
In function ‘snprintf’,
    inlined from ‘dt_scan_pci_dma_offset’ at ../lib/eal/linux/eal_memory.c:281:7,
    inlined from ‘dt_scan_pci_dma_offset’ at ../lib/eal/linux/eal_memory.c:284:7,
    inlined from ‘dt_scan_pci_dma_offset’ at ../lib/eal/linux/eal_memory.c:284:7,
    inlined from ‘dt_scan_pci_dma_offset’ at ../lib/eal/linux/eal_memory.c:284:7,
    inlined from ‘dt_scan_pci_dma_offset’ at ../lib/eal/linux/eal_memory.c:284:7,
    inlined from ‘eal_iova_pa_offset’ at ../lib/eal/linux/eal_memory.c:321:13:
/usr/include/x86_64-linux-gnu/bits/stdio2.h:54:10: note: ‘__builtin___snprintf_chk’ output between 2 and 4352 bytes into a destination of size 4096
   54 |   return __builtin___snprintf_chk (__s, __n, __USE_FORTIFY_LEVEL - 1,
      |          ^~~~~~~~~~~~~~~~~~~~~~~~~~~~~~~~~~~~~~~~~~~~~~~~~~~~~~~~~~~~
   55 |                                    __glibc_objsize (__s), __fmt,
      |                                    ~~~~~~~~~~~~~~~~~~~~~~~~~~~~~
   56 |                                    __va_arg_pack ());
      |                                    ~~~~~~~~~~~~~~~~~
cc1: all warnings being treated as errors
[109/3941] Compiling C object lib/librte_ring.a.p/ring_rte_soring.c.o
[110/3941] Compiling C object lib/librte_acl.a.p/acl_acl_gen.c.o
[111/3941] Compiling C object lib/librte_ring.a.p/ring_rte_ring.c.o
[112/3941] Compiling C object lib/librte_eal.a.p/eal_linux_eal_vfio.c.o
[113/3941] Compiling C object lib/librte_mempool.a.p/mempool_rte_mempool_ops_default.c.o
[114/3941] Compiling C object lib/librte_mempool.a.p/mempool_rte_mempool_ops.c.o
[115/3941] Compiling C object lib/librte_mempool.a.p/mempool_rte_mempool.c.o
[116/3941] Compiling C object lib/librte_rcu.a.p/rcu_rte_rcu_qsbr.c.o
[117/3941] Compiling C object lib/librte_ring.a.p/ring_soring.c.o
ninja: build stopped




*Build Failed #10:
OS: OpenEuler2404-64
Target: x86_64-native-linuxapp-gcc
FAILED: lib/librte_eal.a.p/eal_linux_eal_memory.c.o 
gcc -Ilib/librte_eal.a.p -Ilib -I../lib -Ilib/eal/common -I../lib/eal/common -I. -I.. -Iconfig -I../config -Ilib/eal/include -I../lib/eal/include -Ilib/eal/linux/include -I../lib/eal/linux/include -Ilib/eal/x86/include -I../lib/eal/x86/include -I../kernel/linux -Ilib/eal -I../lib/eal -Ilib/kvargs -I../lib/kvargs -Ilib/log -I../lib/log -Ilib/metrics -I../lib/metrics -Ilib/telemetry -I../lib/telemetry -Ilib/argparse -I../lib/argparse -fdiagnostics-color=always -D_FILE_OFFSET_BITS=64 -Wall -Winvalid-pch -Wextra -Werror -std=c11 -O3 -include rte_config.h -Wvla -Wcast-qual -Wdeprecated -Wformat -Wformat-nonliteral -Wformat-security -Wmissing-declarations -Wmissing-prototypes -Wnested-externs -Wold-style-definition -Wpointer-arith -Wshadow -Wsign-compare -Wstrict-prototypes -Wundef -Wwrite-strings -Wno-packed-not-aligned -Wno-missing-field-initializers -D_GNU_SOURCE -fPIC -march=native -mrtm -DALLOW_EXPERIMENTAL_API -DALLOW_INTERNAL_API '-DABI_VERSION="27.0"' -DRTE_EAL_PTHREAD_ATTR_SETAFFINITY_NP -DRTE_LOG_DEFAULT_LOGTYPE=lib.eal -DRTE_COMPONENT_CLASS=lib -DRTE_COMPONENT_NAME=eal -MD -MQ lib/librte_eal.a.p/eal_linux_eal_memory.c.o -MF lib/librte_eal.a.p/eal_linux_eal_memory.c.o.d -o lib/librte_eal.a.p/eal_linux_eal_memory.c.o -c ../lib/eal/linux/eal_memory.c
In function ‘dt_scan_pci_dma_offset’,
    inlined from ‘dt_scan_pci_dma_offset’ at ../lib/eal/linux/eal_memory.c:284:7,
    inlined from ‘dt_scan_pci_dma_offset’ at ../lib/eal/linux/eal_memory.c:284:7,
    inlined from ‘dt_scan_pci_dma_offset’ at ../lib/eal/linux/eal_memory.c:284:7,
    inlined from ‘dt_scan_pci_dma_offset’ at ../lib/eal/linux/eal_memory.c:284:7,
    inlined from ‘eal_iova_pa_offset’ at ../lib/eal/linux/eal_memory.c:321:13:
../lib/eal/linux/eal_memory.c:281:21: error: ‘%s’ directive output may be truncated writing up to 255 bytes into a region of size between 0 and 4095 [-Werror=format-truncation=]
  281 |                 if (snprintf(child, sizeof(child), "%s/%s", dir,
      |                     ^~~~~~~~~~~~~~~~~~~~~~~~~~~~~~~~~~~~~~~~~~~~
  282 |                                 ent->d_name) >= (int)sizeof(child))
      |                                 ~~~~~~~~~~~~
../lib/eal/linux/eal_memory.c:281:21: note: ‘snprintf’ output between 2 and 4352 bytes into a destination of size 4096
cc1: all warnings being treated as errors
[108/3700] Compiling C object lib/librte_ring.a.p/ring_rte_ring.c.o
[109/3700] Compiling C object lib/librte_ring.a.p/ring_rte_soring.c.o
[110/3700] Compiling C object lib/librte_acl.a.p/acl_acl_run_scalar.c.o
[111/3700] Compiling C object lib/librte_eal.a.p/eal_linux_eal_vfio.c.o
[112/3700] Compiling C object lib/librte_mempool.a.p/mempool_rte_mempool_ops_default.c.o
[113/3700] Compiling C object lib/librte_mempool.a.p/mempool_rte_mempool_ops.c.o
[114/3700] Compiling C object lib/librte_mempool.a.p/mempool_rte_mempool.c.o
[115/3700] Compiling C object lib/librte_rcu.a.p/rcu_rte_rcu_qsbr.c.o
[116/3700] Compiling C object lib/librte_ring.a.p/ring_soring.c.o
ninja: build stopped


DPDK STV team


More information about the test-report mailing list