compilation|FAILURE| pw(169885) sid(39360) job(PER_PATCH_BUILD20234)eal: increase memzone name size to 64

sys_stv at intel.com sys_stv at intel.com
Tue Sep 22 00:36:45 CEST 2026


Test-Label: Intel-compilation
Test-Status: FAILURE
http://dpdk.org/patch/169885

_Compilation issues_

Submitter: Stephen Hemminger <stephen at networkplumber.org>
Date: 2026-09-21 21:57:09
Reply_mail: <20260921215733.404686-1-stephen at networkplumber.org>

DPDK git baseline: Repo:dpdk, CommitID: 6bbb7b38b17f9ea4c981b5d374612a16833df41e


Meson Build Summary: 23 Builds Done, 13 Successful, 10 Failures, 0 Blocked

+-------------------+------------+--------------+------------+------------+-----------+----------+------------+
| os                | gcc-static | clang-static | icc-static | gcc-shared | gcc-debug | document | gcc-16byte |
+-------------------+------------+--------------+------------+------------+-----------+----------+------------+
| OpenAnolis8.10-64 | pass       |              |            |            |           |          |            |
| FreeBSD15-64      | pass       | fail         |            | pass       | pass      |          |            |
| RHEL9.8-64        | pass       | fail         |            | pass       | pass      |          |            |
| SUSE16-64         | pass       | fail         |            |            |           |          |            |
| AzureLinux4.0-64  | pass       |              |            |            |           |          |            |
| UB2604-32         | fail       |              |            |            |           |          |            |
| RHEL10.2-64       | pass       |              |            |            |           |          |            |
| UB2604-64         | fail       | fail         |            |            |           | fail     | fail       |
| RHEL10.2-64RT     | pass       |              |            |            |           |          |            |
| UB2404-64         | fail       |              |            |            |           |          |            |
| Fedora44-64       | pass       | fail         |            |            |           |          |            |
| OpenEuler2404-64  | pass       |              |            |            |           |          |            |
+-------------------+------------+--------------+------------+------------+-----------+----------+------------+

Comments: 
Because of DPDK bug (https://bugs.dpdk.org/show_bug.cgi?id=928),
All the dpdk-next-* branch add `Ddisable_drivers=event/cnxk` option when build with ICC complier. 
 
Test environment and configuration as below:


OS: OpenAnolis8.10-64
	Kernel Version: 5.10.134-18.an8.x86_64
	GCC Version: gcc (GCC) 8.5.0 20210514 (Anolis 8.5.0-24.0.1)
	Clang Version: 18.1.8 (Red Hat 18.1.8-1.0.1.module+an8.9.0+11287+9d0292d3)
	x86_64-native-linuxapp-gcc

OS: FreeBSD15-64
	Kernel Version: 15.1-RELEASE-p3
	GCC Version: gcc (FreeBSD Ports Collection) 14.2.0
	Clang Version: 19.1.7 (https://github.com/llvm/llvm-project.git llvmorg-19.1.7-0-gcd708029e0b2)
	x86_64-native-bsdapp-gcc
	x86_64-native-bsdapp-clang
	x86_64-native-bsdapp-gcc+shared
	x86_64-native-bsdapp-gcc+debug

OS: RHEL9.8-64
	Kernel Version: 5.14.0-687.5.3.el9_8.x86_64
	GCC Version: gcc (GCC) 11.5.0 20240719 (Red Hat 11.5.0-14)
	Clang Version: 21.1.8 (Red Hat, Inc. 21.1.8-2.el9)
	x86_64-native-linuxapp-gcc
	x86_64-native-linuxapp-clang
	x86_64-native-linuxapp-gcc+shared
	x86_64-native-linuxapp-gcc+debug

OS: SUSE16-64
	Kernel Version: 6.12.0-160000.26-default
	GCC Version: gcc (SUSE Linux) 15.2.0
	Clang Version: 19.1.7
	x86_64-native-linuxapp-clang
	x86_64-native-linuxapp-gcc

OS: AzureLinux4.0-64
	Kernel Version: 6.18.31-1.3.azl4.x86_64
	GCC Version: gcc (GCC) 15.2.1 20260123 (Red Hat 15.2.1-7)
	Clang Version: 21.1.8 (Microsoft Corporation 21.1.8-8.azl4)
	x86_64-native-linuxapp-gcc

OS: UB2604-32
	Kernel Version: 7.0.0-31-generic
	GCC Version: gcc (Ubuntu 15.2.0-16ubuntu1) 15.2.0
	Clang Version: 21.1.8 (6ubuntu1)
	i686-native-linuxapp-gcc

OS: RHEL10.2-64
	Kernel Version: 6.12.0-211.7.3.el10_2.x86_64
	GCC Version: gcc (GCC) 14.3.1 20251022 (Red Hat 14.3.1-4)
	Clang Version: 21.1.8 (Red Hat, Inc. 21.1.8-1.el10)
	x86_64-native-linuxapp-gcc

OS: UB2604-64
	Kernel Version: 7.0.0-31-generic
	GCC Version: gcc (Ubuntu 15.2.0-16ubuntu1) 15.2.0
	Clang Version: 21.1.8 (6ubuntu1)
	x86_64-native-linuxapp-gcc+16byte
	x86_64-native-linuxapp-gcc
	x86_64-native-linuxapp-clang
	x86_64-native-linuxapp-doc

OS: RHEL10.2-64RT
	Kernel Version: 6.12.0-211.7.3.el10_2.x86_64+rt
	GCC Version: gcc (GCC) 14.3.1 20251022 (Red Hat 14.3.1-4)
	Clang Version: 21.1.8 (Red Hat, Inc. 21.1.8-1.el10)
	x86_64-native-linuxapp-gcc

OS: UB2404-64
	Kernel Version: 6.8.0-139-generic
	GCC Version: gcc (Ubuntu 13.3.0-6ubuntu2~24.04.1) 13.3.0
	Clang Version: 18.1.3 (1ubuntu1)
	x86_64-native-linuxapp-gcc

OS: Fedora44-64
	Kernel Version: 6.19.10-300.fc44.x86_64
	GCC Version: gcc (GCC) 16.0.1 20260321 (Red Hat 16.0.1-0)
	Clang Version: 22.1.8 (Fedora 22.1.8-4.fc44)
	x86_64-native-linuxapp-gcc
	x86_64-native-linuxapp-clang

OS: OpenEuler2404-64
	Kernel Version: 6.6.0-159.4.13.167.oe2403sp4.x86_64
	GCC Version: gcc (GCC) 12.3.1 (openEuler 12.3.1-110.oe2403sp4)
	Clang Version: 17.0.6 ( 17.0.6-67.oe2403sp4)
	x86_64-native-linuxapp-gcc



*Build Failed #1:
OS: FreeBSD15-64
Target: x86_64-native-bsdapp-clang
FAILED: [code=1] app/dpdk-test-crypto-perf.p/test-crypto-perf_cperf_test_common.c.o 
clang -Iapp/dpdk-test-crypto-perf.p -Iapp -I../app -Ilib/cryptodev -I../lib/cryptodev -Ilib/eal/common -I../lib/eal/common -I. -I.. -Iconfig -I../config -Ilib/eal/include -I../lib/eal/include -Ilib/eal/freebsd/include -I../lib/eal/freebsd/include -Ilib/eal/x86/include -I../lib/eal/x86/include -Ilib/eal -I../lib/eal -Ilib/kvargs -I../lib/kvargs -Ilib/log -I../lib/log -Ilib/metrics -I../lib/metrics -Ilib/telemetry -I../lib/telemetry -Ilib/argparse -I../lib/argparse -Ilib/mbuf -I../lib/mbuf -Ilib/mempool -I../lib/mempool -Ilib/ring -I../lib/ring -Ilib/rcu -I../lib/rcu -Ilib/net -I../lib/net -Ilib/security -I../lib/security -Idrivers/crypto/scheduler -I../drivers/crypto/scheduler -Idrivers/bus/vdev -I../drivers/bus/vdev -Ilib/reorder -I../lib/reorder -fdiagnostics-color=always -D_FILE_OFFSET_BITS=64 -Wall -Winvalid-pch -Wextra -Werror -std=c11 -O3 -include rte_config.h -Wvla -Wcast-qual -Wcomma -Wdeprecated -Wformat -Wformat-nonliteral -Wformat-security -Wmissing-declarations -Wmissing-prototypes -Wnested-externs -Wold-style-definition -Wpointer-arith -Wshadow -Wsign-compare -Wstrict-prototypes -Wundef -Wwrite-strings -Wno-missing-field-initializers -D_GNU_SOURCE -D__BSD_VISIBLE -march=native -mrtm -DALLOW_EXPERIMENTAL_API -Wno-vla -MD -MQ app/dpdk-test-crypto-perf.p/test-crypto-perf_cperf_test_common.c.o -MF app/dpdk-test-crypto-perf.p/test-crypto-perf_cperf_test_common.c.o.d -o app/dpdk-test-crypto-perf.p/test-crypto-perf_cperf_test_common.c.o -c ../app/test-crypto-perf/cperf_test_common.c
../app/test-crypto-perf/cperf_test_common.c:157:3: error: 'snprintf' size argument is too large; destination buffer has size 32, but size argument is 58 [-Werror,-Wfortify-source]
  157 |                 snprintf(pool_name, RTE_MEMPOOL_NAMESIZE, "perf_asym_op_pool%u",
      |                 ^
1 error generated.
[1763/2307] Compiling C object app/dpdk-test-compress-perf.p/test-compress-perf_comp_perf_test_cyclecount.c.o
[1764/2307] Compiling C object app/dpdk-test-compress-perf.p/test-compress-perf_comp_perf_test_verify.c.o
[1765/2307] Compiling C object app/dpdk-test-crypto-perf.p/test-crypto-perf_cperf_ops.c.o
[1766/2307] Compiling C object app/dpdk-test-crypto-perf.p/test-crypto-perf_cperf_options_parsing.c.o
[1767/2307] Compiling C object app/dpdk-test-crypto-perf.p/test-crypto-perf_cperf_test_pmd_cyclecount.c.o
[1768/2307] Compiling C object app/dpdk-test-crypto-perf.p/test-crypto-perf_cperf_test_latency.c.o
[1769/2307] Compiling C object app/dpdk-test-crypto-perf.p/test-crypto-perf_cperf_test_vector_parsing.c.o
[1770/2307] Compiling C object app/dpdk-test-crypto-perf.p/test-crypto-perf_cperf_test_throughput.c.o
[1771/2307] Compiling C object app/dpdk-test-bbdev.p/test-bbdev_test_bbdev_perf.c.o
ninja: build stopped




*Build Failed #2:
OS: RHEL9.8-64
Target: x86_64-native-linuxapp-clang
FAILED: app/dpdk-test-crypto-perf.p/test-crypto-perf_cperf_test_common.c.o 
clang -Iapp/dpdk-test-crypto-perf.p -Iapp -I../app -Ilib/cryptodev -I../lib/cryptodev -Ilib/eal/common -I../lib/eal/common -I. -I.. -Iconfig -I../config -Ilib/eal/include -I../lib/eal/include -Ilib/eal/linux/include -I../lib/eal/linux/include -Ilib/eal/x86/include -I../lib/eal/x86/include -I../kernel/linux -Ilib/eal -I../lib/eal -Ilib/kvargs -I../lib/kvargs -Ilib/log -I../lib/log -Ilib/metrics -I../lib/metrics -Ilib/telemetry -I../lib/telemetry -Ilib/argparse -I../lib/argparse -Ilib/mbuf -I../lib/mbuf -Ilib/mempool -I../lib/mempool -Ilib/ring -I../lib/ring -Ilib/rcu -I../lib/rcu -Ilib/net -I../lib/net -Ilib/security -I../lib/security -Idrivers/crypto/scheduler -I../drivers/crypto/scheduler -Idrivers/bus/vdev -I../drivers/bus/vdev -Ilib/reorder -I../lib/reorder -fdiagnostics-color=always -D_FILE_OFFSET_BITS=64 -Wall -Winvalid-pch -Wextra -Werror -std=c11 -O3 -include rte_config.h -Wvla -Wcast-qual -Wcomma -Wdeprecated -Wformat -Wformat-nonliteral -Wformat-security -Wmissing-declarations -Wmissing-prototypes -Wnested-externs -Wold-style-definition -Wpointer-arith -Wshadow -Wsign-compare -Wstrict-prototypes -Wundef -Wwrite-strings -Wno-missing-field-initializers -D_GNU_SOURCE -march=native -mrtm -DALLOW_EXPERIMENTAL_API -Wno-vla -MD -MQ app/dpdk-test-crypto-perf.p/test-crypto-perf_cperf_test_common.c.o -MF app/dpdk-test-crypto-perf.p/test-crypto-perf_cperf_test_common.c.o.d -o app/dpdk-test-crypto-perf.p/test-crypto-perf_cperf_test_common.c.o -c ../app/test-crypto-perf/cperf_test_common.c
../app/test-crypto-perf/cperf_test_common.c:157:3: error: 'snprintf' size argument is too large; destination buffer has size 32, but size argument is 58 [-Werror,-Wfortify-source]
  157 |                 snprintf(pool_name, RTE_MEMPOOL_NAMESIZE, "perf_asym_op_pool%u",
      |                 ^
1 error generated.
[3191/3700] Compiling C object app/dpdk-test-acl.p/test-acl_main.c.o
[3192/3700] Compiling C object app/dpdk-pdump.p/pdump_main.c.o
[3193/3700] Compiling C object app/dpdk-test-bbdev.p/test-bbdev_main.c.o
[3194/3700] Compiling C object app/dpdk-test-bbdev.p/test-bbdev_test_bbdev_vector.c.o
[3195/3700] Compiling C object app/dpdk-test-crypto-perf.p/test-crypto-perf_cperf_test_vector_parsing.c.o
[3196/3700] Linking target app/dpdk-graph
[3197/3700] Compiling C object app/dpdk-proc-info.p/proc-info_main.c.o
[3198/3700] Compiling C object app/dpdk-test-crypto-perf.p/test-crypto-perf_cperf_test_throughput.c.o
[3199/3700] Compiling C object app/dpdk-test-crypto-perf.p/test-crypto-perf_cperf_test_latency.c.o
ninja: build stopped




*Build Failed #3:
OS: SUSE16-64
Target: x86_64-native-linuxapp-clang
FAILED: app/dpdk-test-crypto-perf.p/test-crypto-perf_cperf_test_common.c.o 
clang -Iapp/dpdk-test-crypto-perf.p -Iapp -I../app -Ilib/cryptodev -I../lib/cryptodev -Ilib/eal/common -I../lib/eal/common -I. -I.. -Iconfig -I../config -Ilib/eal/include -I../lib/eal/include -Ilib/eal/linux/include -I../lib/eal/linux/include -Ilib/eal/x86/include -I../lib/eal/x86/include -I../kernel/linux -Ilib/eal -I../lib/eal -Ilib/kvargs -I../lib/kvargs -Ilib/log -I../lib/log -Ilib/metrics -I../lib/metrics -Ilib/telemetry -I../lib/telemetry -Ilib/argparse -I../lib/argparse -Ilib/mbuf -I../lib/mbuf -Ilib/mempool -I../lib/mempool -Ilib/ring -I../lib/ring -Ilib/rcu -I../lib/rcu -Ilib/net -I../lib/net -Ilib/security -I../lib/security -Idrivers/crypto/scheduler -I../drivers/crypto/scheduler -Idrivers/bus/vdev -I../drivers/bus/vdev -Ilib/reorder -I../lib/reorder -fdiagnostics-color=always -D_FILE_OFFSET_BITS=64 -Wall -Winvalid-pch -Wextra -Werror -std=c11 -O3 -include rte_config.h -Wvla -Wcast-qual -Wcomma -Wdeprecated -Wformat -Wformat-nonliteral -Wformat-security -Wmissing-declarations -Wmissing-prototypes -Wnested-externs -Wold-style-definition -Wpointer-arith -Wshadow -Wsign-compare -Wstrict-prototypes -Wundef -Wwrite-strings -Wno-missing-field-initializers -D_GNU_SOURCE -march=native -mrtm -DALLOW_EXPERIMENTAL_API -Wno-vla -MD -MQ app/dpdk-test-crypto-perf.p/test-crypto-perf_cperf_test_common.c.o -MF app/dpdk-test-crypto-perf.p/test-crypto-perf_cperf_test_common.c.o.d -o app/dpdk-test-crypto-perf.p/test-crypto-perf_cperf_test_common.c.o -c ../app/test-crypto-perf/cperf_test_common.c
../app/test-crypto-perf/cperf_test_common.c:157:3: error: 'snprintf' size argument is too large; destination buffer has size 32, but size argument is 58 [-Werror,-Wfortify-source]
  157 |                 snprintf(pool_name, RTE_MEMPOOL_NAMESIZE, "perf_asym_op_pool%u",
      |                 ^
1 error generated.
[3199/3682] Compiling C object app/dpdk-test-compress-perf.p/test-compress-perf_comp_perf_test_cyclecount.c.o
[3200/3682] Compiling C object app/dpdk-test-eventdev.p/test-eventdev_evt_options.c.o
[3201/3682] Compiling C object app/dpdk-test-bbdev.p/test-bbdev_test_bbdev_perf.c.o
[3202/3682] Compiling C object app/dpdk-test-crypto-perf.p/test-crypto-perf_cperf_test_verify.c.o
[3203/3682] Compiling C object app/dpdk-test-dma-perf.p/test-dma-perf_main.c.o
[3204/3682] Compiling C object app/dpdk-test-eventdev.p/test-eventdev_evt_main.c.o
[3205/3682] Compiling C object app/dpdk-test-eventdev.p/test-eventdev_test_perf_common.c.o
[3206/3682] Compiling C object app/dpdk-test-dma-perf.p/test-dma-perf_benchmark.c.o
[3207/3682] Compiling C object app/dpdk-test-eventdev.p/test-eventdev_test_atomic_queue.c.o
ninja: build stopped




*Build Failed #4:
OS: UB2604-32
Target: i686-native-linuxapp-gcc
FAILED: app/dpdk-test-crypto-perf.p/test-crypto-perf_cperf_test_common.c.o 
gcc -Iapp/dpdk-test-crypto-perf.p -Iapp -I../app -Ilib/cryptodev -I../lib/cryptodev -Ilib/eal/common -I../lib/eal/common -I. -I.. -Iconfig -I../config -Ilib/eal/include -I../lib/eal/include -Ilib/eal/linux/include -I../lib/eal/linux/include -Ilib/eal/x86/include -I../lib/eal/x86/include -I../kernel/linux -Ilib/eal -I../lib/eal -Ilib/kvargs -I../lib/kvargs -Ilib/log -I../lib/log -Ilib/metrics -I../lib/metrics -Ilib/telemetry -I../lib/telemetry -Ilib/argparse -I../lib/argparse -Ilib/mbuf -I../lib/mbuf -Ilib/mempool -I../lib/mempool -Ilib/ring -I../lib/ring -Ilib/rcu -I../lib/rcu -Ilib/net -I../lib/net -Ilib/security -I../lib/security -Idrivers/crypto/scheduler -I../drivers/crypto/scheduler -Idrivers/bus/vdev -I../drivers/bus/vdev -Ilib/reorder -I../lib/reorder -fdiagnostics-color=always -D_FILE_OFFSET_BITS=64 -Wall -Winvalid-pch -Wextra -Werror -std=c11 -O3 -include rte_config.h -Wvla -Wcast-qual -Wdeprecated -Wformat -Wformat-nonliteral -Wformat-security -Wmissing-declarations -Wmissing-prototypes -Wnested-externs -Wold-style-definition -Wpointer-arith -Wshadow -Wsign-compare -Wstrict-prototypes -Wundef -Wwrite-strings -Wno-packed-not-aligned -Wno-missing-field-initializers -fzero-init-padding-bits=all -Wno-pointer-to-int-cast -D_GNU_SOURCE -m32 -march=native -mrtm -DALLOW_EXPERIMENTAL_API -Wno-vla -MD -MQ app/dpdk-test-crypto-perf.p/test-crypto-perf_cperf_test_common.c.o -MF app/dpdk-test-crypto-perf.p/test-crypto-perf_cperf_test_common.c.o.d -o app/dpdk-test-crypto-perf.p/test-crypto-perf_cperf_test_common.c.o -c ../app/test-crypto-perf/cperf_test_common.c
In file included from /usr/include/stdio.h:974,
                 from ../lib/eal/include/rte_malloc.h:14,
                 from ../app/test-crypto-perf/cperf_test_common.c:5:
In function ‘snprintf’,
    inlined from ‘cperf_alloc_common_memory’ at ../app/test-crypto-perf/cperf_test_common.c:157:3:
/usr/include/i386-linux-gnu/bits/stdio2.h:68:10: error: ‘__builtin___snprintf_chk’ specified bound 58 exceeds destination size 32 [-Werror=stringop-overflow=]
   68 |   return __builtin___snprintf_chk (__s, __n, __USE_FORTIFY_LEVEL - 1,
      |          ^~~~~~~~~~~~~~~~~~~~~~~~~~~~~~~~~~~~~~~~~~~~~~~~~~~~~~~~~~~~
   69 |                                    __glibc_objsize (__s), __fmt,
      |                                    ~~~~~~~~~~~~~~~~~~~~~~~~~~~~~
   70 |                                    __va_arg_pack ());
      |                                    ~~~~~~~~~~~~~~~~~
cc1: all warnings being treated as errors
[2312/2795] Compiling C object app/dpdk-test-crypto-perf.p/test-crypto-perf_cperf_test_throughput.c.o
[2313/2795] Compiling C object app/dpdk-test-eventdev.p/test-eventdev_evt_main.c.o
[2314/2795] Compiling C object app/dpdk-test-eventdev.p/test-eventdev_test_atomic_atq.c.o
[2315/2795] Compiling C object app/dpdk-test-eventdev.p/test-eventdev_evt_options.c.o
[2316/2795] Linking target app/dpdk-test-compress-perf
[2317/2795] Compiling C object app/dpdk-test-dma-perf.p/test-dma-perf_main.c.o
[2318/2795] Compiling C object app/dpdk-test-eventdev.p/test-eventdev_test_atomic_queue.c.o
[2319/2795] Compiling C object app/dpdk-test-dma-perf.p/test-dma-perf_benchmark.c.o
[2320/2795] Compiling C object app/dpdk-test-bbdev.p/test-bbdev_test_bbdev_perf.c.o
ninja: build stopped




*Build Failed #5:
OS: UB2604-64
Target: x86_64-native-linuxapp-gcc+16byte
FAILED: app/dpdk-test-crypto-perf.p/test-crypto-perf_cperf_test_common.c.o 
gcc -Iapp/dpdk-test-crypto-perf.p -Iapp -I../app -Ilib/cryptodev -I../lib/cryptodev -Ilib/eal/common -I../lib/eal/common -I. -I.. -Iconfig -I../config -Ilib/eal/include -I../lib/eal/include -Ilib/eal/linux/include -I../lib/eal/linux/include -Ilib/eal/x86/include -I../lib/eal/x86/include -I../kernel/linux -Ilib/eal -I../lib/eal -Ilib/kvargs -I../lib/kvargs -Ilib/log -I../lib/log -Ilib/metrics -I../lib/metrics -Ilib/telemetry -I../lib/telemetry -Ilib/argparse -I../lib/argparse -Ilib/mbuf -I../lib/mbuf -Ilib/mempool -I../lib/mempool -Ilib/ring -I../lib/ring -Ilib/rcu -I../lib/rcu -Ilib/net -I../lib/net -Ilib/security -I../lib/security -Idrivers/crypto/scheduler -I../drivers/crypto/scheduler -Idrivers/bus/vdev -I../drivers/bus/vdev -Ilib/reorder -I../lib/reorder -fdiagnostics-color=always -D_FILE_OFFSET_BITS=64 -Wall -Winvalid-pch -Wextra -Werror -std=c11 -O3 -include rte_config.h -Wvla -Wcast-qual -Wdeprecated -Wformat -Wformat-nonliteral -Wformat-security -Wmissing-declarations -Wmissing-prototypes -Wnested-externs -Wold-style-definition -Wpointer-arith -Wshadow -Wsign-compare -Wstrict-prototypes -Wundef -Wwrite-strings -Wno-packed-not-aligned -Wno-missing-field-initializers -fzero-init-padding-bits=all -D_GNU_SOURCE -DRTE_LIBRTE_I40E_16BYTE_RX_DESC -DRTE_LIBRTE_ICE_16BYTE_RX_DESC -march=native -mrtm -DALLOW_EXPERIMENTAL_API -Wno-vla -MD -MQ app/dpdk-test-crypto-perf.p/test-crypto-perf_cperf_test_common.c.o -MF app/dpdk-test-crypto-perf.p/test-crypto-perf_cperf_test_common.c.o.d -o app/dpdk-test-crypto-perf.p/test-crypto-perf_cperf_test_common.c.o -c ../app/test-crypto-perf/cperf_test_common.c
In file included from /usr/include/stdio.h:974,
                 from ../lib/eal/include/rte_malloc.h:14,
                 from ../app/test-crypto-perf/cperf_test_common.c:5:
In function ‘snprintf’,
    inlined from ‘cperf_alloc_common_memory’ at ../app/test-crypto-perf/cperf_test_common.c:157:3:
/usr/include/x86_64-linux-gnu/bits/stdio2.h:68:10: error: ‘__builtin___snprintf_chk’ specified bound 58 exceeds destination size 32 [-Werror=stringop-overflow=]
   68 |   return __builtin___snprintf_chk (__s, __n, __USE_FORTIFY_LEVEL - 1,
      |          ^~~~~~~~~~~~~~~~~~~~~~~~~~~~~~~~~~~~~~~~~~~~~~~~~~~~~~~~~~~~
   69 |                                    __glibc_objsize (__s), __fmt,
      |                                    ~~~~~~~~~~~~~~~~~~~~~~~~~~~~~
   70 |                                    __va_arg_pack ());
      |                                    ~~~~~~~~~~~~~~~~~
cc1: all warnings being treated as errors
[3477/3941] Compiling C object app/dpdk-test-dma-perf.p/test-dma-perf_main.c.o
[3478/3941] Compiling C object app/dpdk-test-eventdev.p/test-eventdev_test_order_queue.c.o
[3479/3941] Compiling C object app/dpdk-test-eventdev.p/test-eventdev_test_order_common.c.o
[3480/3941] Compiling C object app/dpdk-test-dma-perf.p/test-dma-perf_benchmark.c.o
[3481/3941] Compiling C object app/dpdk-test-eventdev.p/test-eventdev_test_order_atq.c.o
[3482/3941] Compiling C object app/dpdk-test-eventdev.p/test-eventdev_test_atomic_common.c.o
[3483/3941] Compiling C object app/dpdk-test-eventdev.p/test-eventdev_test_perf_atq.c.o
[3484/3941] Compiling C object app/dpdk-test-bbdev.p/test-bbdev_test_bbdev_perf.c.o
[3485/3941] Compiling C object app/dpdk-test-eventdev.p/test-eventdev_test_perf_common.c.o
ninja: build stopped




*Build Failed #6:
OS: UB2604-64
Target: x86_64-native-linuxapp-gcc
FAILED: app/dpdk-test-crypto-perf.p/test-crypto-perf_cperf_test_common.c.o 
gcc -Iapp/dpdk-test-crypto-perf.p -Iapp -I../app -Ilib/cryptodev -I../lib/cryptodev -Ilib/eal/common -I../lib/eal/common -I. -I.. -Iconfig -I../config -Ilib/eal/include -I../lib/eal/include -Ilib/eal/linux/include -I../lib/eal/linux/include -Ilib/eal/x86/include -I../lib/eal/x86/include -I../kernel/linux -Ilib/eal -I../lib/eal -Ilib/kvargs -I../lib/kvargs -Ilib/log -I../lib/log -Ilib/metrics -I../lib/metrics -Ilib/telemetry -I../lib/telemetry -Ilib/argparse -I../lib/argparse -Ilib/mbuf -I../lib/mbuf -Ilib/mempool -I../lib/mempool -Ilib/ring -I../lib/ring -Ilib/rcu -I../lib/rcu -Ilib/net -I../lib/net -Ilib/security -I../lib/security -Idrivers/crypto/scheduler -I../drivers/crypto/scheduler -Idrivers/bus/vdev -I../drivers/bus/vdev -Ilib/reorder -I../lib/reorder -fdiagnostics-color=always -D_FILE_OFFSET_BITS=64 -Wall -Winvalid-pch -Wextra -Werror -std=c11 -O3 -include rte_config.h -Wvla -Wcast-qual -Wdeprecated -Wformat -Wformat-nonliteral -Wformat-security -Wmissing-declarations -Wmissing-prototypes -Wnested-externs -Wold-style-definition -Wpointer-arith -Wshadow -Wsign-compare -Wstrict-prototypes -Wundef -Wwrite-strings -Wno-packed-not-aligned -Wno-missing-field-initializers -fzero-init-padding-bits=all -D_GNU_SOURCE -march=native -mrtm -DALLOW_EXPERIMENTAL_API -Wno-vla -MD -MQ app/dpdk-test-crypto-perf.p/test-crypto-perf_cperf_test_common.c.o -MF app/dpdk-test-crypto-perf.p/test-crypto-perf_cperf_test_common.c.o.d -o app/dpdk-test-crypto-perf.p/test-crypto-perf_cperf_test_common.c.o -c ../app/test-crypto-perf/cperf_test_common.c
In file included from /usr/include/stdio.h:974,
                 from ../lib/eal/include/rte_malloc.h:14,
                 from ../app/test-crypto-perf/cperf_test_common.c:5:
In function ‘snprintf’,
    inlined from ‘cperf_alloc_common_memory’ at ../app/test-crypto-perf/cperf_test_common.c:157:3:
/usr/include/x86_64-linux-gnu/bits/stdio2.h:68:10: error: ‘__builtin___snprintf_chk’ specified bound 58 exceeds destination size 32 [-Werror=stringop-overflow=]
   68 |   return __builtin___snprintf_chk (__s, __n, __USE_FORTIFY_LEVEL - 1,
      |          ^~~~~~~~~~~~~~~~~~~~~~~~~~~~~~~~~~~~~~~~~~~~~~~~~~~~~~~~~~~~
   69 |                                    __glibc_objsize (__s), __fmt,
      |                                    ~~~~~~~~~~~~~~~~~~~~~~~~~~~~~
   70 |                                    __va_arg_pack ());
      |                                    ~~~~~~~~~~~~~~~~~
cc1: all warnings being treated as errors
[3476/3941] Compiling C object app/dpdk-test-dma-perf.p/test-dma-perf_benchmark.c.o
[3477/3941] Compiling C object app/dpdk-test-crypto-perf.p/test-crypto-perf_cperf_test_throughput.c.o
[3478/3941] Linking target app/dpdk-test-compress-perf
[3479/3941] Compiling C object app/dpdk-test-eventdev.p/test-eventdev_test_order_queue.c.o
[3480/3941] Compiling C object app/dpdk-test-eventdev.p/test-eventdev_test_atomic_queue.c.o
[3481/3941] Compiling C object app/dpdk-test-eventdev.p/test-eventdev_test_perf_atq.c.o
[3482/3941] Compiling C object app/dpdk-test-bbdev.p/test-bbdev_test_bbdev_perf.c.o
[3483/3941] Compiling C object app/dpdk-testpmd.p/test-pmd_cmdline.c.o
[3484/3941] Compiling C object app/dpdk-test-eventdev.p/test-eventdev_test_perf_common.c.o
ninja: build stopped




*Build Failed #7:
OS: UB2604-64
Target: x86_64-native-linuxapp-clang
FAILED: app/dpdk-test-crypto-perf.p/test-crypto-perf_cperf_test_common.c.o 
clang -Iapp/dpdk-test-crypto-perf.p -Iapp -I../app -Ilib/cryptodev -I../lib/cryptodev -Ilib/eal/common -I../lib/eal/common -I. -I.. -Iconfig -I../config -Ilib/eal/include -I../lib/eal/include -Ilib/eal/linux/include -I../lib/eal/linux/include -Ilib/eal/x86/include -I../lib/eal/x86/include -I../kernel/linux -Ilib/eal -I../lib/eal -Ilib/kvargs -I../lib/kvargs -Ilib/log -I../lib/log -Ilib/metrics -I../lib/metrics -Ilib/telemetry -I../lib/telemetry -Ilib/argparse -I../lib/argparse -Ilib/mbuf -I../lib/mbuf -Ilib/mempool -I../lib/mempool -Ilib/ring -I../lib/ring -Ilib/rcu -I../lib/rcu -Ilib/net -I../lib/net -Ilib/security -I../lib/security -Idrivers/crypto/scheduler -I../drivers/crypto/scheduler -Idrivers/bus/vdev -I../drivers/bus/vdev -Ilib/reorder -I../lib/reorder -fdiagnostics-color=always -D_FILE_OFFSET_BITS=64 -Wall -Winvalid-pch -Wextra -Werror -std=c11 -O3 -include rte_config.h -Wvla -Wcast-qual -Wcomma -Wdeprecated -Wformat -Wformat-nonliteral -Wformat-security -Wmissing-declarations -Wmissing-prototypes -Wnested-externs -Wold-style-definition -Wpointer-arith -Wshadow -Wsign-compare -Wstrict-prototypes -Wundef -Wwrite-strings -Wno-missing-field-initializers -D_GNU_SOURCE -march=native -mrtm -DALLOW_EXPERIMENTAL_API -Wno-vla -MD -MQ app/dpdk-test-crypto-perf.p/test-crypto-perf_cperf_test_common.c.o -MF app/dpdk-test-crypto-perf.p/test-crypto-perf_cperf_test_common.c.o.d -o app/dpdk-test-crypto-perf.p/test-crypto-perf_cperf_test_common.c.o -c ../app/test-crypto-perf/cperf_test_common.c
../app/test-crypto-perf/cperf_test_common.c:157:3: error: 'snprintf' size argument is too large; destination buffer has size 32, but size argument is 58 [-Werror,-Wfortify-source]
  157 |                 snprintf(pool_name, RTE_MEMPOOL_NAMESIZE, "perf_asym_op_pool%u",
      |                 ^
1 error generated.
[3480/3942] Linking target app/dpdk-test-compress-perf
[3481/3942] Compiling C object app/dpdk-test-crypto-perf.p/test-crypto-perf_cperf_test_verify.c.o
[3482/3942] Linking target app/dpdk-test-dma-perf
[3483/3942] Compiling C object app/dpdk-test-crypto-perf.p/test-crypto-perf_cperf_test_throughput.c.o
[3484/3942] Compiling C object app/dpdk-test-eventdev.p/test-eventdev_test_order_common.c.o
[3485/3942] Compiling C object app/dpdk-test-eventdev.p/test-eventdev_test_perf_atq.c.o
[3486/3942] Compiling C object app/dpdk-test-eventdev.p/test-eventdev_test_atomic_queue.c.o
[3487/3942] Compiling C object app/dpdk-test-bbdev.p/test-bbdev_test_bbdev_perf.c.o
[3488/3942] Compiling C object app/dpdk-test-eventdev.p/test-eventdev_test_perf_common.c.o
ninja: build stopped




*Build Failed #8:
OS: UB2604-64
Target: x86_64-native-linuxapp-doc
FAILED: app/dpdk-test-crypto-perf.p/test-crypto-perf_cperf_test_common.c.o 
gcc -Iapp/dpdk-test-crypto-perf.p -Iapp -I../app -Ilib/cryptodev -I../lib/cryptodev -Ilib/eal/common -I../lib/eal/common -I. -I.. -Iconfig -I../config -Ilib/eal/include -I../lib/eal/include -Ilib/eal/linux/include -I../lib/eal/linux/include -Ilib/eal/x86/include -I../lib/eal/x86/include -I../kernel/linux -Ilib/eal -I../lib/eal -Ilib/kvargs -I../lib/kvargs -Ilib/log -I../lib/log -Ilib/metrics -I../lib/metrics -Ilib/telemetry -I../lib/telemetry -Ilib/argparse -I../lib/argparse -Ilib/mbuf -I../lib/mbuf -Ilib/mempool -I../lib/mempool -Ilib/ring -I../lib/ring -Ilib/rcu -I../lib/rcu -Ilib/net -I../lib/net -Ilib/security -I../lib/security -Idrivers/crypto/scheduler -I../drivers/crypto/scheduler -Idrivers/bus/vdev -I../drivers/bus/vdev -Ilib/reorder -I../lib/reorder -fdiagnostics-color=always -D_FILE_OFFSET_BITS=64 -Wall -Winvalid-pch -Wextra -Werror -std=c11 -O3 -include rte_config.h -Wvla -Wcast-qual -Wdeprecated -Wformat -Wformat-nonliteral -Wformat-security -Wmissing-declarations -Wmissing-prototypes -Wnested-externs -Wold-style-definition -Wpointer-arith -Wshadow -Wsign-compare -Wstrict-prototypes -Wundef -Wwrite-strings -Wno-packed-not-aligned -Wno-missing-field-initializers -fzero-init-padding-bits=all -D_GNU_SOURCE -march=native -mrtm -DALLOW_EXPERIMENTAL_API -Wno-vla -MD -MQ app/dpdk-test-crypto-perf.p/test-crypto-perf_cperf_test_common.c.o -MF app/dpdk-test-crypto-perf.p/test-crypto-perf_cperf_test_common.c.o.d -o app/dpdk-test-crypto-perf.p/test-crypto-perf_cperf_test_common.c.o -c ../app/test-crypto-perf/cperf_test_common.c
In file included from /usr/include/stdio.h:974,
                 from ../lib/eal/include/rte_malloc.h:14,
                 from ../app/test-crypto-perf/cperf_test_common.c:5:
In function ‘snprintf’,
    inlined from ‘cperf_alloc_common_memory’ at ../app/test-crypto-perf/cperf_test_common.c:157:3:
/usr/include/x86_64-linux-gnu/bits/stdio2.h:68:10: error: ‘__builtin___snprintf_chk’ specified bound 58 exceeds destination size 32 [-Werror=stringop-overflow=]
   68 |   return __builtin___snprintf_chk (__s, __n, __USE_FORTIFY_LEVEL - 1,
      |          ^~~~~~~~~~~~~~~~~~~~~~~~~~~~~~~~~~~~~~~~~~~~~~~~~~~~~~~~~~~~
   69 |                                    __glibc_objsize (__s), __fmt,
      |                                    ~~~~~~~~~~~~~~~~~~~~~~~~~~~~~
   70 |                                    __va_arg_pack ());
      |                                    ~~~~~~~~~~~~~~~~~
cc1: all warnings being treated as errors
[3457/3750] Compiling C object app/dpdk-test-crypto-perf.p/test-crypto-perf_cperf_test_throughput.c.o
[3458/3750] Compiling C object app/dpdk-test-dma-perf.p/test-dma-perf_benchmark.c.o
[3459/3750] Linking target app/dpdk-test-compress-perf
[3460/3750] Compiling C object app/dpdk-test-eventdev.p/test-eventdev_test_order_queue.c.o
[3461/3750] Compiling C object app/dpdk-test-eventdev.p/test-eventdev_test_atomic_queue.c.o
[3462/3750] Compiling C object app/dpdk-test-eventdev.p/test-eventdev_test_perf_atq.c.o
[3463/3750] Compiling C object app/dpdk-test-bbdev.p/test-bbdev_test_bbdev_perf.c.o
[3464/3750] Compiling C object app/dpdk-testpmd.p/test-pmd_cmdline.c.o
[3465/3750] Compiling C object app/dpdk-test-eventdev.p/test-eventdev_test_perf_common.c.o
ninja: build stopped




*Build Failed #9:
OS: UB2404-64
Target: x86_64-native-linuxapp-gcc
FAILED: app/dpdk-test-crypto-perf.p/test-crypto-perf_cperf_test_common.c.o 
gcc -Iapp/dpdk-test-crypto-perf.p -Iapp -I../app -Ilib/cryptodev -I../lib/cryptodev -Ilib/eal/common -I../lib/eal/common -I. -I.. -Iconfig -I../config -Ilib/eal/include -I../lib/eal/include -Ilib/eal/linux/include -I../lib/eal/linux/include -Ilib/eal/x86/include -I../lib/eal/x86/include -I../kernel/linux -Ilib/eal -I../lib/eal -Ilib/kvargs -I../lib/kvargs -Ilib/log -I../lib/log -Ilib/metrics -I../lib/metrics -Ilib/telemetry -I../lib/telemetry -Ilib/argparse -I../lib/argparse -Ilib/mbuf -I../lib/mbuf -Ilib/mempool -I../lib/mempool -Ilib/ring -I../lib/ring -Ilib/rcu -I../lib/rcu -Ilib/net -I../lib/net -Ilib/security -I../lib/security -Idrivers/crypto/scheduler -I../drivers/crypto/scheduler -Idrivers/bus/vdev -I../drivers/bus/vdev -Ilib/reorder -I../lib/reorder -fdiagnostics-color=always -D_FILE_OFFSET_BITS=64 -Wall -Winvalid-pch -Wextra -Werror -std=c11 -O3 -include rte_config.h -Wvla -Wcast-qual -Wdeprecated -Wformat -Wformat-nonliteral -Wformat-security -Wmissing-declarations -Wmissing-prototypes -Wnested-externs -Wold-style-definition -Wpointer-arith -Wshadow -Wsign-compare -Wstrict-prototypes -Wundef -Wwrite-strings -Wno-packed-not-aligned -Wno-missing-field-initializers -D_GNU_SOURCE -march=native -mrtm -DALLOW_EXPERIMENTAL_API -Wno-vla -MD -MQ app/dpdk-test-crypto-perf.p/test-crypto-perf_cperf_test_common.c.o -MF app/dpdk-test-crypto-perf.p/test-crypto-perf_cperf_test_common.c.o.d -o app/dpdk-test-crypto-perf.p/test-crypto-perf_cperf_test_common.c.o -c ../app/test-crypto-perf/cperf_test_common.c
In file included from /usr/include/stdio.h:980,
                 from ../lib/eal/include/rte_malloc.h:14,
                 from ../app/test-crypto-perf/cperf_test_common.c:5:
In function ‘snprintf’,
    inlined from ‘cperf_alloc_common_memory’ at ../app/test-crypto-perf/cperf_test_common.c:157:3:
/usr/include/x86_64-linux-gnu/bits/stdio2.h:54:10: error: ‘__builtin___snprintf_chk’ specified bound 58 exceeds destination size 32 [-Werror=stringop-overflow=]
   54 |   return __builtin___snprintf_chk (__s, __n, __USE_FORTIFY_LEVEL - 1,
      |          ^~~~~~~~~~~~~~~~~~~~~~~~~~~~~~~~~~~~~~~~~~~~~~~~~~~~~~~~~~~~
   55 |                                    __glibc_objsize (__s), __fmt,
      |                                    ~~~~~~~~~~~~~~~~~~~~~~~~~~~~~
   56 |                                    __va_arg_pack ());
      |                                    ~~~~~~~~~~~~~~~~~
cc1: all warnings being treated as errors
[3472/3941] Compiling C object app/dpdk-test-dma-perf.p/test-dma-perf_main.c.o
[3473/3941] Compiling C object app/dpdk-test-eventdev.p/test-eventdev_evt_main.c.o
[3474/3941] Compiling C object app/dpdk-test-eventdev.p/test-eventdev_test_order_common.c.o
[3475/3941] Compiling C object app/dpdk-test-crypto-perf.p/test-crypto-perf_cperf_test_latency.c.o
[3476/3941] Compiling C object app/dpdk-test-eventdev.p/test-eventdev_test_order_queue.c.o
[3477/3941] Compiling C object app/dpdk-test-bbdev.p/test-bbdev_test_bbdev_perf.c.o
[3478/3941] Linking target app/dpdk-test-compress-perf
[3479/3941] Compiling C object app/dpdk-test-dma-perf.p/test-dma-perf_benchmark.c.o
[3480/3941] Compiling C object app/dpdk-test-eventdev.p/test-eventdev_test_perf_atq.c.o
ninja: build stopped




*Build Failed #10:
OS: Fedora44-64
Target: x86_64-native-linuxapp-clang
FAILED: app/dpdk-test-crypto-perf.p/test-crypto-perf_cperf_test_common.c.o 
clang -Iapp/dpdk-test-crypto-perf.p -Iapp -I../app -Ilib/cryptodev -I../lib/cryptodev -Ilib/eal/common -I../lib/eal/common -I. -I.. -Iconfig -I../config -Ilib/eal/include -I../lib/eal/include -Ilib/eal/linux/include -I../lib/eal/linux/include -Ilib/eal/x86/include -I../lib/eal/x86/include -I../kernel/linux -Ilib/eal -I../lib/eal -Ilib/kvargs -I../lib/kvargs -Ilib/log -I../lib/log -Ilib/metrics -I../lib/metrics -Ilib/telemetry -I../lib/telemetry -Ilib/argparse -I../lib/argparse -Ilib/mbuf -I../lib/mbuf -Ilib/mempool -I../lib/mempool -Ilib/ring -I../lib/ring -Ilib/rcu -I../lib/rcu -Ilib/net -I../lib/net -Ilib/security -I../lib/security -Idrivers/crypto/scheduler -I../drivers/crypto/scheduler -Idrivers/bus/vdev -I../drivers/bus/vdev -Ilib/reorder -I../lib/reorder -fdiagnostics-color=always -D_FILE_OFFSET_BITS=64 -Wall -Winvalid-pch -Wextra -Werror -std=c11 -O3 -include rte_config.h -Wvla -Wcast-qual -Wcomma -Wdeprecated -Wformat -Wformat-nonliteral -Wformat-security -Wmissing-declarations -Wmissing-prototypes -Wnested-externs -Wold-style-definition -Wpointer-arith -Wshadow -Wsign-compare -Wstrict-prototypes -Wundef -Wwrite-strings -Wno-missing-field-initializers -D_GNU_SOURCE -march=native -mrtm -DALLOW_EXPERIMENTAL_API -Wno-vla -MD -MQ app/dpdk-test-crypto-perf.p/test-crypto-perf_cperf_test_common.c.o -MF app/dpdk-test-crypto-perf.p/test-crypto-perf_cperf_test_common.c.o.d -o app/dpdk-test-crypto-perf.p/test-crypto-perf_cperf_test_common.c.o -c ../app/test-crypto-perf/cperf_test_common.c
../app/test-crypto-perf/cperf_test_common.c:157:3: error: 'snprintf' size argument is too large; destination buffer has size 32, but size argument is 58 [-Werror,-Wfortify-source]
  157 |                 snprintf(pool_name, RTE_MEMPOOL_NAMESIZE, "perf_asym_op_pool%u",
      |                 ^
1 error generated.
[3223/3700] Compiling C object app/dpdk-test-crypto-perf.p/test-crypto-perf_cperf_test_pmd_cyclecount.c.o
[3224/3700] Compiling C object app/dpdk-test-crypto-perf.p/test-crypto-perf_cperf_test_vectors.c.o
[3225/3700] Compiling C object app/dpdk-test-crypto-perf.p/test-crypto-perf_cperf_test_latency.c.o
[3226/3700] Compiling C object app/dpdk-test-eventdev.p/test-eventdev_evt_options.c.o
[3227/3700] Linking target app/dpdk-test-compress-perf
[3228/3700] Compiling C object app/dpdk-test-eventdev.p/test-eventdev_evt_main.c.o
[3229/3700] Compiling C object app/dpdk-test-dma-perf.p/test-dma-perf_main.c.o
[3230/3700] Compiling C object app/dpdk-test-dma-perf.p/test-dma-perf_benchmark.c.o
[3231/3700] Compiling C object app/dpdk-test-bbdev.p/test-bbdev_test_bbdev_perf.c.o
ninja: build stopped


DPDK STV team


More information about the test-report mailing list