compilation|FAILURE| pw(169986) sid(39384) job(PER_PATCH_BUILD20258)[9/9] vhost: Support vduse suspend feature
sys_stv at intel.com
sys_stv at intel.com
Thu Sep 24 12:42:22 CEST 2026
Test-Label: Intel-compilation
Test-Status: FAILURE
http://dpdk.org/patch/169986
_Compilation issues_
Submitter: Eugenio Pérez <eperezma at redhat.com>
Date: 2026-09-24 10:15:04
Reply_mail: <20260924101504.810315-10-eperezma at redhat.com>
DPDK git baseline: Repo:dpdk-next-virtio, CommitID: 9231dc7c072223628a81f5c755796d95230a5572
Meson Build Summary: 23 Builds Done, 22 Successful, 1 Failures, 0 Blocked
+-------------------+------------+--------------+------------+------------+-----------+----------+------------+
| os | gcc-static | clang-static | icc-static | gcc-shared | gcc-debug | document | gcc-16byte |
+-------------------+------------+--------------+------------+------------+-----------+----------+------------+
| OpenAnolis8.10-64 | fail | | | | | | |
| FreeBSD15-64 | pass | pass | | pass | pass | | |
| RHEL9.8-64 | pass | pass | | pass | pass | | |
| SUSE16-64 | pass | pass | | | | | |
| AzureLinux4.0-64 | pass | | | | | | |
| UB2604-32 | pass | | | | | | |
| RHEL10.2-64 | pass | | | | | | |
| UB2604-64 | pass | pass | | | | pass | pass |
| RHEL10.2-64RT | pass | | | | | | |
| UB2404-64 | pass | | | | | | |
| Fedora44-64 | pass | pass | | | | | |
| OpenEuler2404-64 | pass | | | | | | |
+-------------------+------------+--------------+------------+------------+-----------+----------+------------+
Comments:
Because of DPDK bug (https://bugs.dpdk.org/show_bug.cgi?id=928),
All the dpdk-next-* branch add `Ddisable_drivers=event/cnxk` option when build with ICC complier.
Test environment and configuration as below:
OS: OpenAnolis8.10-64
Kernel Version: 5.10.134-18.an8.x86_64
GCC Version: gcc (GCC) 8.5.0 20210514 (Anolis 8.5.0-24.0.1)
Clang Version: 18.1.8 (Red Hat 18.1.8-1.0.1.module+an8.9.0+11287+9d0292d3)
x86_64-native-linuxapp-gcc
OS: FreeBSD15-64
Kernel Version: 15.1-RELEASE-p3
GCC Version: gcc (FreeBSD Ports Collection) 14.2.0
Clang Version: 19.1.7 (https://github.com/llvm/llvm-project.git llvmorg-19.1.7-0-gcd708029e0b2)
x86_64-native-bsdapp-gcc
x86_64-native-bsdapp-clang
x86_64-native-bsdapp-gcc+shared
x86_64-native-bsdapp-gcc+debug
OS: RHEL9.8-64
Kernel Version: 5.14.0-687.5.3.el9_8.x86_64
GCC Version: gcc (GCC) 11.5.0 20240719 (Red Hat 11.5.0-14)
Clang Version: 21.1.8 (Red Hat, Inc. 21.1.8-2.el9)
x86_64-native-linuxapp-gcc
x86_64-native-linuxapp-clang
x86_64-native-linuxapp-gcc+shared
x86_64-native-linuxapp-gcc+debug
OS: SUSE16-64
Kernel Version: 6.12.0-160000.26-default
GCC Version: gcc (SUSE Linux) 15.2.0
Clang Version: 19.1.7
x86_64-native-linuxapp-clang
x86_64-native-linuxapp-gcc
OS: AzureLinux4.0-64
Kernel Version: 6.18.31-1.3.azl4.x86_64
GCC Version: gcc (GCC) 15.2.1 20260123 (Red Hat 15.2.1-7)
Clang Version: 21.1.8 (Microsoft Corporation 21.1.8-8.azl4)
x86_64-native-linuxapp-gcc
OS: UB2604-32
Kernel Version: 7.0.0-31-generic
GCC Version: gcc (Ubuntu 15.2.0-16ubuntu1) 15.2.0
Clang Version: 21.1.8 (6ubuntu1)
i686-native-linuxapp-gcc
OS: RHEL10.2-64
Kernel Version: 6.12.0-211.7.3.el10_2.x86_64
GCC Version: gcc (GCC) 14.3.1 20251022 (Red Hat 14.3.1-4)
Clang Version: 21.1.8 (Red Hat, Inc. 21.1.8-1.el10)
x86_64-native-linuxapp-gcc
OS: UB2604-64
Kernel Version: 7.0.0-31-generic
GCC Version: gcc (Ubuntu 15.2.0-16ubuntu1) 15.2.0
Clang Version: 21.1.8 (6ubuntu1)
x86_64-native-linuxapp-gcc+16byte
x86_64-native-linuxapp-gcc
x86_64-native-linuxapp-clang
x86_64-native-linuxapp-doc
OS: RHEL10.2-64RT
Kernel Version: 6.12.0-211.7.3.el10_2.x86_64+rt
GCC Version: gcc (GCC) 14.3.1 20251022 (Red Hat 14.3.1-4)
Clang Version: 21.1.8 (Red Hat, Inc. 21.1.8-1.el10)
x86_64-native-linuxapp-gcc
OS: UB2404-64
Kernel Version: 6.8.0-139-generic
GCC Version: gcc (Ubuntu 13.3.0-6ubuntu2~24.04.1) 13.3.0
Clang Version: 18.1.3 (1ubuntu1)
x86_64-native-linuxapp-gcc
OS: Fedora44-64
Kernel Version: 6.19.10-300.fc44.x86_64
GCC Version: gcc (GCC) 16.0.1 20260321 (Red Hat 16.0.1-0)
Clang Version: 22.1.8 (Fedora 22.1.8-4.fc44)
x86_64-native-linuxapp-gcc
x86_64-native-linuxapp-clang
OS: OpenEuler2404-64
Kernel Version: 6.6.0-159.4.13.167.oe2403sp4.x86_64
GCC Version: gcc (GCC) 12.3.1 (openEuler 12.3.1-110.oe2403sp4)
Clang Version: 17.0.6 ( 17.0.6-67.oe2403sp4)
x86_64-native-linuxapp-gcc
*Build Failed #1:
OS: OpenAnolis8.10-64
Target: x86_64-native-linuxapp-gcc
FAILED: lib/librte_eal.a.p/eal_linux_eal_interrupts.c.o
gcc -Ilib/librte_eal.a.p -Ilib -I../lib -Ilib/eal/common -I../lib/eal/common -I. -I.. -Iconfig -I../config -Ilib/eal/include -I../lib/eal/include -Ilib/eal/linux/include -I../lib/eal/linux/include -Ilib/eal/x86/include -I../lib/eal/x86/include -I../kernel/linux -Ilib/eal -I../lib/eal -Ilib/kvargs -I../lib/kvargs -Ilib/log -I../lib/log -Ilib/metrics -I../lib/metrics -Ilib/telemetry -I../lib/telemetry -Ilib/argparse -I../lib/argparse -fdiagnostics-color=always -D_FILE_OFFSET_BITS=64 -Wall -Winvalid-pch -Wextra -Werror -std=c11 -O3 -include rte_config.h -Wvla -Wcast-qual -Wdeprecated -Wformat -Wformat-nonliteral -Wformat-security -Wmissing-declarations -Wmissing-prototypes -Wnested-externs -Wold-style-definition -Wpointer-arith -Wshadow -Wsign-compare -Wstrict-prototypes -Wundef -Wwrite-strings -Wno-packed-not-aligned -Wno-missing-field-initializers -D_GNU_SOURCE -fPIC -march=native -mrtm -DALLOW_EXPERIMENTAL_API -DALLOW_INTERNAL_API '-DABI_VERSION="27.0"' -DRTE_LOG_DEFAULT_LOGTYPE=lib.eal -DRTE_COMPONENT_CLASS=lib -DRTE_COMPONENT_NAME=eal -MD -MQ lib/librte_eal.a.p/eal_linux_eal_interrupts.c.o -MF lib/librte_eal.a.p/eal_linux_eal_interrupts.c.o.d -o lib/librte_eal.a.p/eal_linux_eal_interrupts.c.o -c ../lib/eal/linux/eal_interrupts.c
In file included from ../lib/eal/linux/eal_interrupts.c:5:
../kernel/linux/uapi/linux/vfio.h:1524:44: error: expected ‘:’, ‘,’, ‘;’, ‘}’ or ‘__attribute__’ before ‘__counted_by’
struct vfio_region_dma_range dma_ranges[] __counted_by(nr_ranges);
^~~~~~~~~~~~
[90/3759] Compiling C object lib/librte_eal.a.p/eal_linux_eal_lcore.c.o
[91/3759] Compiling C object lib/librte_eal.a.p/eal_linux_eal_alarm.c.o
[92/3759] Compiling C object lib/librte_eal.a.p/eal_linux_eal_hugepage_info.c.o
[93/3759] Compiling C object lib/librte_eal.a.p/eal_linux_eal.c.o
[94/3759] Compiling C object lib/librte_eal.a.p/eal_linux_eal_dev.c.o
[95/3759] Compiling C object lib/librte_eal.a.p/eal_linux_eal_thread.c.o
[96/3759] Compiling C object lib/librte_eal.a.p/eal_linux_eal_timer.c.o
[97/3759] Compiling C object lib/librte_eal.a.p/eal_linux_eal_memalloc.c.o
[98/3759] Compiling C object lib/librte_eal.a.p/eal_linux_eal_memory.c.o
ninja: build stopped
DPDK STV team
More information about the test-report
mailing list