compilation|FAILURE| pw(170035) sid(39392) job(PER_PATCH_BUILD20266)[v3, 8/8] test/crypto: add RSA-PSS sign and verify test cases
sys_stv at intel.com
sys_stv at intel.com
Fri Sep 25 11:01:44 CEST 2026
Test-Label: Intel-compilation
Test-Status: FAILURE
http://dpdk.org/patch/170035
_Compilation issues_
Submitter: Sucharitha Sarananaga <ssarananaga at marvell.com>
Date: 2026-09-25 08:15:00
Reply_mail: <20260925081500.3848187-9-ssarananaga at marvell.com>
DPDK git baseline: Repo:dpdk-next-crypto, CommitID: 0dc7ea54080ce14421c68d8347d98a6c368f9700
Meson Build Summary: 23 Builds Done, 0 Successful, 23 Failures, 0 Blocked
+-------------------+------------+--------------+------------+------------+-----------+----------+------------+
| os | gcc-static | clang-static | icc-static | gcc-shared | gcc-debug | document | gcc-16byte |
+-------------------+------------+--------------+------------+------------+-----------+----------+------------+
| OpenAnolis8.10-64 | fail | | | | | | |
| FreeBSD15-64 | fail | fail | | fail | fail | | |
| RHEL9.8-64 | fail | fail | | fail | fail | | |
| SUSE16-64 | fail | fail | | | | | |
| AzureLinux4.0-64 | fail | | | | | | |
| UB2604-32 | fail | | | | | | |
| RHEL10.2-64 | fail | | | | | | |
| UB2604-64 | fail | fail | | | | fail | fail |
| RHEL10.2-64RT | fail | | | | | | |
| UB2404-64 | fail | | | | | | |
| Fedora44-64 | fail | fail | | | | | |
| OpenEuler2404-64 | fail | | | | | | |
+-------------------+------------+--------------+------------+------------+-----------+----------+------------+
Comments:
Because of DPDK bug (https://bugs.dpdk.org/show_bug.cgi?id=928),
All the dpdk-next-* branch add `Ddisable_drivers=event/cnxk` option when build with ICC complier.
Test environment and configuration as below:
OS: OpenAnolis8.10-64
Kernel Version: 5.10.134-18.an8.x86_64
GCC Version: gcc (GCC) 8.5.0 20210514 (Anolis 8.5.0-24.0.1)
Clang Version: 18.1.8 (Red Hat 18.1.8-1.0.1.module+an8.9.0+11287+9d0292d3)
x86_64-native-linuxapp-gcc
OS: FreeBSD15-64
Kernel Version: 15.1-RELEASE-p3
GCC Version: gcc (FreeBSD Ports Collection) 14.2.0
Clang Version: 19.1.7 (https://github.com/llvm/llvm-project.git llvmorg-19.1.7-0-gcd708029e0b2)
x86_64-native-bsdapp-gcc
x86_64-native-bsdapp-clang
x86_64-native-bsdapp-gcc+shared
x86_64-native-bsdapp-gcc+debug
OS: RHEL9.8-64
Kernel Version: 5.14.0-687.5.3.el9_8.x86_64
GCC Version: gcc (GCC) 11.5.0 20240719 (Red Hat 11.5.0-14)
Clang Version: 21.1.8 (Red Hat, Inc. 21.1.8-2.el9)
x86_64-native-linuxapp-gcc
x86_64-native-linuxapp-clang
x86_64-native-linuxapp-gcc+shared
x86_64-native-linuxapp-gcc+debug
OS: SUSE16-64
Kernel Version: 6.12.0-160000.26-default
GCC Version: gcc (SUSE Linux) 15.2.0
Clang Version: 19.1.7
x86_64-native-linuxapp-clang
x86_64-native-linuxapp-gcc
OS: AzureLinux4.0-64
Kernel Version: 6.18.31-1.3.azl4.x86_64
GCC Version: gcc (GCC) 15.2.1 20260123 (Red Hat 15.2.1-7)
Clang Version: 21.1.8 (Microsoft Corporation 21.1.8-8.azl4)
x86_64-native-linuxapp-gcc
OS: UB2604-32
Kernel Version: 7.0.0-31-generic
GCC Version: gcc (Ubuntu 15.2.0-16ubuntu1) 15.2.0
Clang Version: 21.1.8 (6ubuntu1)
i686-native-linuxapp-gcc
OS: RHEL10.2-64
Kernel Version: 6.12.0-211.7.3.el10_2.x86_64
GCC Version: gcc (GCC) 14.3.1 20251022 (Red Hat 14.3.1-4)
Clang Version: 21.1.8 (Red Hat, Inc. 21.1.8-1.el10)
x86_64-native-linuxapp-gcc
OS: UB2604-64
Kernel Version: 7.0.0-31-generic
GCC Version: gcc (Ubuntu 15.2.0-16ubuntu1) 15.2.0
Clang Version: 21.1.8 (6ubuntu1)
x86_64-native-linuxapp-gcc+16byte
x86_64-native-linuxapp-gcc
x86_64-native-linuxapp-clang
x86_64-native-linuxapp-doc
OS: RHEL10.2-64RT
Kernel Version: 6.12.0-211.7.3.el10_2.x86_64+rt
GCC Version: gcc (GCC) 14.3.1 20251022 (Red Hat 14.3.1-4)
Clang Version: 21.1.8 (Red Hat, Inc. 21.1.8-1.el10)
x86_64-native-linuxapp-gcc
OS: UB2404-64
Kernel Version: 6.8.0-139-generic
GCC Version: gcc (Ubuntu 13.3.0-6ubuntu2~24.04.1) 13.3.0
Clang Version: 18.1.3 (1ubuntu1)
x86_64-native-linuxapp-gcc
OS: Fedora44-64
Kernel Version: 6.19.10-300.fc44.x86_64
GCC Version: gcc (GCC) 16.0.1 20260321 (Red Hat 16.0.1-0)
Clang Version: 22.1.8 (Fedora 22.1.8-4.fc44)
x86_64-native-linuxapp-gcc
x86_64-native-linuxapp-clang
OS: OpenEuler2404-64
Kernel Version: 6.6.0-159.4.13.167.oe2403sp4.x86_64
GCC Version: gcc (GCC) 12.3.1 (openEuler 12.3.1-110.oe2403sp4)
Clang Version: 17.0.6 ( 17.0.6-67.oe2403sp4)
x86_64-native-linuxapp-gcc
*Build Failed #1:
OS: OpenAnolis8.10-64
Target: x86_64-native-linuxapp-gcc
FAILED: app/dpdk-test.p/test_test_cryptodev_asym.c.o
gcc -Iapp/dpdk-test.p -Iapp -I../app -Ilib/cmdline -I../lib/cmdline -Ilib/eal/common -I../lib/eal/common -I. -I.. -Iconfig -I../config -Ilib/eal/include -I../lib/eal/include -Ilib/eal/linux/include -I../lib/eal/linux/include -Ilib/eal/x86/include -I../lib/eal/x86/include -I../kernel/linux -Ilib/eal -I../lib/eal -Ilib/kvargs -I../lib/kvargs -Ilib/log -I../lib/log -Ilib/metrics -I../lib/metrics -Ilib/telemetry -I../lib/telemetry -Ilib/argparse -I../lib/argparse -Ilib/net -I../lib/net -Ilib/mbuf -I../lib/mbuf -Ilib/mempool -I../lib/mempool -Ilib/ring -I../lib/ring -Idrivers/net/ring -I../drivers/net/ring -Ilib/ethdev -I../lib/ethdev -Ilib/meter -I../lib/meter -Idrivers/bus/pci -I../drivers/bus/pci -I../drivers/bus/pci/linux -Ilib/pci -I../lib/pci -Idrivers/bus/vdev -I../drivers/bus/vdev -Ilib/acl -I../lib/acl -Ilib/hash -I../lib/hash -Ilib/rcu -I../lib/rcu -Ilib/bitratestats -I../lib/bitratestats -Ilib/bpf -I../lib/bpf -Ilib/cfgfile -I../lib/cfgfile -Ilib/compressdev -I../lib/compressdev -Ilib/cryptodev -I../lib/cryptodev -Ilib/security -I../lib/security -Ilib/dispatcher -I../lib/dispatcher -Ilib/eventdev -I../lib/eventdev -Ilib/timer -I../lib/timer -Ilib/dmadev -I../lib/dmadev -Ilib/distributor -I../lib/distributor -Ilib/efd -I../lib/efd -Ilib/fib -I../lib/fib -Ilib/rib -I../lib/rib -Ilib/table -I../lib/table -Ilib/lpm -I../lib/lpm -Ilib/graph -I../lib/graph -Ilib/pcapng -I../lib/pcapng -Ilib/ip_frag -I../lib/ip_frag -Ilib/ipsec -I../lib/ipsec -Ilib/latencystats -I../lib/latencystats -Idrivers/net/bonding -I../drivers/net/bonding -Ilib/sched -I../lib/sched -Idrivers/net/null -I../drivers/net/null -Ilib/member -I../lib/member -Ilib/pdcp -I../lib/pdcp -Ilib/reorder -I../lib/reorder -Ilib/pdump -I../lib/pdump -Idrivers/net/af_packet -I../drivers/net/af_packet -Idrivers/net/pcap -I../drivers/net/pcap -Idrivers/net/tap -I../drivers/net/tap -Ilib/gso -I../lib/gso -Ilib/pmu -I../lib/pmu -Ilib/power -I../lib/power -Idrivers/power/acpi -I../drivers/power/acpi -Idrivers/power/kvm_vm -I../drivers/power/kvm_vm -Idrivers/power/intel_pstate -I../drivers/power/intel_pstate -Idrivers/power/amd_pstate -I../drivers/power/amd_pstate -Idrivers/power/cppc -I../drivers/power/cppc -Idrivers/power/intel_uncore -I../drivers/power/intel_uncore -Ilib/ptr_compress -I../lib/ptr_compress -Ilib/rawdev -I../lib/rawdev -Idrivers/raw/skeleton -I../drivers/raw/skeleton -Ilib/stack -I../lib/stack -Idrivers/crypto/scheduler -I../drivers/crypto/scheduler -Iapp/test/bpf -Iapp/test/test_cfgfiles -fdiagnostics-color=always -D_FILE_OFFSET_BITS=64 -Wall -Winvalid-pch -Wextra -Werror -std=c11 -O3 -include rte_config.h -Wvla -Wcast-qual -Wdeprecated -Wformat -Wformat-nonliteral -Wformat-security -Wmissing-declarations -Wmissing-prototypes -Wnested-externs -Wold-style-definition -Wpointer-arith -Wshadow -Wsign-compare -Wstrict-prototypes -Wundef -Wwrite-strings -Wno-packed-not-aligned -Wno-missing-field-initializers -D_GNU_SOURCE -march=native -mrtm -DALLOW_EXPERIMENTAL_API -Wno-vla -Wno-shadow -fno-strict-aliasing -DALLOW_INTERNAL_API -DTEST_BPF_ELF_LOAD -MD -MQ app/dpdk-test.p/test_test_cryptodev_asym.c.o -MF app/dpdk-test.p/test_test_cryptodev_asym.c.o.d -o app/dpdk-test.p/test_test_cryptodev_asym.c.o -c ../app/test/test_cryptodev_asym.c
../app/test/test_cryptodev_asym.c: In function ‘queue_ops_rsa_pss_sign_verify’:
../app/test/test_cryptodev_asym.c:691:28: error: assignment discards ‘const’ qualifier from pointer target type [-Werror=discarded-qualifiers]
asym_op->rsa.message.data = rsa_pss_digest_sha256.data;
^
cc1: all warnings being treated as errors
[3391/3705] Compiling C object app/dpdk-test.p/test_test_efd.c.o
[3392/3705] Compiling C object app/dpdk-test.p/test_test_efd_perf.c.o
[3393/3705] Compiling C object app/dpdk-test.p/test_test_distributor_perf.c.o
[3394/3705] Compiling C object app/dpdk-test.p/test_test_distributor.c.o
[3395/3705] Compiling C object app/dpdk-test.p/test_test_ethdev_api.c.o
[3396/3705] Compiling C object app/dpdk-test.p/test_test_ethdev_link.c.o
[3397/3705] Compiling C object app/dpdk-test.p/test_test_dmadev.c.o
[3398/3705] Compiling C object app/dpdk-test.p/test_test_eal_flags.c.o
[3399/3705] Compiling C object app/dpdk-test.p/test_test_cryptodev.c.o
ninja: build stopped
*Build Failed #2:
OS: FreeBSD15-64
Target: x86_64-native-bsdapp-gcc
FAILED: [code=1] app/dpdk-test.p/test_test_cryptodev_asym.c.o
gcc -Iapp/dpdk-test.p -Iapp -I../app -Ilib/cmdline -I../lib/cmdline -Ilib/eal/common -I../lib/eal/common -I. -I.. -Iconfig -I../config -Ilib/eal/include -I../lib/eal/include -Ilib/eal/freebsd/include -I../lib/eal/freebsd/include -Ilib/eal/x86/include -I../lib/eal/x86/include -Ilib/eal -I../lib/eal -Ilib/kvargs -I../lib/kvargs -Ilib/log -I../lib/log -Ilib/metrics -I../lib/metrics -Ilib/telemetry -I../lib/telemetry -Ilib/argparse -I../lib/argparse -Ilib/net -I../lib/net -Ilib/mbuf -I../lib/mbuf -Ilib/mempool -I../lib/mempool -Ilib/ring -I../lib/ring -Idrivers/net/ring -I../drivers/net/ring -Ilib/ethdev -I../lib/ethdev -Ilib/meter -I../lib/meter -Idrivers/bus/pci -I../drivers/bus/pci -I../drivers/bus/pci/bsd -Ilib/pci -I../lib/pci -Idrivers/bus/vdev -I../drivers/bus/vdev -Ilib/acl -I../lib/acl -Ilib/hash -I../lib/hash -Ilib/rcu -I../lib/rcu -Ilib/bitratestats -I../lib/bitratestats -Ilib/bpf -I../lib/bpf -Ilib/cfgfile -I../lib/cfgfile -Ilib/compressdev -I../lib/compressdev -Ilib/cryptodev -I../lib/cryptodev -Ilib/security -I../lib/security -Ilib/dispatcher -I../lib/dispatcher -Ilib/eventdev -I../lib/eventdev -Ilib/timer -I../lib/timer -Ilib/dmadev -I../lib/dmadev -Ilib/distributor -I../lib/distributor -Ilib/efd -I../lib/efd -Ilib/fib -I../lib/fib -Ilib/rib -I../lib/rib -Ilib/table -I../lib/table -Ilib/lpm -I../lib/lpm -Ilib/graph -I../lib/graph -Ilib/pcapng -I../lib/pcapng -Ilib/ip_frag -I../lib/ip_frag -Ilib/ipsec -I../lib/ipsec -Ilib/latencystats -I../lib/latencystats -Idrivers/net/bonding -I../drivers/net/bonding -Ilib/sched -I../lib/sched -Idrivers/net/null -I../drivers/net/null -Ilib/member -I../lib/member -Ilib/pdcp -I../lib/pdcp -Ilib/reorder -I../lib/reorder -Ilib/pdump -I../lib/pdump -Idrivers/net/pcap -I../drivers/net/pcap -Ilib/ptr_compress -I../lib/ptr_compress -Ilib/rawdev -I../lib/rawdev -Idrivers/raw/skeleton -I../drivers/raw/skeleton -Ilib/stack -I../lib/stack -Idrivers/crypto/scheduler -I../drivers/crypto/scheduler -Iapp/test/test_cfgfiles -fdiagnostics-color=always -D_FILE_OFFSET_BITS=64 -Wall -Winvalid-pch -Wextra -Werror -std=c11 -O3 -include rte_config.h -Wvla -Wcast-qual -Wdeprecated -Wformat -Wformat-nonliteral -Wformat-security -Wmissing-declarations -Wmissing-prototypes -Wnested-externs -Wold-style-definition -Wpointer-arith -Wshadow -Wsign-compare -Wstrict-prototypes -Wundef -Wwrite-strings -Wno-packed-not-aligned -Wno-missing-field-initializers -D_GNU_SOURCE -D__BSD_VISIBLE -march=native -mno-avx512f -mrtm -DALLOW_EXPERIMENTAL_API -Wno-vla -Wno-shadow -fno-strict-aliasing -DALLOW_INTERNAL_API -MD -MQ app/dpdk-test.p/test_test_cryptodev_asym.c.o -MF app/dpdk-test.p/test_test_cryptodev_asym.c.o.d -o app/dpdk-test.p/test_test_cryptodev_asym.c.o -c ../app/test/test_cryptodev_asym.c
../app/test/test_cryptodev_asym.c: In function 'queue_ops_rsa_pss_sign_verify':
../app/test/test_cryptodev_asym.c:691:35: error: assignment discards 'const' qualifier from pointer target type [-Werror=discarded-qualifiers]
691 | asym_op->rsa.message.data = rsa_pss_digest_sha256.data;
| ^
cc1: all warnings being treated as errors
[1838/2222] Compiling C object app/dpdk-test.p/test_test_ethdev_link.c.o
[1839/2222] Compiling C object app/dpdk-test.p/test_test_distributor.c.o
[1840/2222] Compiling C object app/dpdk-test.p/test_test_event_eth_tx_adapter.c.o
[1841/2222] Compiling C object app/dpdk-test.p/test_test_event_dma_adapter.c.o
[1842/2222] Compiling C object app/dpdk-test.p/test_test_event_eth_rx_adapter.c.o
[1843/2222] Compiling C object app/dpdk-test.p/test_test_dmadev.c.o
[1844/2222] Compiling C object app/dpdk-test.p/test_test_event_crypto_adapter.c.o
[1845/2222] Compiling C object app/dpdk-test.p/test_test_event_ring.c.o
[1846/2222] Compiling C object app/dpdk-test.p/test_test_cryptodev.c.o
ninja: build stopped
*Build Failed #3:
OS: FreeBSD15-64
Target: x86_64-native-bsdapp-clang
FAILED: [code=1] app/dpdk-test.p/test_test_cryptodev_asym.c.o
clang -Iapp/dpdk-test.p -Iapp -I../app -Ilib/cmdline -I../lib/cmdline -Ilib/eal/common -I../lib/eal/common -I. -I.. -Iconfig -I../config -Ilib/eal/include -I../lib/eal/include -Ilib/eal/freebsd/include -I../lib/eal/freebsd/include -Ilib/eal/x86/include -I../lib/eal/x86/include -Ilib/eal -I../lib/eal -Ilib/kvargs -I../lib/kvargs -Ilib/log -I../lib/log -Ilib/metrics -I../lib/metrics -Ilib/telemetry -I../lib/telemetry -Ilib/argparse -I../lib/argparse -Ilib/net -I../lib/net -Ilib/mbuf -I../lib/mbuf -Ilib/mempool -I../lib/mempool -Ilib/ring -I../lib/ring -Idrivers/net/ring -I../drivers/net/ring -Ilib/ethdev -I../lib/ethdev -Ilib/meter -I../lib/meter -Idrivers/bus/pci -I../drivers/bus/pci -I../drivers/bus/pci/bsd -Ilib/pci -I../lib/pci -Idrivers/bus/vdev -I../drivers/bus/vdev -Ilib/acl -I../lib/acl -Ilib/hash -I../lib/hash -Ilib/rcu -I../lib/rcu -Ilib/bitratestats -I../lib/bitratestats -Ilib/bpf -I../lib/bpf -Ilib/cfgfile -I../lib/cfgfile -Ilib/compressdev -I../lib/compressdev -Ilib/cryptodev -I../lib/cryptodev -Ilib/security -I../lib/security -Ilib/dispatcher -I../lib/dispatcher -Ilib/eventdev -I../lib/eventdev -Ilib/timer -I../lib/timer -Ilib/dmadev -I../lib/dmadev -Ilib/distributor -I../lib/distributor -Ilib/efd -I../lib/efd -Ilib/fib -I../lib/fib -Ilib/rib -I../lib/rib -Ilib/table -I../lib/table -Ilib/lpm -I../lib/lpm -Ilib/graph -I../lib/graph -Ilib/pcapng -I../lib/pcapng -Ilib/ip_frag -I../lib/ip_frag -Ilib/ipsec -I../lib/ipsec -Ilib/latencystats -I../lib/latencystats -Idrivers/net/bonding -I../drivers/net/bonding -Ilib/sched -I../lib/sched -Idrivers/net/null -I../drivers/net/null -Ilib/member -I../lib/member -Ilib/pdcp -I../lib/pdcp -Ilib/reorder -I../lib/reorder -Ilib/pdump -I../lib/pdump -Idrivers/net/pcap -I../drivers/net/pcap -Ilib/ptr_compress -I../lib/ptr_compress -Ilib/rawdev -I../lib/rawdev -Idrivers/raw/skeleton -I../drivers/raw/skeleton -Ilib/stack -I../lib/stack -Idrivers/crypto/scheduler -I../drivers/crypto/scheduler -Iapp/test/test_cfgfiles -fdiagnostics-color=always -D_FILE_OFFSET_BITS=64 -Wall -Winvalid-pch -Wextra -Werror -std=c11 -O3 -include rte_config.h -Wvla -Wcast-qual -Wcomma -Wdeprecated -Wformat -Wformat-nonliteral -Wformat-security -Wmissing-declarations -Wmissing-prototypes -Wnested-externs -Wold-style-definition -Wpointer-arith -Wshadow -Wsign-compare -Wstrict-prototypes -Wundef -Wwrite-strings -Wno-missing-field-initializers -D_GNU_SOURCE -D__BSD_VISIBLE -march=native -mrtm -DALLOW_EXPERIMENTAL_API -Wno-vla -Wno-shadow -fno-strict-aliasing -DALLOW_INTERNAL_API -MD -MQ app/dpdk-test.p/test_test_cryptodev_asym.c.o -MF app/dpdk-test.p/test_test_cryptodev_asym.c.o.d -o app/dpdk-test.p/test_test_cryptodev_asym.c.o -c ../app/test/test_cryptodev_asym.c
../app/test/test_cryptodev_asym.c:691:28: error: assigning to 'uint8_t *' (aka 'unsigned char *') from 'const uint8_t[4096]' (aka 'const unsigned char[4096]') discards qualifiers [-Werror,-Wincompatible-pointer-types-discards-qualifiers]
691 | asym_op->rsa.message.data = rsa_pss_digest_sha256.data;
| ^ ~~~~~~~~~~~~~~~~~~~~~~~~~~
1 error generated.
[1833/2243] Compiling C object app/dpdk-test.p/test_test_cycles.c.o
[1834/2243] Compiling C object app/dpdk-test.p/test_test_cryptodev_security_ipsec.c.o
[1835/2243] Compiling C object app/dpdk-test.p/test_test_cryptodev_security_tls_record.c.o
[1836/2243] Compiling C object app/dpdk-test.p/test_test_cryptodev_security_pdcp.c.o
[1837/2243] Compiling C object app/dpdk-test.p/test_test_cryptodev_crosscheck.c.o
[1838/2243] Compiling C object app/dpdk-test.p/test_test_devargs.c.o
[1839/2243] Compiling C object app/dpdk-test.p/test_test_dispatcher.c.o
[1840/2243] Compiling C object app/dpdk-test.p/test_test_cryptodev_blockcipher.c.o
[1841/2243] Compiling C object app/dpdk-test.p/test_test_cryptodev.c.o
ninja: build stopped
*Build Failed #4:
OS: FreeBSD15-64
Target: x86_64-native-bsdapp-gcc+shared
FAILED: [code=1] app/dpdk-test.p/test_test_cryptodev_asym.c.o
gcc -Iapp/dpdk-test.p -Iapp -I../app -Ilib/cmdline -I../lib/cmdline -Ilib/eal/common -I../lib/eal/common -I. -I.. -Iconfig -I../config -Ilib/eal/include -I../lib/eal/include -Ilib/eal/freebsd/include -I../lib/eal/freebsd/include -Ilib/eal/x86/include -I../lib/eal/x86/include -Ilib/eal -I../lib/eal -Ilib/kvargs -I../lib/kvargs -Ilib/log -I../lib/log -Ilib/metrics -I../lib/metrics -Ilib/telemetry -I../lib/telemetry -Ilib/argparse -I../lib/argparse -Ilib/net -I../lib/net -Ilib/mbuf -I../lib/mbuf -Ilib/mempool -I../lib/mempool -Ilib/ring -I../lib/ring -Idrivers/net/ring -I../drivers/net/ring -Ilib/ethdev -I../lib/ethdev -Ilib/meter -I../lib/meter -Idrivers/bus/pci -I../drivers/bus/pci -I../drivers/bus/pci/bsd -Ilib/pci -I../lib/pci -Idrivers/bus/vdev -I../drivers/bus/vdev -Ilib/acl -I../lib/acl -Ilib/hash -I../lib/hash -Ilib/rcu -I../lib/rcu -Ilib/bitratestats -I../lib/bitratestats -Ilib/bpf -I../lib/bpf -Ilib/cfgfile -I../lib/cfgfile -Ilib/compressdev -I../lib/compressdev -Ilib/cryptodev -I../lib/cryptodev -Ilib/security -I../lib/security -Ilib/dispatcher -I../lib/dispatcher -Ilib/eventdev -I../lib/eventdev -Ilib/timer -I../lib/timer -Ilib/dmadev -I../lib/dmadev -Ilib/distributor -I../lib/distributor -Ilib/efd -I../lib/efd -Ilib/fib -I../lib/fib -Ilib/rib -I../lib/rib -Ilib/table -I../lib/table -Ilib/lpm -I../lib/lpm -Ilib/graph -I../lib/graph -Ilib/pcapng -I../lib/pcapng -Ilib/ip_frag -I../lib/ip_frag -Ilib/ipsec -I../lib/ipsec -Ilib/latencystats -I../lib/latencystats -Idrivers/net/bonding -I../drivers/net/bonding -Ilib/sched -I../lib/sched -Idrivers/net/null -I../drivers/net/null -Ilib/member -I../lib/member -Ilib/pdcp -I../lib/pdcp -Ilib/reorder -I../lib/reorder -Ilib/pdump -I../lib/pdump -Idrivers/net/pcap -I../drivers/net/pcap -Ilib/ptr_compress -I../lib/ptr_compress -Ilib/rawdev -I../lib/rawdev -Idrivers/raw/skeleton -I../drivers/raw/skeleton -Ilib/stack -I../lib/stack -Idrivers/crypto/scheduler -I../drivers/crypto/scheduler -Iapp/test/test_cfgfiles -fdiagnostics-color=always -D_FILE_OFFSET_BITS=64 -Wall -Winvalid-pch -Wextra -Werror -std=c11 -O3 -include rte_config.h -Wvla -Wcast-qual -Wdeprecated -Wformat -Wformat-nonliteral -Wformat-security -Wmissing-declarations -Wmissing-prototypes -Wnested-externs -Wold-style-definition -Wpointer-arith -Wshadow -Wsign-compare -Wstrict-prototypes -Wundef -Wwrite-strings -Wno-packed-not-aligned -Wno-missing-field-initializers -D_GNU_SOURCE -D__BSD_VISIBLE -march=native -mno-avx512f -mrtm -DALLOW_EXPERIMENTAL_API -Wno-vla -Wno-shadow -fno-strict-aliasing -DALLOW_INTERNAL_API -MD -MQ app/dpdk-test.p/test_test_cryptodev_asym.c.o -MF app/dpdk-test.p/test_test_cryptodev_asym.c.o.d -o app/dpdk-test.p/test_test_cryptodev_asym.c.o -c ../app/test/test_cryptodev_asym.c
../app/test/test_cryptodev_asym.c: In function 'queue_ops_rsa_pss_sign_verify':
../app/test/test_cryptodev_asym.c:691:35: error: assignment discards 'const' qualifier from pointer target type [-Werror=discarded-qualifiers]
691 | asym_op->rsa.message.data = rsa_pss_digest_sha256.data;
| ^
cc1: all warnings being treated as errors
[1893/2099] Compiling C object app/dpdk-test.p/test_test_event_dma_adapter.c.o
[1894/2099] Compiling C object app/dpdk-test.p/test_test_dmadev.c.o
[1895/2099] Compiling C object app/dpdk-test.p/test_test_cryptodev_blockcipher.c.o
[1896/2099] Compiling C object app/dpdk-test.p/test_test_distributor.c.o
[1897/2099] Compiling C object app/dpdk-test.p/test_test_event_eth_tx_adapter.c.o
[1898/2099] Compiling C object app/dpdk-test.p/test_test_event_eth_rx_adapter.c.o
[1899/2099] Compiling C object app/dpdk-test.p/test_test_event_crypto_adapter.c.o
[1900/2099] Compiling C object app/dpdk-test.p/test_test_event_ring.c.o
[1901/2099] Compiling C object app/dpdk-test.p/test_test_cryptodev.c.o
ninja: build stopped
*Build Failed #5:
OS: FreeBSD15-64
Target: x86_64-native-bsdapp-gcc+debug
FAILED: [code=1] app/dpdk-test.p/test_test_cryptodev_asym.c.o
gcc -Iapp/dpdk-test.p -Iapp -I../app -Ilib/cmdline -I../lib/cmdline -Ilib/eal/common -I../lib/eal/common -I. -I.. -Iconfig -I../config -Ilib/eal/include -I../lib/eal/include -Ilib/eal/freebsd/include -I../lib/eal/freebsd/include -Ilib/eal/x86/include -I../lib/eal/x86/include -Ilib/eal -I../lib/eal -Ilib/kvargs -I../lib/kvargs -Ilib/log -I../lib/log -Ilib/metrics -I../lib/metrics -Ilib/telemetry -I../lib/telemetry -Ilib/argparse -I../lib/argparse -Ilib/net -I../lib/net -Ilib/mbuf -I../lib/mbuf -Ilib/mempool -I../lib/mempool -Ilib/ring -I../lib/ring -Idrivers/net/ring -I../drivers/net/ring -Ilib/ethdev -I../lib/ethdev -Ilib/meter -I../lib/meter -Idrivers/bus/pci -I../drivers/bus/pci -I../drivers/bus/pci/bsd -Ilib/pci -I../lib/pci -Idrivers/bus/vdev -I../drivers/bus/vdev -Ilib/acl -I../lib/acl -Ilib/hash -I../lib/hash -Ilib/rcu -I../lib/rcu -Ilib/bitratestats -I../lib/bitratestats -Ilib/bpf -I../lib/bpf -Ilib/cfgfile -I../lib/cfgfile -Ilib/compressdev -I../lib/compressdev -Ilib/cryptodev -I../lib/cryptodev -Ilib/security -I../lib/security -Ilib/dispatcher -I../lib/dispatcher -Ilib/eventdev -I../lib/eventdev -Ilib/timer -I../lib/timer -Ilib/dmadev -I../lib/dmadev -Ilib/distributor -I../lib/distributor -Ilib/efd -I../lib/efd -Ilib/fib -I../lib/fib -Ilib/rib -I../lib/rib -Ilib/table -I../lib/table -Ilib/lpm -I../lib/lpm -Ilib/graph -I../lib/graph -Ilib/pcapng -I../lib/pcapng -Ilib/ip_frag -I../lib/ip_frag -Ilib/ipsec -I../lib/ipsec -Ilib/latencystats -I../lib/latencystats -Idrivers/net/bonding -I../drivers/net/bonding -Ilib/sched -I../lib/sched -Idrivers/net/null -I../drivers/net/null -Ilib/member -I../lib/member -Ilib/pdcp -I../lib/pdcp -Ilib/reorder -I../lib/reorder -Ilib/pdump -I../lib/pdump -Idrivers/net/pcap -I../drivers/net/pcap -Ilib/ptr_compress -I../lib/ptr_compress -Ilib/rawdev -I../lib/rawdev -Idrivers/raw/skeleton -I../drivers/raw/skeleton -Ilib/stack -I../lib/stack -Idrivers/crypto/scheduler -I../drivers/crypto/scheduler -Iapp/test/test_cfgfiles -fdiagnostics-color=always -D_FILE_OFFSET_BITS=64 -Wall -Winvalid-pch -Wextra -Werror -std=c11 -O2 -g -include rte_config.h -Wvla -Wcast-qual -Wdeprecated -Wformat -Wformat-nonliteral -Wformat-security -Wmissing-declarations -Wmissing-prototypes -Wnested-externs -Wold-style-definition -Wpointer-arith -Wshadow -Wsign-compare -Wstrict-prototypes -Wundef -Wwrite-strings -Wno-packed-not-aligned -Wno-missing-field-initializers -D_GNU_SOURCE -D__BSD_VISIBLE -march=native -mno-avx512f -mrtm -DALLOW_EXPERIMENTAL_API -Wno-vla -Wno-shadow -fno-strict-aliasing -DALLOW_INTERNAL_API -MD -MQ app/dpdk-test.p/test_test_cryptodev_asym.c.o -MF app/dpdk-test.p/test_test_cryptodev_asym.c.o.d -o app/dpdk-test.p/test_test_cryptodev_asym.c.o -c ../app/test/test_cryptodev_asym.c
../app/test/test_cryptodev_asym.c: In function 'queue_ops_rsa_pss_sign_verify':
../app/test/test_cryptodev_asym.c:691:35: error: assignment discards 'const' qualifier from pointer target type [-Werror=discarded-qualifiers]
691 | asym_op->rsa.message.data = rsa_pss_digest_sha256.data;
| ^
cc1: all warnings being treated as errors
[1837/2222] Compiling C object app/dpdk-test.p/test_test_ethdev_api.c.o
[1838/2222] Compiling C object app/dpdk-test.p/test_test_ethdev_link.c.o
[1839/2222] Compiling C object app/dpdk-test.p/test_test_dmadev.c.o
[1840/2222] Compiling C object app/dpdk-test.p/test_test_event_eth_tx_adapter.c.o
[1841/2222] Compiling C object app/dpdk-test.p/test_test_event_dma_adapter.c.o
[1842/2222] Compiling C object app/dpdk-test.p/test_test_event_eth_rx_adapter.c.o
[1843/2222] Compiling C object app/dpdk-test.p/test_test_distributor.c.o
[1844/2222] Compiling C object app/dpdk-test.p/test_test_event_crypto_adapter.c.o
[1845/2222] Compiling C object app/dpdk-test.p/test_test_cryptodev.c.o
ninja: build stopped
*Build Failed #6:
OS: RHEL9.8-64
Target: x86_64-native-linuxapp-gcc
FAILED: app/dpdk-test.p/test_test_cryptodev_asym.c.o
gcc -Iapp/dpdk-test.p -Iapp -I../app -Ilib/cmdline -I../lib/cmdline -Ilib/eal/common -I../lib/eal/common -I. -I.. -Iconfig -I../config -Ilib/eal/include -I../lib/eal/include -Ilib/eal/linux/include -I../lib/eal/linux/include -Ilib/eal/x86/include -I../lib/eal/x86/include -I../kernel/linux -Ilib/eal -I../lib/eal -Ilib/kvargs -I../lib/kvargs -Ilib/log -I../lib/log -Ilib/metrics -I../lib/metrics -Ilib/telemetry -I../lib/telemetry -Ilib/argparse -I../lib/argparse -Ilib/net -I../lib/net -Ilib/mbuf -I../lib/mbuf -Ilib/mempool -I../lib/mempool -Ilib/ring -I../lib/ring -Idrivers/net/ring -I../drivers/net/ring -Ilib/ethdev -I../lib/ethdev -Ilib/meter -I../lib/meter -Idrivers/bus/pci -I../drivers/bus/pci -I../drivers/bus/pci/linux -Ilib/pci -I../lib/pci -Idrivers/bus/vdev -I../drivers/bus/vdev -Ilib/acl -I../lib/acl -Ilib/hash -I../lib/hash -Ilib/rcu -I../lib/rcu -Ilib/bitratestats -I../lib/bitratestats -Ilib/bpf -I../lib/bpf -Ilib/cfgfile -I../lib/cfgfile -Ilib/compressdev -I../lib/compressdev -Ilib/cryptodev -I../lib/cryptodev -Ilib/security -I../lib/security -Ilib/dispatcher -I../lib/dispatcher -Ilib/eventdev -I../lib/eventdev -Ilib/timer -I../lib/timer -Ilib/dmadev -I../lib/dmadev -Ilib/distributor -I../lib/distributor -Ilib/efd -I../lib/efd -Ilib/fib -I../lib/fib -Ilib/rib -I../lib/rib -Ilib/table -I../lib/table -Ilib/lpm -I../lib/lpm -Ilib/graph -I../lib/graph -Ilib/pcapng -I../lib/pcapng -Ilib/ip_frag -I../lib/ip_frag -Ilib/ipsec -I../lib/ipsec -Ilib/latencystats -I../lib/latencystats -Idrivers/net/bonding -I../drivers/net/bonding -Ilib/sched -I../lib/sched -Idrivers/net/null -I../drivers/net/null -Ilib/member -I../lib/member -Ilib/pdcp -I../lib/pdcp -Ilib/reorder -I../lib/reorder -Ilib/pdump -I../lib/pdump -Idrivers/net/af_packet -I../drivers/net/af_packet -Idrivers/net/tap -I../drivers/net/tap -Ilib/gso -I../lib/gso -Ilib/pmu -I../lib/pmu -Ilib/power -I../lib/power -Idrivers/power/acpi -I../drivers/power/acpi -Idrivers/power/kvm_vm -I../drivers/power/kvm_vm -Idrivers/power/intel_pstate -I../drivers/power/intel_pstate -Idrivers/power/amd_pstate -I../drivers/power/amd_pstate -Idrivers/power/cppc -I../drivers/power/cppc -Idrivers/power/intel_uncore -I../drivers/power/intel_uncore -Ilib/ptr_compress -I../lib/ptr_compress -Ilib/rawdev -I../lib/rawdev -Idrivers/raw/skeleton -I../drivers/raw/skeleton -Ilib/stack -I../lib/stack -Idrivers/crypto/scheduler -I../drivers/crypto/scheduler -Iapp/test/test_cfgfiles -fdiagnostics-color=always -D_FILE_OFFSET_BITS=64 -Wall -Winvalid-pch -Wextra -Werror -std=c11 -O3 -include rte_config.h -Wvla -Wcast-qual -Wdeprecated -Wformat -Wformat-nonliteral -Wformat-security -Wmissing-declarations -Wmissing-prototypes -Wnested-externs -Wold-style-definition -Wpointer-arith -Wshadow -Wsign-compare -Wstrict-prototypes -Wundef -Wwrite-strings -Wno-packed-not-aligned -Wno-missing-field-initializers -D_GNU_SOURCE -march=native -mrtm -DALLOW_EXPERIMENTAL_API -Wno-vla -Wno-shadow -fno-strict-aliasing -DALLOW_INTERNAL_API -MD -MQ app/dpdk-test.p/test_test_cryptodev_asym.c.o -MF app/dpdk-test.p/test_test_cryptodev_asym.c.o.d -o app/dpdk-test.p/test_test_cryptodev_asym.c.o -c ../app/test/test_cryptodev_asym.c
../app/test/test_cryptodev_asym.c: In function ‘queue_ops_rsa_pss_sign_verify’:
../app/test/test_cryptodev_asym.c:691:35: error: assignment discards ‘const’ qualifier from pointer target type [-Werror=discarded-qualifiers]
691 | asym_op->rsa.message.data = rsa_pss_digest_sha256.data;
| ^
cc1: all warnings being treated as errors
[3329/3646] Compiling C object app/dpdk-test.p/test_test_efd_perf.c.o
[3330/3646] Compiling C object app/dpdk-test.p/test_test_ethdev_api.c.o
[3331/3646] Compiling C object app/dpdk-test.p/test_test_ethdev_link.c.o
[3332/3646] Compiling C object app/dpdk-test.p/test_test_distributor.c.o
[3333/3646] Compiling C object app/dpdk-test.p/test_test_dmadev.c.o
[3334/3646] Compiling C object app/dpdk-test.p/test_test_event_eth_rx_adapter.c.o
[3335/3646] Compiling C object app/dpdk-test.p/test_test_event_dma_adapter.c.o
[3336/3646] Compiling C object app/dpdk-test.p/test_test_event_crypto_adapter.c.o
[3337/3646] Compiling C object app/dpdk-test.p/test_test_cryptodev.c.o
ninja: build stopped
*Build Failed #7:
OS: RHEL9.8-64
Target: x86_64-native-linuxapp-clang
FAILED: app/dpdk-test.p/test_test_cryptodev_asym.c.o
clang -Iapp/dpdk-test.p -Iapp -I../app -Ilib/cmdline -I../lib/cmdline -Ilib/eal/common -I../lib/eal/common -I. -I.. -Iconfig -I../config -Ilib/eal/include -I../lib/eal/include -Ilib/eal/linux/include -I../lib/eal/linux/include -Ilib/eal/x86/include -I../lib/eal/x86/include -I../kernel/linux -Ilib/eal -I../lib/eal -Ilib/kvargs -I../lib/kvargs -Ilib/log -I../lib/log -Ilib/metrics -I../lib/metrics -Ilib/telemetry -I../lib/telemetry -Ilib/argparse -I../lib/argparse -Ilib/net -I../lib/net -Ilib/mbuf -I../lib/mbuf -Ilib/mempool -I../lib/mempool -Ilib/ring -I../lib/ring -Idrivers/net/ring -I../drivers/net/ring -Ilib/ethdev -I../lib/ethdev -Ilib/meter -I../lib/meter -Idrivers/bus/pci -I../drivers/bus/pci -I../drivers/bus/pci/linux -Ilib/pci -I../lib/pci -Idrivers/bus/vdev -I../drivers/bus/vdev -Ilib/acl -I../lib/acl -Ilib/hash -I../lib/hash -Ilib/rcu -I../lib/rcu -Ilib/bitratestats -I../lib/bitratestats -Ilib/bpf -I../lib/bpf -Ilib/cfgfile -I../lib/cfgfile -Ilib/compressdev -I../lib/compressdev -Ilib/cryptodev -I../lib/cryptodev -Ilib/security -I../lib/security -Ilib/dispatcher -I../lib/dispatcher -Ilib/eventdev -I../lib/eventdev -Ilib/timer -I../lib/timer -Ilib/dmadev -I../lib/dmadev -Ilib/distributor -I../lib/distributor -Ilib/efd -I../lib/efd -Ilib/fib -I../lib/fib -Ilib/rib -I../lib/rib -Ilib/table -I../lib/table -Ilib/lpm -I../lib/lpm -Ilib/graph -I../lib/graph -Ilib/pcapng -I../lib/pcapng -Ilib/ip_frag -I../lib/ip_frag -Ilib/ipsec -I../lib/ipsec -Ilib/latencystats -I../lib/latencystats -Idrivers/net/bonding -I../drivers/net/bonding -Ilib/sched -I../lib/sched -Idrivers/net/null -I../drivers/net/null -Ilib/member -I../lib/member -Ilib/pdcp -I../lib/pdcp -Ilib/reorder -I../lib/reorder -Ilib/pdump -I../lib/pdump -Idrivers/net/af_packet -I../drivers/net/af_packet -Idrivers/net/tap -I../drivers/net/tap -Ilib/gso -I../lib/gso -Ilib/pmu -I../lib/pmu -Ilib/power -I../lib/power -Idrivers/power/acpi -I../drivers/power/acpi -Idrivers/power/kvm_vm -I../drivers/power/kvm_vm -Idrivers/power/intel_pstate -I../drivers/power/intel_pstate -Idrivers/power/amd_pstate -I../drivers/power/amd_pstate -Idrivers/power/cppc -I../drivers/power/cppc -Idrivers/power/intel_uncore -I../drivers/power/intel_uncore -Ilib/ptr_compress -I../lib/ptr_compress -Ilib/rawdev -I../lib/rawdev -Idrivers/raw/skeleton -I../drivers/raw/skeleton -Ilib/stack -I../lib/stack -Idrivers/crypto/scheduler -I../drivers/crypto/scheduler -Iapp/test/test_cfgfiles -fdiagnostics-color=always -D_FILE_OFFSET_BITS=64 -Wall -Winvalid-pch -Wextra -Werror -std=c11 -O3 -include rte_config.h -Wvla -Wcast-qual -Wcomma -Wdeprecated -Wformat -Wformat-nonliteral -Wformat-security -Wmissing-declarations -Wmissing-prototypes -Wnested-externs -Wold-style-definition -Wpointer-arith -Wshadow -Wsign-compare -Wstrict-prototypes -Wundef -Wwrite-strings -Wno-missing-field-initializers -D_GNU_SOURCE -march=native -mrtm -DALLOW_EXPERIMENTAL_API -Wno-vla -Wno-shadow -fno-strict-aliasing -DALLOW_INTERNAL_API -MD -MQ app/dpdk-test.p/test_test_cryptodev_asym.c.o -MF app/dpdk-test.p/test_test_cryptodev_asym.c.o.d -o app/dpdk-test.p/test_test_cryptodev_asym.c.o -c ../app/test/test_cryptodev_asym.c
../app/test/test_cryptodev_asym.c:691:28: error: assigning to 'uint8_t *' (aka 'unsigned char *') from 'const uint8_t[4096]' (aka 'const unsigned char[4096]') discards qualifiers [-Werror,-Wincompatible-pointer-types-discards-qualifiers]
691 | asym_op->rsa.message.data = rsa_pss_digest_sha256.data;
| ^ ~~~~~~~~~~~~~~~~~~~~~~~~~~
1 error generated.
[3313/3646] Compiling C object app/dpdk-test.p/test_test_crc.c.o
[3314/3646] Compiling C object app/dpdk-test.p/test_test_cryptodev_security_pdcp.c.o
[3315/3646] Compiling C object app/dpdk-test.p/test_test_cycles.c.o
[3316/3646] Compiling C object app/dpdk-test.p/test_test_cryptodev_security_tls_record.c.o
[3317/3646] Compiling C object app/dpdk-test.p/test_test_cryptodev_security_ipsec.c.o
[3318/3646] Compiling C object app/dpdk-test.p/test_test_cryptodev_blockcipher.c.o
[3319/3646] Compiling C object app/dpdk-test.p/test_test_cryptodev_crosscheck.c.o
[3320/3646] Compiling C object app/dpdk-test.p/test_test_compressdev.c.o
[3321/3646] Compiling C object app/dpdk-test.p/test_test_cryptodev.c.o
ninja: build stopped
*Build Failed #8:
OS: RHEL9.8-64
Target: x86_64-native-linuxapp-gcc+shared
FAILED: app/dpdk-test.p/test_test_cryptodev_asym.c.o
gcc -Iapp/dpdk-test.p -Iapp -I../app -Ilib/cmdline -I../lib/cmdline -Ilib/eal/common -I../lib/eal/common -I. -I.. -Iconfig -I../config -Ilib/eal/include -I../lib/eal/include -Ilib/eal/linux/include -I../lib/eal/linux/include -Ilib/eal/x86/include -I../lib/eal/x86/include -I../kernel/linux -Ilib/eal -I../lib/eal -Ilib/kvargs -I../lib/kvargs -Ilib/log -I../lib/log -Ilib/metrics -I../lib/metrics -Ilib/telemetry -I../lib/telemetry -Ilib/argparse -I../lib/argparse -Ilib/net -I../lib/net -Ilib/mbuf -I../lib/mbuf -Ilib/mempool -I../lib/mempool -Ilib/ring -I../lib/ring -Idrivers/net/ring -I../drivers/net/ring -Ilib/ethdev -I../lib/ethdev -Ilib/meter -I../lib/meter -Idrivers/bus/pci -I../drivers/bus/pci -I../drivers/bus/pci/linux -Ilib/pci -I../lib/pci -Idrivers/bus/vdev -I../drivers/bus/vdev -Ilib/acl -I../lib/acl -Ilib/hash -I../lib/hash -Ilib/rcu -I../lib/rcu -Ilib/bitratestats -I../lib/bitratestats -Ilib/bpf -I../lib/bpf -Ilib/cfgfile -I../lib/cfgfile -Ilib/compressdev -I../lib/compressdev -Ilib/cryptodev -I../lib/cryptodev -Ilib/security -I../lib/security -Ilib/dispatcher -I../lib/dispatcher -Ilib/eventdev -I../lib/eventdev -Ilib/timer -I../lib/timer -Ilib/dmadev -I../lib/dmadev -Ilib/distributor -I../lib/distributor -Ilib/efd -I../lib/efd -Ilib/fib -I../lib/fib -Ilib/rib -I../lib/rib -Ilib/table -I../lib/table -Ilib/lpm -I../lib/lpm -Ilib/graph -I../lib/graph -Ilib/pcapng -I../lib/pcapng -Ilib/ip_frag -I../lib/ip_frag -Ilib/ipsec -I../lib/ipsec -Ilib/latencystats -I../lib/latencystats -Idrivers/net/bonding -I../drivers/net/bonding -Ilib/sched -I../lib/sched -Idrivers/net/null -I../drivers/net/null -Ilib/member -I../lib/member -Ilib/pdcp -I../lib/pdcp -Ilib/reorder -I../lib/reorder -Ilib/pdump -I../lib/pdump -Idrivers/net/af_packet -I../drivers/net/af_packet -Idrivers/net/tap -I../drivers/net/tap -Ilib/gso -I../lib/gso -Ilib/pmu -I../lib/pmu -Ilib/power -I../lib/power -Idrivers/power/acpi -I../drivers/power/acpi -Idrivers/power/kvm_vm -I../drivers/power/kvm_vm -Idrivers/power/intel_pstate -I../drivers/power/intel_pstate -Idrivers/power/amd_pstate -I../drivers/power/amd_pstate -Idrivers/power/cppc -I../drivers/power/cppc -Idrivers/power/intel_uncore -I../drivers/power/intel_uncore -Ilib/ptr_compress -I../lib/ptr_compress -Ilib/rawdev -I../lib/rawdev -Idrivers/raw/skeleton -I../drivers/raw/skeleton -Ilib/stack -I../lib/stack -Idrivers/crypto/scheduler -I../drivers/crypto/scheduler -Iapp/test/test_cfgfiles -fdiagnostics-color=always -D_FILE_OFFSET_BITS=64 -Wall -Winvalid-pch -Wextra -Werror -std=c11 -O3 -include rte_config.h -Wvla -Wcast-qual -Wdeprecated -Wformat -Wformat-nonliteral -Wformat-security -Wmissing-declarations -Wmissing-prototypes -Wnested-externs -Wold-style-definition -Wpointer-arith -Wshadow -Wsign-compare -Wstrict-prototypes -Wundef -Wwrite-strings -Wno-packed-not-aligned -Wno-missing-field-initializers -D_GNU_SOURCE -march=native -mrtm -DALLOW_EXPERIMENTAL_API -Wno-vla -Wno-shadow -fno-strict-aliasing -DALLOW_INTERNAL_API -MD -MQ app/dpdk-test.p/test_test_cryptodev_asym.c.o -MF app/dpdk-test.p/test_test_cryptodev_asym.c.o.d -o app/dpdk-test.p/test_test_cryptodev_asym.c.o -c ../app/test/test_cryptodev_asym.c
../app/test/test_cryptodev_asym.c: In function ‘queue_ops_rsa_pss_sign_verify’:
../app/test/test_cryptodev_asym.c:691:35: error: assignment discards ‘const’ qualifier from pointer target type [-Werror=discarded-qualifiers]
691 | asym_op->rsa.message.data = rsa_pss_digest_sha256.data;
| ^
cc1: all warnings being treated as errors
[3360/3499] Compiling C object app/dpdk-test.p/test_test_eal_flags.c.o
[3361/3499] Compiling C object app/dpdk-test.p/test_test_ethdev_api.c.o
[3362/3499] Compiling C object app/dpdk-test.p/test_test_ethdev_link.c.o
[3363/3499] Compiling C object app/dpdk-test.p/test_test_efd_perf.c.o
[3364/3499] Compiling C object app/dpdk-test.p/test_test_distributor.c.o
[3365/3499] Compiling C object app/dpdk-test.p/test_test_efd.c.o
[3366/3499] Compiling C object app/dpdk-test.p/test_test_cryptodev_blockcipher.c.o
[3367/3499] Compiling C object app/dpdk-test.p/test_test_dmadev.c.o
[3368/3499] Compiling C object app/dpdk-test.p/test_test_cryptodev.c.o
ninja: build stopped
*Build Failed #9:
OS: RHEL9.8-64
Target: x86_64-native-linuxapp-gcc+debug
FAILED: app/dpdk-test.p/test_test_cryptodev_asym.c.o
gcc -Iapp/dpdk-test.p -Iapp -I../app -Ilib/cmdline -I../lib/cmdline -Ilib/eal/common -I../lib/eal/common -I. -I.. -Iconfig -I../config -Ilib/eal/include -I../lib/eal/include -Ilib/eal/linux/include -I../lib/eal/linux/include -Ilib/eal/x86/include -I../lib/eal/x86/include -I../kernel/linux -Ilib/eal -I../lib/eal -Ilib/kvargs -I../lib/kvargs -Ilib/log -I../lib/log -Ilib/metrics -I../lib/metrics -Ilib/telemetry -I../lib/telemetry -Ilib/argparse -I../lib/argparse -Ilib/net -I../lib/net -Ilib/mbuf -I../lib/mbuf -Ilib/mempool -I../lib/mempool -Ilib/ring -I../lib/ring -Idrivers/net/ring -I../drivers/net/ring -Ilib/ethdev -I../lib/ethdev -Ilib/meter -I../lib/meter -Idrivers/bus/pci -I../drivers/bus/pci -I../drivers/bus/pci/linux -Ilib/pci -I../lib/pci -Idrivers/bus/vdev -I../drivers/bus/vdev -Ilib/acl -I../lib/acl -Ilib/hash -I../lib/hash -Ilib/rcu -I../lib/rcu -Ilib/bitratestats -I../lib/bitratestats -Ilib/bpf -I../lib/bpf -Ilib/cfgfile -I../lib/cfgfile -Ilib/compressdev -I../lib/compressdev -Ilib/cryptodev -I../lib/cryptodev -Ilib/security -I../lib/security -Ilib/dispatcher -I../lib/dispatcher -Ilib/eventdev -I../lib/eventdev -Ilib/timer -I../lib/timer -Ilib/dmadev -I../lib/dmadev -Ilib/distributor -I../lib/distributor -Ilib/efd -I../lib/efd -Ilib/fib -I../lib/fib -Ilib/rib -I../lib/rib -Ilib/table -I../lib/table -Ilib/lpm -I../lib/lpm -Ilib/graph -I../lib/graph -Ilib/pcapng -I../lib/pcapng -Ilib/ip_frag -I../lib/ip_frag -Ilib/ipsec -I../lib/ipsec -Ilib/latencystats -I../lib/latencystats -Idrivers/net/bonding -I../drivers/net/bonding -Ilib/sched -I../lib/sched -Idrivers/net/null -I../drivers/net/null -Ilib/member -I../lib/member -Ilib/pdcp -I../lib/pdcp -Ilib/reorder -I../lib/reorder -Ilib/pdump -I../lib/pdump -Idrivers/net/af_packet -I../drivers/net/af_packet -Idrivers/net/tap -I../drivers/net/tap -Ilib/gso -I../lib/gso -Ilib/pmu -I../lib/pmu -Ilib/power -I../lib/power -Idrivers/power/acpi -I../drivers/power/acpi -Idrivers/power/kvm_vm -I../drivers/power/kvm_vm -Idrivers/power/intel_pstate -I../drivers/power/intel_pstate -Idrivers/power/amd_pstate -I../drivers/power/amd_pstate -Idrivers/power/cppc -I../drivers/power/cppc -Idrivers/power/intel_uncore -I../drivers/power/intel_uncore -Ilib/ptr_compress -I../lib/ptr_compress -Ilib/rawdev -I../lib/rawdev -Idrivers/raw/skeleton -I../drivers/raw/skeleton -Ilib/stack -I../lib/stack -Idrivers/crypto/scheduler -I../drivers/crypto/scheduler -Iapp/test/test_cfgfiles -fdiagnostics-color=always -D_FILE_OFFSET_BITS=64 -Wall -Winvalid-pch -Wextra -Werror -std=c11 -O2 -g -include rte_config.h -Wvla -Wcast-qual -Wdeprecated -Wformat -Wformat-nonliteral -Wformat-security -Wmissing-declarations -Wmissing-prototypes -Wnested-externs -Wold-style-definition -Wpointer-arith -Wshadow -Wsign-compare -Wstrict-prototypes -Wundef -Wwrite-strings -Wno-packed-not-aligned -Wno-missing-field-initializers -D_GNU_SOURCE -march=native -mrtm -DALLOW_EXPERIMENTAL_API -Wno-vla -Wno-shadow -fno-strict-aliasing -DALLOW_INTERNAL_API -MD -MQ app/dpdk-test.p/test_test_cryptodev_asym.c.o -MF app/dpdk-test.p/test_test_cryptodev_asym.c.o.d -o app/dpdk-test.p/test_test_cryptodev_asym.c.o -c ../app/test/test_cryptodev_asym.c
../app/test/test_cryptodev_asym.c: In function ‘queue_ops_rsa_pss_sign_verify’:
../app/test/test_cryptodev_asym.c:691:35: error: assignment discards ‘const’ qualifier from pointer target type [-Werror=discarded-qualifiers]
691 | asym_op->rsa.message.data = rsa_pss_digest_sha256.data;
| ^
cc1: all warnings being treated as errors
[3327/3646] Compiling C object app/dpdk-test.p/test_test_errno.c.o
[3328/3646] Compiling C object app/dpdk-test.p/test_test_distributor_perf.c.o
[3329/3646] Compiling C object app/dpdk-test.p/test_test_dmadev_api.c.o
[3330/3646] Compiling C object app/dpdk-test.p/test_test_eal_flags.c.o
[3331/3646] Compiling C object app/dpdk-test.p/test_test_efd.c.o
[3332/3646] Compiling C object app/dpdk-test.p/test_test_efd_perf.c.o
[3333/3646] Compiling C object app/dpdk-test.p/test_test_dmadev.c.o
[3334/3646] Compiling C object app/dpdk-test.p/test_test_distributor.c.o
[3335/3646] Compiling C object app/dpdk-test.p/test_test_cryptodev.c.o
ninja: build stopped
*Build Failed #10:
OS: SUSE16-64
Target: x86_64-native-linuxapp-clang
FAILED: app/dpdk-test.p/test_test_cryptodev_asym.c.o
clang -Iapp/dpdk-test.p -Iapp -I../app -Ilib/cmdline -I../lib/cmdline -Ilib/eal/common -I../lib/eal/common -I. -I.. -Iconfig -I../config -Ilib/eal/include -I../lib/eal/include -Ilib/eal/linux/include -I../lib/eal/linux/include -Ilib/eal/x86/include -I../lib/eal/x86/include -I../kernel/linux -Ilib/eal -I../lib/eal -Ilib/kvargs -I../lib/kvargs -Ilib/log -I../lib/log -Ilib/metrics -I../lib/metrics -Ilib/telemetry -I../lib/telemetry -Ilib/argparse -I../lib/argparse -Ilib/net -I../lib/net -Ilib/mbuf -I../lib/mbuf -Ilib/mempool -I../lib/mempool -Ilib/ring -I../lib/ring -Idrivers/net/ring -I../drivers/net/ring -Ilib/ethdev -I../lib/ethdev -Ilib/meter -I../lib/meter -Idrivers/bus/pci -I../drivers/bus/pci -I../drivers/bus/pci/linux -Ilib/pci -I../lib/pci -Idrivers/bus/vdev -I../drivers/bus/vdev -Ilib/acl -I../lib/acl -Ilib/hash -I../lib/hash -Ilib/rcu -I../lib/rcu -Ilib/bitratestats -I../lib/bitratestats -Ilib/bpf -I../lib/bpf -Ilib/cfgfile -I../lib/cfgfile -Ilib/compressdev -I../lib/compressdev -Ilib/cryptodev -I../lib/cryptodev -Ilib/security -I../lib/security -Ilib/dispatcher -I../lib/dispatcher -Ilib/eventdev -I../lib/eventdev -Ilib/timer -I../lib/timer -Ilib/dmadev -I../lib/dmadev -Ilib/distributor -I../lib/distributor -Ilib/efd -I../lib/efd -Ilib/fib -I../lib/fib -Ilib/rib -I../lib/rib -Ilib/table -I../lib/table -Ilib/lpm -I../lib/lpm -Ilib/graph -I../lib/graph -Ilib/pcapng -I../lib/pcapng -Ilib/ip_frag -I../lib/ip_frag -Ilib/ipsec -I../lib/ipsec -Ilib/latencystats -I../lib/latencystats -Idrivers/net/bonding -I../drivers/net/bonding -Ilib/sched -I../lib/sched -Idrivers/net/null -I../drivers/net/null -Ilib/member -I../lib/member -Ilib/pdcp -I../lib/pdcp -Ilib/reorder -I../lib/reorder -Ilib/pdump -I../lib/pdump -Idrivers/net/af_packet -I../drivers/net/af_packet -Idrivers/net/tap -I../drivers/net/tap -Ilib/gso -I../lib/gso -Ilib/pmu -I../lib/pmu -Ilib/power -I../lib/power -Idrivers/power/acpi -I../drivers/power/acpi -Idrivers/power/kvm_vm -I../drivers/power/kvm_vm -Idrivers/power/intel_pstate -I../drivers/power/intel_pstate -Idrivers/power/amd_pstate -I../drivers/power/amd_pstate -Idrivers/power/cppc -I../drivers/power/cppc -Idrivers/power/intel_uncore -I../drivers/power/intel_uncore -Ilib/ptr_compress -I../lib/ptr_compress -Ilib/rawdev -I../lib/rawdev -Idrivers/raw/skeleton -I../drivers/raw/skeleton -Ilib/stack -I../lib/stack -Idrivers/crypto/scheduler -I../drivers/crypto/scheduler -Iapp/test/bpf -Iapp/test/test_cfgfiles -fdiagnostics-color=always -D_FILE_OFFSET_BITS=64 -Wall -Winvalid-pch -Wextra -Werror -std=c11 -O3 -include rte_config.h -Wvla -Wcast-qual -Wcomma -Wdeprecated -Wformat -Wformat-nonliteral -Wformat-security -Wmissing-declarations -Wmissing-prototypes -Wnested-externs -Wold-style-definition -Wpointer-arith -Wshadow -Wsign-compare -Wstrict-prototypes -Wundef -Wwrite-strings -Wno-missing-field-initializers -D_GNU_SOURCE -march=native -mrtm -DALLOW_EXPERIMENTAL_API -Wno-vla -Wno-shadow -fno-strict-aliasing -DALLOW_INTERNAL_API -DTEST_BPF_ELF_LOAD -MD -MQ app/dpdk-test.p/test_test_cryptodev_asym.c.o -MF app/dpdk-test.p/test_test_cryptodev_asym.c.o.d -o app/dpdk-test.p/test_test_cryptodev_asym.c.o -c ../app/test/test_cryptodev_asym.c
../app/test/test_cryptodev_asym.c:691:28: error: assigning to 'uint8_t *' (aka 'unsigned char *') from 'const uint8_t[4096]' (aka 'const unsigned char[4096]') discards qualifiers [-Werror,-Wincompatible-pointer-types-discards-qualifiers]
691 | asym_op->rsa.message.data = rsa_pss_digest_sha256.data;
| ^ ~~~~~~~~~~~~~~~~~~~~~~~~~~
1 error generated.
[3278/3605] Compiling C object app/dpdk-test.p/test_test_compressdev.c.o
[3279/3605] Compiling C object app/dpdk-test.p/test_test_cryptodev_security_ipsec.c.o
[3280/3605] Compiling C object app/dpdk-test.p/test_test_cryptodev_security_pdcp.c.o
[3281/3605] Compiling C object app/dpdk-test.p/test_test_cryptodev_security_tls_record.c.o
[3282/3605] Compiling C object app/dpdk-test.p/test_test_cryptodev_crosscheck.c.o
[3283/3605] Compiling C object app/dpdk-test.p/test_test_devargs.c.o
[3284/3605] Compiling C object app/dpdk-test.p/test_test_cryptodev_blockcipher.c.o
[3285/3605] Compiling C object app/dpdk-test.p/test_test_dispatcher.c.o
[3286/3605] Compiling C object app/dpdk-test.p/test_test_cryptodev.c.o
ninja: build stopped
*Build Failed #11:
OS: SUSE16-64
Target: x86_64-native-linuxapp-gcc
FAILED: app/dpdk-test.p/test_test_cryptodev_asym.c.o
gcc -Iapp/dpdk-test.p -Iapp -I../app -Ilib/cmdline -I../lib/cmdline -Ilib/eal/common -I../lib/eal/common -I. -I.. -Iconfig -I../config -Ilib/eal/include -I../lib/eal/include -Ilib/eal/linux/include -I../lib/eal/linux/include -Ilib/eal/x86/include -I../lib/eal/x86/include -I../kernel/linux -Ilib/eal -I../lib/eal -Ilib/kvargs -I../lib/kvargs -Ilib/log -I../lib/log -Ilib/metrics -I../lib/metrics -Ilib/telemetry -I../lib/telemetry -Ilib/argparse -I../lib/argparse -Ilib/net -I../lib/net -Ilib/mbuf -I../lib/mbuf -Ilib/mempool -I../lib/mempool -Ilib/ring -I../lib/ring -Idrivers/net/ring -I../drivers/net/ring -Ilib/ethdev -I../lib/ethdev -Ilib/meter -I../lib/meter -Idrivers/bus/pci -I../drivers/bus/pci -I../drivers/bus/pci/linux -Ilib/pci -I../lib/pci -Idrivers/bus/vdev -I../drivers/bus/vdev -Ilib/acl -I../lib/acl -Ilib/hash -I../lib/hash -Ilib/rcu -I../lib/rcu -Ilib/bitratestats -I../lib/bitratestats -Ilib/bpf -I../lib/bpf -Ilib/cfgfile -I../lib/cfgfile -Ilib/compressdev -I../lib/compressdev -Ilib/cryptodev -I../lib/cryptodev -Ilib/security -I../lib/security -Ilib/dispatcher -I../lib/dispatcher -Ilib/eventdev -I../lib/eventdev -Ilib/timer -I../lib/timer -Ilib/dmadev -I../lib/dmadev -Ilib/distributor -I../lib/distributor -Ilib/efd -I../lib/efd -Ilib/fib -I../lib/fib -Ilib/rib -I../lib/rib -Ilib/table -I../lib/table -Ilib/lpm -I../lib/lpm -Ilib/graph -I../lib/graph -Ilib/pcapng -I../lib/pcapng -Ilib/ip_frag -I../lib/ip_frag -Ilib/ipsec -I../lib/ipsec -Ilib/latencystats -I../lib/latencystats -Idrivers/net/bonding -I../drivers/net/bonding -Ilib/sched -I../lib/sched -Idrivers/net/null -I../drivers/net/null -Ilib/member -I../lib/member -Ilib/pdcp -I../lib/pdcp -Ilib/reorder -I../lib/reorder -Ilib/pdump -I../lib/pdump -Idrivers/net/af_packet -I../drivers/net/af_packet -Idrivers/net/tap -I../drivers/net/tap -Ilib/gso -I../lib/gso -Ilib/pmu -I../lib/pmu -Ilib/power -I../lib/power -Idrivers/power/acpi -I../drivers/power/acpi -Idrivers/power/kvm_vm -I../drivers/power/kvm_vm -Idrivers/power/intel_pstate -I../drivers/power/intel_pstate -Idrivers/power/amd_pstate -I../drivers/power/amd_pstate -Idrivers/power/cppc -I../drivers/power/cppc -Idrivers/power/intel_uncore -I../drivers/power/intel_uncore -Ilib/ptr_compress -I../lib/ptr_compress -Ilib/rawdev -I../lib/rawdev -Idrivers/raw/skeleton -I../drivers/raw/skeleton -Ilib/stack -I../lib/stack -Idrivers/crypto/scheduler -I../drivers/crypto/scheduler -Iapp/test/bpf -Iapp/test/test_cfgfiles -fdiagnostics-color=always -D_FILE_OFFSET_BITS=64 -Wall -Winvalid-pch -Wextra -Werror -std=c11 -O3 -include rte_config.h -Wvla -Wcast-qual -Wdeprecated -Wformat -Wformat-nonliteral -Wformat-security -Wmissing-declarations -Wmissing-prototypes -Wnested-externs -Wold-style-definition -Wpointer-arith -Wshadow -Wsign-compare -Wstrict-prototypes -Wundef -Wwrite-strings -Wno-packed-not-aligned -Wno-missing-field-initializers -fzero-init-padding-bits=all -D_GNU_SOURCE -march=native -mrtm -DALLOW_EXPERIMENTAL_API -Wno-vla -Wno-shadow -fno-strict-aliasing -DALLOW_INTERNAL_API -DTEST_BPF_ELF_LOAD -MD -MQ app/dpdk-test.p/test_test_cryptodev_asym.c.o -MF app/dpdk-test.p/test_test_cryptodev_asym.c.o.d -o app/dpdk-test.p/test_test_cryptodev_asym.c.o -c ../app/test/test_cryptodev_asym.c
../app/test/test_cryptodev_asym.c: In function ‘queue_ops_rsa_pss_sign_verify’:
../app/test/test_cryptodev_asym.c:691:35: error: assignment discards ‘const’ qualifier from pointer target type [-Werror=discarded-qualifiers]
691 | asym_op->rsa.message.data = rsa_pss_digest_sha256.data;
| ^
cc1: all warnings being treated as errors
[3290/3605] Compiling C object app/dpdk-test.p/test_test_eal_flags.c.o
[3291/3605] Compiling C object app/dpdk-test.p/test_test_dmadev_api.c.o
[3292/3605] Compiling C object app/dpdk-test.p/test_test_efd.c.o
[3293/3605] Compiling C object app/dpdk-test.p/test_test_ethdev_api.c.o
[3294/3605] Compiling C object app/dpdk-test.p/test_test_ethdev_link.c.o
[3295/3605] Compiling C object app/dpdk-test.p/test_test_efd_perf.c.o
[3296/3605] Compiling C object app/dpdk-test.p/test_test_distributor.c.o
[3297/3605] Compiling C object app/dpdk-test.p/test_test_dmadev.c.o
[3298/3605] Compiling C object app/dpdk-test.p/test_test_cryptodev.c.o
ninja: build stopped
*Build Failed #12:
OS: AzureLinux4.0-64
Target: x86_64-native-linuxapp-gcc
FAILED: app/dpdk-test.p/test_test_cryptodev_asym.c.o
gcc -Iapp/dpdk-test.p -Iapp -I../app -Ilib/cmdline -I../lib/cmdline -Ilib/eal/common -I../lib/eal/common -I. -I.. -Iconfig -I../config -Ilib/eal/include -I../lib/eal/include -Ilib/eal/linux/include -I../lib/eal/linux/include -Ilib/eal/x86/include -I../lib/eal/x86/include -I../kernel/linux -Ilib/eal -I../lib/eal -Ilib/kvargs -I../lib/kvargs -Ilib/log -I../lib/log -Ilib/metrics -I../lib/metrics -Ilib/telemetry -I../lib/telemetry -Ilib/argparse -I../lib/argparse -Ilib/net -I../lib/net -Ilib/mbuf -I../lib/mbuf -Ilib/mempool -I../lib/mempool -Ilib/ring -I../lib/ring -Idrivers/net/ring -I../drivers/net/ring -Ilib/ethdev -I../lib/ethdev -Ilib/meter -I../lib/meter -Idrivers/bus/pci -I../drivers/bus/pci -I../drivers/bus/pci/linux -Ilib/pci -I../lib/pci -Idrivers/bus/vdev -I../drivers/bus/vdev -Ilib/acl -I../lib/acl -Ilib/hash -I../lib/hash -Ilib/rcu -I../lib/rcu -Ilib/bitratestats -I../lib/bitratestats -Ilib/bpf -I../lib/bpf -Ilib/cfgfile -I../lib/cfgfile -Ilib/compressdev -I../lib/compressdev -Ilib/cryptodev -I../lib/cryptodev -Ilib/security -I../lib/security -Ilib/dispatcher -I../lib/dispatcher -Ilib/eventdev -I../lib/eventdev -Ilib/timer -I../lib/timer -Ilib/dmadev -I../lib/dmadev -Ilib/distributor -I../lib/distributor -Ilib/efd -I../lib/efd -Ilib/fib -I../lib/fib -Ilib/rib -I../lib/rib -Ilib/table -I../lib/table -Ilib/lpm -I../lib/lpm -Ilib/graph -I../lib/graph -Ilib/pcapng -I../lib/pcapng -Ilib/ip_frag -I../lib/ip_frag -Ilib/ipsec -I../lib/ipsec -Ilib/latencystats -I../lib/latencystats -Idrivers/net/bonding -I../drivers/net/bonding -Ilib/sched -I../lib/sched -Idrivers/net/null -I../drivers/net/null -Ilib/member -I../lib/member -Ilib/pdcp -I../lib/pdcp -Ilib/reorder -I../lib/reorder -Ilib/pdump -I../lib/pdump -Idrivers/net/af_packet -I../drivers/net/af_packet -Idrivers/net/tap -I../drivers/net/tap -Ilib/gso -I../lib/gso -Ilib/pmu -I../lib/pmu -Ilib/power -I../lib/power -Idrivers/power/acpi -I../drivers/power/acpi -Idrivers/power/kvm_vm -I../drivers/power/kvm_vm -Idrivers/power/intel_pstate -I../drivers/power/intel_pstate -Idrivers/power/amd_pstate -I../drivers/power/amd_pstate -Idrivers/power/cppc -I../drivers/power/cppc -Idrivers/power/intel_uncore -I../drivers/power/intel_uncore -Ilib/ptr_compress -I../lib/ptr_compress -Ilib/rawdev -I../lib/rawdev -Idrivers/raw/skeleton -I../drivers/raw/skeleton -Ilib/stack -I../lib/stack -Idrivers/crypto/scheduler -I../drivers/crypto/scheduler -Iapp/test/test_cfgfiles -fdiagnostics-color=always -D_FILE_OFFSET_BITS=64 -Wall -Winvalid-pch -Wextra -Werror -std=c11 -O3 -include rte_config.h -Wvla -Wcast-qual -Wdeprecated -Wformat -Wformat-nonliteral -Wformat-security -Wmissing-declarations -Wmissing-prototypes -Wnested-externs -Wold-style-definition -Wpointer-arith -Wshadow -Wsign-compare -Wstrict-prototypes -Wundef -Wwrite-strings -Wno-packed-not-aligned -Wno-missing-field-initializers -fzero-init-padding-bits=all -D_GNU_SOURCE -DWITH_GZFILEOP -march=native -mrtm -DALLOW_EXPERIMENTAL_API -Wno-vla -Wno-shadow -fno-strict-aliasing -DALLOW_INTERNAL_API -MD -MQ app/dpdk-test.p/test_test_cryptodev_asym.c.o -MF app/dpdk-test.p/test_test_cryptodev_asym.c.o.d -o app/dpdk-test.p/test_test_cryptodev_asym.c.o -c ../app/test/test_cryptodev_asym.c
../app/test/test_cryptodev_asym.c: In function ‘queue_ops_rsa_pss_sign_verify’:
../app/test/test_cryptodev_asym.c:691:35: error: assignment discards ‘const’ qualifier from pointer target type [-Werror=discarded-qualifiers]
691 | asym_op->rsa.message.data = rsa_pss_digest_sha256.data;
| ^
cc1: all warnings being treated as errors
[3302/3623] Compiling C object app/dpdk-test.p/test_test_compressdev.c.o
[3303/3623] Compiling C object app/dpdk-test.p/test_test_eal_flags.c.o
[3304/3623] Compiling C object app/dpdk-test.p/test_test_errno.c.o
[3305/3623] Compiling C object app/dpdk-test.p/test_test_dmadev_api.c.o
[3306/3623] Compiling C object app/dpdk-test.p/test_test_efd.c.o
[3307/3623] Compiling C object app/dpdk-test.p/test_test_efd_perf.c.o
[3308/3623] Compiling C object app/dpdk-test.p/test_test_dmadev.c.o
[3309/3623] Compiling C object app/dpdk-test.p/test_test_distributor.c.o
[3310/3623] Compiling C object app/dpdk-test.p/test_test_cryptodev.c.o
ninja: build stopped
*Build Failed #13:
OS: UB2604-32
Target: i686-native-linuxapp-gcc
FAILED: app/dpdk-test.p/test_test_cryptodev_asym.c.o
gcc -Iapp/dpdk-test.p -Iapp -I../app -Ilib/cmdline -I../lib/cmdline -Ilib/eal/common -I../lib/eal/common -I. -I.. -Iconfig -I../config -Ilib/eal/include -I../lib/eal/include -Ilib/eal/linux/include -I../lib/eal/linux/include -Ilib/eal/x86/include -I../lib/eal/x86/include -I../kernel/linux -Ilib/eal -I../lib/eal -Ilib/kvargs -I../lib/kvargs -Ilib/log -I../lib/log -Ilib/metrics -I../lib/metrics -Ilib/telemetry -I../lib/telemetry -Ilib/argparse -I../lib/argparse -Ilib/net -I../lib/net -Ilib/mbuf -I../lib/mbuf -Ilib/mempool -I../lib/mempool -Ilib/ring -I../lib/ring -Idrivers/net/ring -I../drivers/net/ring -Ilib/ethdev -I../lib/ethdev -Ilib/meter -I../lib/meter -Idrivers/bus/pci -I../drivers/bus/pci -I../drivers/bus/pci/linux -Ilib/pci -I../lib/pci -Idrivers/bus/vdev -I../drivers/bus/vdev -Ilib/acl -I../lib/acl -Ilib/hash -I../lib/hash -Ilib/rcu -I../lib/rcu -Ilib/bitratestats -I../lib/bitratestats -Ilib/cfgfile -I../lib/cfgfile -Ilib/compressdev -I../lib/compressdev -Ilib/cryptodev -I../lib/cryptodev -Ilib/security -I../lib/security -Ilib/dispatcher -I../lib/dispatcher -Ilib/eventdev -I../lib/eventdev -Ilib/timer -I../lib/timer -Ilib/dmadev -I../lib/dmadev -Ilib/distributor -I../lib/distributor -Ilib/efd -I../lib/efd -Ilib/fib -I../lib/fib -Ilib/rib -I../lib/rib -Ilib/table -I../lib/table -Ilib/lpm -I../lib/lpm -Ilib/graph -I../lib/graph -Ilib/pcapng -I../lib/pcapng -Ilib/ip_frag -I../lib/ip_frag -Ilib/ipsec -I../lib/ipsec -Ilib/latencystats -I../lib/latencystats -Idrivers/net/bonding -I../drivers/net/bonding -Ilib/sched -I../lib/sched -Idrivers/net/null -I../drivers/net/null -Ilib/member -I../lib/member -Ilib/pdcp -I../lib/pdcp -Ilib/reorder -I../lib/reorder -Idrivers/net/af_packet -I../drivers/net/af_packet -Idrivers/net/pcap -I../drivers/net/pcap -Idrivers/net/tap -I../drivers/net/tap -Ilib/gso -I../lib/gso -Ilib/pmu -I../lib/pmu -Ilib/power -I../lib/power -Idrivers/power/acpi -I../drivers/power/acpi -Idrivers/power/kvm_vm -I../drivers/power/kvm_vm -Idrivers/power/intel_pstate -I../drivers/power/intel_pstate -Idrivers/power/amd_pstate -I../drivers/power/amd_pstate -Idrivers/power/cppc -I../drivers/power/cppc -Idrivers/power/intel_uncore -I../drivers/power/intel_uncore -Ilib/ptr_compress -I../lib/ptr_compress -Ilib/rawdev -I../lib/rawdev -Idrivers/raw/skeleton -I../drivers/raw/skeleton -Ilib/stack -I../lib/stack -Idrivers/crypto/scheduler -I../drivers/crypto/scheduler -Iapp/test/bpf -Iapp/test/test_cfgfiles -I/usr/include/dbus-1.0 -I/usr/lib/i386-linux-gnu/dbus-1.0/include -fdiagnostics-color=always -D_FILE_OFFSET_BITS=64 -Wall -Winvalid-pch -Wextra -Werror -std=c11 -O3 -include rte_config.h -Wvla -Wcast-qual -Wdeprecated -Wformat -Wformat-nonliteral -Wformat-security -Wmissing-declarations -Wmissing-prototypes -Wnested-externs -Wold-style-definition -Wpointer-arith -Wshadow -Wsign-compare -Wstrict-prototypes -Wundef -Wwrite-strings -Wno-packed-not-aligned -Wno-missing-field-initializers -fzero-init-padding-bits=all -Wno-pointer-to-int-cast -D_GNU_SOURCE -m32 -march=native -mrtm -DALLOW_EXPERIMENTAL_API -Wno-vla -Wno-shadow -fno-strict-aliasing -DALLOW_INTERNAL_API -DTEST_BPF_ELF_LOAD -MD -MQ app/dpdk-test.p/test_test_cryptodev_asym.c.o -MF app/dpdk-test.p/test_test_cryptodev_asym.c.o.d -o app/dpdk-test.p/test_test_cryptodev_asym.c.o -c ../app/test/test_cryptodev_asym.c
../app/test/test_cryptodev_asym.c: In function ‘queue_ops_rsa_pss_sign_verify’:
../app/test/test_cryptodev_asym.c:691:35: error: assignment discards ‘const’ qualifier from pointer target type [-Werror=discarded-qualifiers]
691 | asym_op->rsa.message.data = rsa_pss_digest_sha256.data;
| ^
cc1: all warnings being treated as errors
[2419/2740] Compiling C object app/dpdk-test.p/test_test_efd.c.o
[2420/2740] Compiling C object app/dpdk-test.p/test_test_efd_perf.c.o
[2421/2740] Compiling C object app/dpdk-test.p/test_test_ethdev_api.c.o
[2422/2740] Compiling C object app/dpdk-test.p/test_test_eal_flags.c.o
[2423/2740] Compiling C object app/dpdk-test.p/test_test_ethdev_link.c.o
[2424/2740] Compiling C object app/dpdk-test.p/test_test_dmadev.c.o
[2425/2740] Compiling C object app/dpdk-test.p/test_test_distributor.c.o
[2426/2740] Compiling C object app/dpdk-test.p/test_test_event_crypto_adapter.c.o
[2427/2740] Compiling C object app/dpdk-test.p/test_test_cryptodev.c.o
ninja: build stopped
*Build Failed #14:
OS: RHEL10.2-64
Target: x86_64-native-linuxapp-gcc
FAILED: app/dpdk-test.p/test_test_cryptodev_asym.c.o
gcc -Iapp/dpdk-test.p -Iapp -I../app -Ilib/cmdline -I../lib/cmdline -Ilib/eal/common -I../lib/eal/common -I. -I.. -Iconfig -I../config -Ilib/eal/include -I../lib/eal/include -Ilib/eal/linux/include -I../lib/eal/linux/include -Ilib/eal/x86/include -I../lib/eal/x86/include -I../kernel/linux -Ilib/eal -I../lib/eal -Ilib/kvargs -I../lib/kvargs -Ilib/log -I../lib/log -Ilib/metrics -I../lib/metrics -Ilib/telemetry -I../lib/telemetry -Ilib/argparse -I../lib/argparse -Ilib/net -I../lib/net -Ilib/mbuf -I../lib/mbuf -Ilib/mempool -I../lib/mempool -Ilib/ring -I../lib/ring -Idrivers/net/ring -I../drivers/net/ring -Ilib/ethdev -I../lib/ethdev -Ilib/meter -I../lib/meter -Idrivers/bus/pci -I../drivers/bus/pci -I../drivers/bus/pci/linux -Ilib/pci -I../lib/pci -Idrivers/bus/vdev -I../drivers/bus/vdev -Ilib/acl -I../lib/acl -Ilib/hash -I../lib/hash -Ilib/rcu -I../lib/rcu -Ilib/bitratestats -I../lib/bitratestats -Ilib/bpf -I../lib/bpf -Ilib/cfgfile -I../lib/cfgfile -Ilib/compressdev -I../lib/compressdev -Ilib/cryptodev -I../lib/cryptodev -Ilib/security -I../lib/security -Ilib/dispatcher -I../lib/dispatcher -Ilib/eventdev -I../lib/eventdev -Ilib/timer -I../lib/timer -Ilib/dmadev -I../lib/dmadev -Ilib/distributor -I../lib/distributor -Ilib/efd -I../lib/efd -Ilib/fib -I../lib/fib -Ilib/rib -I../lib/rib -Ilib/table -I../lib/table -Ilib/lpm -I../lib/lpm -Ilib/graph -I../lib/graph -Ilib/pcapng -I../lib/pcapng -Ilib/ip_frag -I../lib/ip_frag -Ilib/ipsec -I../lib/ipsec -Ilib/latencystats -I../lib/latencystats -Idrivers/net/bonding -I../drivers/net/bonding -Ilib/sched -I../lib/sched -Idrivers/net/null -I../drivers/net/null -Ilib/member -I../lib/member -Ilib/pdcp -I../lib/pdcp -Ilib/reorder -I../lib/reorder -Ilib/pdump -I../lib/pdump -Idrivers/net/af_packet -I../drivers/net/af_packet -Idrivers/net/tap -I../drivers/net/tap -Ilib/gso -I../lib/gso -Ilib/pmu -I../lib/pmu -Ilib/power -I../lib/power -Idrivers/power/acpi -I../drivers/power/acpi -Idrivers/power/kvm_vm -I../drivers/power/kvm_vm -Idrivers/power/intel_pstate -I../drivers/power/intel_pstate -Idrivers/power/amd_pstate -I../drivers/power/amd_pstate -Idrivers/power/cppc -I../drivers/power/cppc -Idrivers/power/intel_uncore -I../drivers/power/intel_uncore -Ilib/ptr_compress -I../lib/ptr_compress -Ilib/rawdev -I../lib/rawdev -Idrivers/raw/skeleton -I../drivers/raw/skeleton -Ilib/stack -I../lib/stack -Idrivers/crypto/scheduler -I../drivers/crypto/scheduler -Iapp/test/test_cfgfiles -fdiagnostics-color=always -D_FILE_OFFSET_BITS=64 -Wall -Winvalid-pch -Wextra -Werror -std=c11 -O3 -include rte_config.h -Wvla -Wcast-qual -Wdeprecated -Wformat -Wformat-nonliteral -Wformat-security -Wmissing-declarations -Wmissing-prototypes -Wnested-externs -Wold-style-definition -Wpointer-arith -Wshadow -Wsign-compare -Wstrict-prototypes -Wundef -Wwrite-strings -Wno-packed-not-aligned -Wno-missing-field-initializers -D_GNU_SOURCE -DWITH_GZFILEOP -march=native -mrtm -DALLOW_EXPERIMENTAL_API -Wno-vla -Wno-shadow -fno-strict-aliasing -DALLOW_INTERNAL_API -MD -MQ app/dpdk-test.p/test_test_cryptodev_asym.c.o -MF app/dpdk-test.p/test_test_cryptodev_asym.c.o.d -o app/dpdk-test.p/test_test_cryptodev_asym.c.o -c ../app/test/test_cryptodev_asym.c
../app/test/test_cryptodev_asym.c: In function ‘queue_ops_rsa_pss_sign_verify’:
../app/test/test_cryptodev_asym.c:691:35: error: assignment discards ‘const’ qualifier from pointer target type [-Werror=discarded-qualifiers]
691 | asym_op->rsa.message.data = rsa_pss_digest_sha256.data;
| ^
cc1: all warnings being treated as errors
[3304/3623] Compiling C object app/dpdk-test.p/test_test_efd_perf.c.o
[3305/3623] Compiling C object app/dpdk-test.p/test_test_efd.c.o
[3306/3623] Compiling C object app/dpdk-test.p/test_test_ethdev_api.c.o
[3307/3623] Compiling C object app/dpdk-test.p/test_test_ethdev_link.c.o
[3308/3623] Compiling C object app/dpdk-test.p/test_test_distributor.c.o
[3309/3623] Compiling C object app/dpdk-test.p/test_test_dmadev.c.o
[3310/3623] Compiling C object app/dpdk-test.p/test_test_compressdev.c.o
[3311/3623] Compiling C object app/dpdk-test.p/test_test_event_crypto_adapter.c.o
[3312/3623] Compiling C object app/dpdk-test.p/test_test_cryptodev.c.o
ninja: build stopped
*Build Failed #15:
OS: UB2604-64
Target: x86_64-native-linuxapp-gcc+16byte
FAILED: app/dpdk-test.p/test_test_cryptodev_asym.c.o
gcc -Iapp/dpdk-test.p -Iapp -I../app -Ilib/cmdline -I../lib/cmdline -Ilib/eal/common -I../lib/eal/common -I. -I.. -Iconfig -I../config -Ilib/eal/include -I../lib/eal/include -Ilib/eal/linux/include -I../lib/eal/linux/include -Ilib/eal/x86/include -I../lib/eal/x86/include -I../kernel/linux -Ilib/eal -I../lib/eal -Ilib/kvargs -I../lib/kvargs -Ilib/log -I../lib/log -Ilib/metrics -I../lib/metrics -Ilib/telemetry -I../lib/telemetry -Ilib/argparse -I../lib/argparse -Ilib/net -I../lib/net -Ilib/mbuf -I../lib/mbuf -Ilib/mempool -I../lib/mempool -Ilib/ring -I../lib/ring -Idrivers/net/ring -I../drivers/net/ring -Ilib/ethdev -I../lib/ethdev -Ilib/meter -I../lib/meter -Idrivers/bus/pci -I../drivers/bus/pci -I../drivers/bus/pci/linux -Ilib/pci -I../lib/pci -Idrivers/bus/vdev -I../drivers/bus/vdev -Ilib/acl -I../lib/acl -Ilib/hash -I../lib/hash -Ilib/rcu -I../lib/rcu -Ilib/bitratestats -I../lib/bitratestats -Ilib/bpf -I../lib/bpf -Ilib/cfgfile -I../lib/cfgfile -Ilib/compressdev -I../lib/compressdev -Ilib/cryptodev -I../lib/cryptodev -Ilib/security -I../lib/security -Ilib/dispatcher -I../lib/dispatcher -Ilib/eventdev -I../lib/eventdev -Ilib/timer -I../lib/timer -Ilib/dmadev -I../lib/dmadev -Ilib/distributor -I../lib/distributor -Ilib/efd -I../lib/efd -Ilib/fib -I../lib/fib -Ilib/rib -I../lib/rib -Ilib/table -I../lib/table -Ilib/lpm -I../lib/lpm -Ilib/graph -I../lib/graph -Ilib/pcapng -I../lib/pcapng -Ilib/ip_frag -I../lib/ip_frag -Ilib/ipsec -I../lib/ipsec -Ilib/latencystats -I../lib/latencystats -Idrivers/net/bonding -I../drivers/net/bonding -Ilib/sched -I../lib/sched -Idrivers/net/null -I../drivers/net/null -Ilib/member -I../lib/member -Ilib/pdcp -I../lib/pdcp -Ilib/reorder -I../lib/reorder -Ilib/pdump -I../lib/pdump -Idrivers/net/af_packet -I../drivers/net/af_packet -Idrivers/net/pcap -I../drivers/net/pcap -Idrivers/net/tap -I../drivers/net/tap -Ilib/gso -I../lib/gso -Ilib/pmu -I../lib/pmu -Ilib/power -I../lib/power -Idrivers/power/acpi -I../drivers/power/acpi -Idrivers/power/kvm_vm -I../drivers/power/kvm_vm -Idrivers/power/intel_pstate -I../drivers/power/intel_pstate -Idrivers/power/amd_pstate -I../drivers/power/amd_pstate -Idrivers/power/cppc -I../drivers/power/cppc -Idrivers/power/intel_uncore -I../drivers/power/intel_uncore -Ilib/ptr_compress -I../lib/ptr_compress -Ilib/rawdev -I../lib/rawdev -Idrivers/raw/skeleton -I../drivers/raw/skeleton -Ilib/stack -I../lib/stack -Idrivers/crypto/scheduler -I../drivers/crypto/scheduler -Iapp/test/bpf -Iapp/test/test_cfgfiles -I/usr/include/dbus-1.0 -I/usr/lib/x86_64-linux-gnu/dbus-1.0/include -I/usr/include/libnl3 -fdiagnostics-color=always -D_FILE_OFFSET_BITS=64 -Wall -Winvalid-pch -Wextra -Werror -std=c11 -O3 -include rte_config.h -Wvla -Wcast-qual -Wdeprecated -Wformat -Wformat-nonliteral -Wformat-security -Wmissing-declarations -Wmissing-prototypes -Wnested-externs -Wold-style-definition -Wpointer-arith -Wshadow -Wsign-compare -Wstrict-prototypes -Wundef -Wwrite-strings -Wno-packed-not-aligned -Wno-missing-field-initializers -fzero-init-padding-bits=all -D_GNU_SOURCE -DRTE_LIBRTE_I40E_16BYTE_RX_DESC -DRTE_LIBRTE_ICE_16BYTE_RX_DESC -march=native -mrtm -DALLOW_EXPERIMENTAL_API -Wno-vla -Wno-shadow -fno-strict-aliasing -DALLOW_INTERNAL_API -DTEST_BPF_ELF_LOAD -MD -MQ app/dpdk-test.p/test_test_cryptodev_asym.c.o -MF app/dpdk-test.p/test_test_cryptodev_asym.c.o.d -o app/dpdk-test.p/test_test_cryptodev_asym.c.o -c ../app/test/test_cryptodev_asym.c
../app/test/test_cryptodev_asym.c: In function ‘queue_ops_rsa_pss_sign_verify’:
../app/test/test_cryptodev_asym.c:691:35: error: assignment discards ‘const’ qualifier from pointer target type [-Werror=discarded-qualifiers]
691 | asym_op->rsa.message.data = rsa_pss_digest_sha256.data;
| ^
cc1: all warnings being treated as errors
[3551/3864] Compiling C object app/dpdk-test.p/test_test_eal_flags.c.o
[3552/3864] Compiling C object app/dpdk-test.p/test_test_distributor_perf.c.o
[3553/3864] Compiling C object app/dpdk-test.p/test_test_errno.c.o
[3554/3864] Compiling C object app/dpdk-test.p/test_test_dmadev_api.c.o
[3555/3864] Compiling C object app/dpdk-test.p/test_test_efd.c.o
[3556/3864] Compiling C object app/dpdk-test.p/test_test_efd_perf.c.o
[3557/3864] Compiling C object app/dpdk-test.p/test_test_distributor.c.o
[3558/3864] Compiling C object app/dpdk-test.p/test_test_dmadev.c.o
[3559/3864] Compiling C object app/dpdk-test.p/test_test_cryptodev.c.o
ninja: build stopped
*Build Failed #16:
OS: UB2604-64
Target: x86_64-native-linuxapp-gcc
FAILED: app/dpdk-test.p/test_test_cryptodev_asym.c.o
gcc -Iapp/dpdk-test.p -Iapp -I../app -Ilib/cmdline -I../lib/cmdline -Ilib/eal/common -I../lib/eal/common -I. -I.. -Iconfig -I../config -Ilib/eal/include -I../lib/eal/include -Ilib/eal/linux/include -I../lib/eal/linux/include -Ilib/eal/x86/include -I../lib/eal/x86/include -I../kernel/linux -Ilib/eal -I../lib/eal -Ilib/kvargs -I../lib/kvargs -Ilib/log -I../lib/log -Ilib/metrics -I../lib/metrics -Ilib/telemetry -I../lib/telemetry -Ilib/argparse -I../lib/argparse -Ilib/net -I../lib/net -Ilib/mbuf -I../lib/mbuf -Ilib/mempool -I../lib/mempool -Ilib/ring -I../lib/ring -Idrivers/net/ring -I../drivers/net/ring -Ilib/ethdev -I../lib/ethdev -Ilib/meter -I../lib/meter -Idrivers/bus/pci -I../drivers/bus/pci -I../drivers/bus/pci/linux -Ilib/pci -I../lib/pci -Idrivers/bus/vdev -I../drivers/bus/vdev -Ilib/acl -I../lib/acl -Ilib/hash -I../lib/hash -Ilib/rcu -I../lib/rcu -Ilib/bitratestats -I../lib/bitratestats -Ilib/bpf -I../lib/bpf -Ilib/cfgfile -I../lib/cfgfile -Ilib/compressdev -I../lib/compressdev -Ilib/cryptodev -I../lib/cryptodev -Ilib/security -I../lib/security -Ilib/dispatcher -I../lib/dispatcher -Ilib/eventdev -I../lib/eventdev -Ilib/timer -I../lib/timer -Ilib/dmadev -I../lib/dmadev -Ilib/distributor -I../lib/distributor -Ilib/efd -I../lib/efd -Ilib/fib -I../lib/fib -Ilib/rib -I../lib/rib -Ilib/table -I../lib/table -Ilib/lpm -I../lib/lpm -Ilib/graph -I../lib/graph -Ilib/pcapng -I../lib/pcapng -Ilib/ip_frag -I../lib/ip_frag -Ilib/ipsec -I../lib/ipsec -Ilib/latencystats -I../lib/latencystats -Idrivers/net/bonding -I../drivers/net/bonding -Ilib/sched -I../lib/sched -Idrivers/net/null -I../drivers/net/null -Ilib/member -I../lib/member -Ilib/pdcp -I../lib/pdcp -Ilib/reorder -I../lib/reorder -Ilib/pdump -I../lib/pdump -Idrivers/net/af_packet -I../drivers/net/af_packet -Idrivers/net/pcap -I../drivers/net/pcap -Idrivers/net/tap -I../drivers/net/tap -Ilib/gso -I../lib/gso -Ilib/pmu -I../lib/pmu -Ilib/power -I../lib/power -Idrivers/power/acpi -I../drivers/power/acpi -Idrivers/power/kvm_vm -I../drivers/power/kvm_vm -Idrivers/power/intel_pstate -I../drivers/power/intel_pstate -Idrivers/power/amd_pstate -I../drivers/power/amd_pstate -Idrivers/power/cppc -I../drivers/power/cppc -Idrivers/power/intel_uncore -I../drivers/power/intel_uncore -Ilib/ptr_compress -I../lib/ptr_compress -Ilib/rawdev -I../lib/rawdev -Idrivers/raw/skeleton -I../drivers/raw/skeleton -Ilib/stack -I../lib/stack -Idrivers/crypto/scheduler -I../drivers/crypto/scheduler -Iapp/test/bpf -Iapp/test/test_cfgfiles -I/usr/include/dbus-1.0 -I/usr/lib/x86_64-linux-gnu/dbus-1.0/include -I/usr/include/libnl3 -fdiagnostics-color=always -D_FILE_OFFSET_BITS=64 -Wall -Winvalid-pch -Wextra -Werror -std=c11 -O3 -include rte_config.h -Wvla -Wcast-qual -Wdeprecated -Wformat -Wformat-nonliteral -Wformat-security -Wmissing-declarations -Wmissing-prototypes -Wnested-externs -Wold-style-definition -Wpointer-arith -Wshadow -Wsign-compare -Wstrict-prototypes -Wundef -Wwrite-strings -Wno-packed-not-aligned -Wno-missing-field-initializers -fzero-init-padding-bits=all -D_GNU_SOURCE -march=native -mrtm -DALLOW_EXPERIMENTAL_API -Wno-vla -Wno-shadow -fno-strict-aliasing -DALLOW_INTERNAL_API -DTEST_BPF_ELF_LOAD -MD -MQ app/dpdk-test.p/test_test_cryptodev_asym.c.o -MF app/dpdk-test.p/test_test_cryptodev_asym.c.o.d -o app/dpdk-test.p/test_test_cryptodev_asym.c.o -c ../app/test/test_cryptodev_asym.c
../app/test/test_cryptodev_asym.c: In function ‘queue_ops_rsa_pss_sign_verify’:
../app/test/test_cryptodev_asym.c:691:35: error: assignment discards ‘const’ qualifier from pointer target type [-Werror=discarded-qualifiers]
691 | asym_op->rsa.message.data = rsa_pss_digest_sha256.data;
| ^
cc1: all warnings being treated as errors
[3554/3864] Compiling C object app/dpdk-test.p/test_test_distributor_perf.c.o
[3555/3864] Compiling C object app/dpdk-test.p/test_test_dmadev_api.c.o
[3556/3864] Compiling C object app/dpdk-test.p/test_test_efd.c.o
[3557/3864] Compiling C object app/dpdk-test.p/test_test_efd_perf.c.o
[3558/3864] Compiling C object app/dpdk-test.p/test_test_ethdev_api.c.o
[3559/3864] Compiling C object app/dpdk-test.p/test_test_ethdev_link.c.o
[3560/3864] Compiling C object app/dpdk-test.p/test_test_distributor.c.o
[3561/3864] Compiling C object app/dpdk-test.p/test_test_dmadev.c.o
[3562/3864] Compiling C object app/dpdk-test.p/test_test_cryptodev.c.o
ninja: build stopped
*Build Failed #17:
OS: UB2604-64
Target: x86_64-native-linuxapp-clang
FAILED: app/dpdk-test.p/test_test_cryptodev_asym.c.o
clang -Iapp/dpdk-test.p -Iapp -I../app -Ilib/cmdline -I../lib/cmdline -Ilib/eal/common -I../lib/eal/common -I. -I.. -Iconfig -I../config -Ilib/eal/include -I../lib/eal/include -Ilib/eal/linux/include -I../lib/eal/linux/include -Ilib/eal/x86/include -I../lib/eal/x86/include -I../kernel/linux -Ilib/eal -I../lib/eal -Ilib/kvargs -I../lib/kvargs -Ilib/log -I../lib/log -Ilib/metrics -I../lib/metrics -Ilib/telemetry -I../lib/telemetry -Ilib/argparse -I../lib/argparse -Ilib/net -I../lib/net -Ilib/mbuf -I../lib/mbuf -Ilib/mempool -I../lib/mempool -Ilib/ring -I../lib/ring -Idrivers/net/ring -I../drivers/net/ring -Ilib/ethdev -I../lib/ethdev -Ilib/meter -I../lib/meter -Idrivers/bus/pci -I../drivers/bus/pci -I../drivers/bus/pci/linux -Ilib/pci -I../lib/pci -Idrivers/bus/vdev -I../drivers/bus/vdev -Ilib/acl -I../lib/acl -Ilib/hash -I../lib/hash -Ilib/rcu -I../lib/rcu -Ilib/bitratestats -I../lib/bitratestats -Ilib/bpf -I../lib/bpf -Ilib/cfgfile -I../lib/cfgfile -Ilib/compressdev -I../lib/compressdev -Ilib/cryptodev -I../lib/cryptodev -Ilib/security -I../lib/security -Ilib/dispatcher -I../lib/dispatcher -Ilib/eventdev -I../lib/eventdev -Ilib/timer -I../lib/timer -Ilib/dmadev -I../lib/dmadev -Ilib/distributor -I../lib/distributor -Ilib/efd -I../lib/efd -Ilib/fib -I../lib/fib -Ilib/rib -I../lib/rib -Ilib/table -I../lib/table -Ilib/lpm -I../lib/lpm -Ilib/graph -I../lib/graph -Ilib/pcapng -I../lib/pcapng -Ilib/ip_frag -I../lib/ip_frag -Ilib/ipsec -I../lib/ipsec -Ilib/latencystats -I../lib/latencystats -Idrivers/net/bonding -I../drivers/net/bonding -Ilib/sched -I../lib/sched -Idrivers/net/null -I../drivers/net/null -Ilib/member -I../lib/member -Ilib/pdcp -I../lib/pdcp -Ilib/reorder -I../lib/reorder -Ilib/pdump -I../lib/pdump -Idrivers/net/af_packet -I../drivers/net/af_packet -Idrivers/net/pcap -I../drivers/net/pcap -Idrivers/net/tap -I../drivers/net/tap -Ilib/gso -I../lib/gso -Ilib/pmu -I../lib/pmu -Ilib/power -I../lib/power -Idrivers/power/acpi -I../drivers/power/acpi -Idrivers/power/kvm_vm -I../drivers/power/kvm_vm -Idrivers/power/intel_pstate -I../drivers/power/intel_pstate -Idrivers/power/amd_pstate -I../drivers/power/amd_pstate -Idrivers/power/cppc -I../drivers/power/cppc -Idrivers/power/intel_uncore -I../drivers/power/intel_uncore -Ilib/ptr_compress -I../lib/ptr_compress -Ilib/rawdev -I../lib/rawdev -Idrivers/raw/skeleton -I../drivers/raw/skeleton -Ilib/stack -I../lib/stack -Idrivers/crypto/scheduler -I../drivers/crypto/scheduler -Iapp/test/bpf -Iapp/test/test_cfgfiles -I/usr/include/dbus-1.0 -I/usr/lib/x86_64-linux-gnu/dbus-1.0/include -I/usr/include/libnl3 -fdiagnostics-color=always -D_FILE_OFFSET_BITS=64 -Wall -Winvalid-pch -Wextra -Werror -std=c11 -O3 -include rte_config.h -Wvla -Wcast-qual -Wcomma -Wdeprecated -Wformat -Wformat-nonliteral -Wformat-security -Wmissing-declarations -Wmissing-prototypes -Wnested-externs -Wold-style-definition -Wpointer-arith -Wshadow -Wsign-compare -Wstrict-prototypes -Wundef -Wwrite-strings -Wno-missing-field-initializers -D_GNU_SOURCE -march=native -mrtm -DALLOW_EXPERIMENTAL_API -Wno-vla -Wno-shadow -fno-strict-aliasing -DALLOW_INTERNAL_API -DTEST_BPF_ELF_LOAD -MD -MQ app/dpdk-test.p/test_test_cryptodev_asym.c.o -MF app/dpdk-test.p/test_test_cryptodev_asym.c.o.d -o app/dpdk-test.p/test_test_cryptodev_asym.c.o -c ../app/test/test_cryptodev_asym.c
../app/test/test_cryptodev_asym.c:691:28: error: assigning to 'uint8_t *' (aka 'unsigned char *') from 'const uint8_t[4096]' (aka 'const unsigned char[4096]') discards qualifiers [-Werror,-Wincompatible-pointer-types-discards-qualifiers]
691 | asym_op->rsa.message.data = rsa_pss_digest_sha256.data;
| ^ ~~~~~~~~~~~~~~~~~~~~~~~~~~
1 error generated.
[3541/3865] Compiling C object app/dpdk-test.p/test_test_cryptodev_security_tls_record.c.o
[3542/3865] Compiling C object app/dpdk-test.p/test_test_cryptodev_security_pdcp.c.o
[3543/3865] Compiling C object app/dpdk-test.p/test_test_cryptodev_security_ipsec.c.o
[3544/3865] Compiling C object app/dpdk-test.p/test_test_compressdev.c.o
[3545/3865] Compiling C object app/dpdk-test.p/test_test_cryptodev_crosscheck.c.o
[3546/3865] Compiling C object app/dpdk-test.p/test_test_devargs.c.o
[3547/3865] Compiling C object app/dpdk-test.p/test_test_cryptodev_blockcipher.c.o
[3548/3865] Compiling C object app/dpdk-test.p/test_test_dispatcher.c.o
[3549/3865] Compiling C object app/dpdk-test.p/test_test_cryptodev.c.o
ninja: build stopped
*Build Failed #18:
OS: UB2604-64
Target: x86_64-native-linuxapp-doc
FAILED: app/dpdk-test.p/test_test_cryptodev_asym.c.o
gcc -Iapp/dpdk-test.p -Iapp -I../app -Ilib/cmdline -I../lib/cmdline -Ilib/eal/common -I../lib/eal/common -I. -I.. -Iconfig -I../config -Ilib/eal/include -I../lib/eal/include -Ilib/eal/linux/include -I../lib/eal/linux/include -Ilib/eal/x86/include -I../lib/eal/x86/include -I../kernel/linux -Ilib/eal -I../lib/eal -Ilib/kvargs -I../lib/kvargs -Ilib/log -I../lib/log -Ilib/metrics -I../lib/metrics -Ilib/telemetry -I../lib/telemetry -Ilib/argparse -I../lib/argparse -Ilib/net -I../lib/net -Ilib/mbuf -I../lib/mbuf -Ilib/mempool -I../lib/mempool -Ilib/ring -I../lib/ring -Idrivers/net/ring -I../drivers/net/ring -Ilib/ethdev -I../lib/ethdev -Ilib/meter -I../lib/meter -Idrivers/bus/pci -I../drivers/bus/pci -I../drivers/bus/pci/linux -Ilib/pci -I../lib/pci -Idrivers/bus/vdev -I../drivers/bus/vdev -Ilib/acl -I../lib/acl -Ilib/hash -I../lib/hash -Ilib/rcu -I../lib/rcu -Ilib/bitratestats -I../lib/bitratestats -Ilib/bpf -I../lib/bpf -Ilib/cfgfile -I../lib/cfgfile -Ilib/compressdev -I../lib/compressdev -Ilib/cryptodev -I../lib/cryptodev -Ilib/security -I../lib/security -Ilib/dispatcher -I../lib/dispatcher -Ilib/eventdev -I../lib/eventdev -Ilib/timer -I../lib/timer -Ilib/dmadev -I../lib/dmadev -Ilib/distributor -I../lib/distributor -Ilib/efd -I../lib/efd -Ilib/fib -I../lib/fib -Ilib/rib -I../lib/rib -Ilib/table -I../lib/table -Ilib/lpm -I../lib/lpm -Ilib/graph -I../lib/graph -Ilib/pcapng -I../lib/pcapng -Ilib/ip_frag -I../lib/ip_frag -Ilib/ipsec -I../lib/ipsec -Ilib/latencystats -I../lib/latencystats -Idrivers/net/bonding -I../drivers/net/bonding -Ilib/sched -I../lib/sched -Idrivers/net/null -I../drivers/net/null -Ilib/member -I../lib/member -Ilib/pdcp -I../lib/pdcp -Ilib/reorder -I../lib/reorder -Ilib/pdump -I../lib/pdump -Idrivers/net/af_packet -I../drivers/net/af_packet -Idrivers/net/pcap -I../drivers/net/pcap -Idrivers/net/tap -I../drivers/net/tap -Ilib/gso -I../lib/gso -Ilib/pmu -I../lib/pmu -Ilib/power -I../lib/power -Idrivers/power/acpi -I../drivers/power/acpi -Idrivers/power/kvm_vm -I../drivers/power/kvm_vm -Idrivers/power/intel_pstate -I../drivers/power/intel_pstate -Idrivers/power/amd_pstate -I../drivers/power/amd_pstate -Idrivers/power/cppc -I../drivers/power/cppc -Idrivers/power/intel_uncore -I../drivers/power/intel_uncore -Ilib/ptr_compress -I../lib/ptr_compress -Ilib/rawdev -I../lib/rawdev -Idrivers/raw/skeleton -I../drivers/raw/skeleton -Ilib/stack -I../lib/stack -Idrivers/crypto/scheduler -I../drivers/crypto/scheduler -Iapp/test/bpf -Iapp/test/test_cfgfiles -I/usr/include/dbus-1.0 -I/usr/lib/x86_64-linux-gnu/dbus-1.0/include -I/usr/include/libnl3 -fdiagnostics-color=always -D_FILE_OFFSET_BITS=64 -Wall -Winvalid-pch -Wextra -Werror -std=c11 -O3 -include rte_config.h -Wvla -Wcast-qual -Wdeprecated -Wformat -Wformat-nonliteral -Wformat-security -Wmissing-declarations -Wmissing-prototypes -Wnested-externs -Wold-style-definition -Wpointer-arith -Wshadow -Wsign-compare -Wstrict-prototypes -Wundef -Wwrite-strings -Wno-packed-not-aligned -Wno-missing-field-initializers -fzero-init-padding-bits=all -D_GNU_SOURCE -march=native -mrtm -DALLOW_EXPERIMENTAL_API -Wno-vla -Wno-shadow -fno-strict-aliasing -DALLOW_INTERNAL_API -DTEST_BPF_ELF_LOAD -MD -MQ app/dpdk-test.p/test_test_cryptodev_asym.c.o -MF app/dpdk-test.p/test_test_cryptodev_asym.c.o.d -o app/dpdk-test.p/test_test_cryptodev_asym.c.o -c ../app/test/test_cryptodev_asym.c
../app/test/test_cryptodev_asym.c: In function ‘queue_ops_rsa_pss_sign_verify’:
../app/test/test_cryptodev_asym.c:691:35: error: assignment discards ‘const’ qualifier from pointer target type [-Werror=discarded-qualifiers]
691 | asym_op->rsa.message.data = rsa_pss_digest_sha256.data;
| ^
cc1: all warnings being treated as errors
[3542/3687] Compiling C object app/dpdk-test.p/test_test_eal_flags.c.o
[3543/3687] Compiling C object app/dpdk-test.p/test_test_efd.c.o
[3544/3687] Compiling C object app/dpdk-test.p/test_test_efd_perf.c.o
[3545/3687] Compiling C object app/dpdk-test.p/test_test_ethdev_api.c.o
[3546/3687] Compiling C object app/dpdk-test.p/test_test_ethdev_link.c.o
[3547/3687] Compiling C object app/dpdk-test.p/test_test_distributor.c.o
[3548/3687] Compiling C object app/dpdk-test.p/test_test_dmadev.c.o
[3549/3687] Compiling C object app/dpdk-test.p/test_test_event_crypto_adapter.c.o
[3550/3687] Compiling C object app/dpdk-test.p/test_test_cryptodev.c.o
ninja: build stopped
*Build Failed #19:
OS: RHEL10.2-64RT
Target: x86_64-native-linuxapp-gcc
FAILED: app/dpdk-test.p/test_test_cryptodev_asym.c.o
gcc -Iapp/dpdk-test.p -Iapp -I../app -Ilib/cmdline -I../lib/cmdline -Ilib/eal/common -I../lib/eal/common -I. -I.. -Iconfig -I../config -Ilib/eal/include -I../lib/eal/include -Ilib/eal/linux/include -I../lib/eal/linux/include -Ilib/eal/x86/include -I../lib/eal/x86/include -I../kernel/linux -Ilib/eal -I../lib/eal -Ilib/kvargs -I../lib/kvargs -Ilib/log -I../lib/log -Ilib/metrics -I../lib/metrics -Ilib/telemetry -I../lib/telemetry -Ilib/argparse -I../lib/argparse -Ilib/net -I../lib/net -Ilib/mbuf -I../lib/mbuf -Ilib/mempool -I../lib/mempool -Ilib/ring -I../lib/ring -Idrivers/net/ring -I../drivers/net/ring -Ilib/ethdev -I../lib/ethdev -Ilib/meter -I../lib/meter -Idrivers/bus/pci -I../drivers/bus/pci -I../drivers/bus/pci/linux -Ilib/pci -I../lib/pci -Idrivers/bus/vdev -I../drivers/bus/vdev -Ilib/acl -I../lib/acl -Ilib/hash -I../lib/hash -Ilib/rcu -I../lib/rcu -Ilib/bitratestats -I../lib/bitratestats -Ilib/bpf -I../lib/bpf -Ilib/cfgfile -I../lib/cfgfile -Ilib/compressdev -I../lib/compressdev -Ilib/cryptodev -I../lib/cryptodev -Ilib/security -I../lib/security -Ilib/dispatcher -I../lib/dispatcher -Ilib/eventdev -I../lib/eventdev -Ilib/timer -I../lib/timer -Ilib/dmadev -I../lib/dmadev -Ilib/distributor -I../lib/distributor -Ilib/efd -I../lib/efd -Ilib/fib -I../lib/fib -Ilib/rib -I../lib/rib -Ilib/table -I../lib/table -Ilib/lpm -I../lib/lpm -Ilib/graph -I../lib/graph -Ilib/pcapng -I../lib/pcapng -Ilib/ip_frag -I../lib/ip_frag -Ilib/ipsec -I../lib/ipsec -Ilib/latencystats -I../lib/latencystats -Idrivers/net/bonding -I../drivers/net/bonding -Ilib/sched -I../lib/sched -Idrivers/net/null -I../drivers/net/null -Ilib/member -I../lib/member -Ilib/pdcp -I../lib/pdcp -Ilib/reorder -I../lib/reorder -Ilib/pdump -I../lib/pdump -Idrivers/net/af_packet -I../drivers/net/af_packet -Idrivers/net/tap -I../drivers/net/tap -Ilib/gso -I../lib/gso -Ilib/pmu -I../lib/pmu -Ilib/power -I../lib/power -Idrivers/power/acpi -I../drivers/power/acpi -Idrivers/power/kvm_vm -I../drivers/power/kvm_vm -Idrivers/power/intel_pstate -I../drivers/power/intel_pstate -Idrivers/power/amd_pstate -I../drivers/power/amd_pstate -Idrivers/power/cppc -I../drivers/power/cppc -Idrivers/power/intel_uncore -I../drivers/power/intel_uncore -Ilib/ptr_compress -I../lib/ptr_compress -Ilib/rawdev -I../lib/rawdev -Idrivers/raw/skeleton -I../drivers/raw/skeleton -Ilib/stack -I../lib/stack -Idrivers/crypto/scheduler -I../drivers/crypto/scheduler -Iapp/test/test_cfgfiles -fdiagnostics-color=always -D_FILE_OFFSET_BITS=64 -Wall -Winvalid-pch -Wextra -Werror -std=c11 -O3 -include rte_config.h -Wvla -Wcast-qual -Wdeprecated -Wformat -Wformat-nonliteral -Wformat-security -Wmissing-declarations -Wmissing-prototypes -Wnested-externs -Wold-style-definition -Wpointer-arith -Wshadow -Wsign-compare -Wstrict-prototypes -Wundef -Wwrite-strings -Wno-packed-not-aligned -Wno-missing-field-initializers -D_GNU_SOURCE -DWITH_GZFILEOP -march=native -mrtm -DALLOW_EXPERIMENTAL_API -Wno-vla -Wno-shadow -fno-strict-aliasing -DALLOW_INTERNAL_API -MD -MQ app/dpdk-test.p/test_test_cryptodev_asym.c.o -MF app/dpdk-test.p/test_test_cryptodev_asym.c.o.d -o app/dpdk-test.p/test_test_cryptodev_asym.c.o -c ../app/test/test_cryptodev_asym.c
../app/test/test_cryptodev_asym.c: In function ‘queue_ops_rsa_pss_sign_verify’:
../app/test/test_cryptodev_asym.c:691:35: error: assignment discards ‘const’ qualifier from pointer target type [-Werror=discarded-qualifiers]
691 | asym_op->rsa.message.data = rsa_pss_digest_sha256.data;
| ^
cc1: all warnings being treated as errors
[3305/3623] Compiling C object app/dpdk-test.p/test_test_errno.c.o
[3306/3623] Compiling C object app/dpdk-test.p/test_test_eal_flags.c.o
[3307/3623] Compiling C object app/dpdk-test.p/test_test_efd.c.o
[3308/3623] Compiling C object app/dpdk-test.p/test_test_efd_perf.c.o
[3309/3623] Compiling C object app/dpdk-test.p/test_test_ethdev_link.c.o
[3310/3623] Compiling C object app/dpdk-test.p/test_test_ethdev_api.c.o
[3311/3623] Compiling C object app/dpdk-test.p/test_test_dmadev.c.o
[3312/3623] Compiling C object app/dpdk-test.p/test_test_distributor.c.o
[3313/3623] Compiling C object app/dpdk-test.p/test_test_cryptodev.c.o
ninja: build stopped
*Build Failed #20:
OS: UB2404-64
Target: x86_64-native-linuxapp-gcc
FAILED: app/dpdk-test.p/test_test_cryptodev_asym.c.o
gcc -Iapp/dpdk-test.p -Iapp -I../app -Ilib/cmdline -I../lib/cmdline -Ilib/eal/common -I../lib/eal/common -I. -I.. -Iconfig -I../config -Ilib/eal/include -I../lib/eal/include -Ilib/eal/linux/include -I../lib/eal/linux/include -Ilib/eal/x86/include -I../lib/eal/x86/include -I../kernel/linux -Ilib/eal -I../lib/eal -Ilib/kvargs -I../lib/kvargs -Ilib/log -I../lib/log -Ilib/metrics -I../lib/metrics -Ilib/telemetry -I../lib/telemetry -Ilib/argparse -I../lib/argparse -Ilib/net -I../lib/net -Ilib/mbuf -I../lib/mbuf -Ilib/mempool -I../lib/mempool -Ilib/ring -I../lib/ring -Idrivers/net/ring -I../drivers/net/ring -Ilib/ethdev -I../lib/ethdev -Ilib/meter -I../lib/meter -Idrivers/bus/pci -I../drivers/bus/pci -I../drivers/bus/pci/linux -Ilib/pci -I../lib/pci -Idrivers/bus/vdev -I../drivers/bus/vdev -Ilib/acl -I../lib/acl -Ilib/hash -I../lib/hash -Ilib/rcu -I../lib/rcu -Ilib/bitratestats -I../lib/bitratestats -Ilib/bpf -I../lib/bpf -Ilib/cfgfile -I../lib/cfgfile -Ilib/compressdev -I../lib/compressdev -Ilib/cryptodev -I../lib/cryptodev -Ilib/security -I../lib/security -Ilib/dispatcher -I../lib/dispatcher -Ilib/eventdev -I../lib/eventdev -Ilib/timer -I../lib/timer -Ilib/dmadev -I../lib/dmadev -Ilib/distributor -I../lib/distributor -Ilib/efd -I../lib/efd -Ilib/fib -I../lib/fib -Ilib/rib -I../lib/rib -Ilib/table -I../lib/table -Ilib/lpm -I../lib/lpm -Ilib/graph -I../lib/graph -Ilib/pcapng -I../lib/pcapng -Ilib/ip_frag -I../lib/ip_frag -Ilib/ipsec -I../lib/ipsec -Ilib/latencystats -I../lib/latencystats -Idrivers/net/bonding -I../drivers/net/bonding -Ilib/sched -I../lib/sched -Idrivers/net/null -I../drivers/net/null -Ilib/member -I../lib/member -Ilib/pdcp -I../lib/pdcp -Ilib/reorder -I../lib/reorder -Ilib/pdump -I../lib/pdump -Idrivers/net/af_packet -I../drivers/net/af_packet -Idrivers/net/pcap -I../drivers/net/pcap -Idrivers/net/tap -I../drivers/net/tap -Ilib/gso -I../lib/gso -Ilib/pmu -I../lib/pmu -Ilib/power -I../lib/power -Idrivers/power/acpi -I../drivers/power/acpi -Idrivers/power/kvm_vm -I../drivers/power/kvm_vm -Idrivers/power/intel_pstate -I../drivers/power/intel_pstate -Idrivers/power/amd_pstate -I../drivers/power/amd_pstate -Idrivers/power/cppc -I../drivers/power/cppc -Idrivers/power/intel_uncore -I../drivers/power/intel_uncore -Ilib/ptr_compress -I../lib/ptr_compress -Ilib/rawdev -I../lib/rawdev -Idrivers/raw/skeleton -I../drivers/raw/skeleton -Ilib/stack -I../lib/stack -Idrivers/crypto/scheduler -I../drivers/crypto/scheduler -Iapp/test/bpf -Iapp/test/test_cfgfiles -I/usr/include/dbus-1.0 -I/usr/lib/x86_64-linux-gnu/dbus-1.0/include -I/usr/include/libnl3 -fdiagnostics-color=always -D_FILE_OFFSET_BITS=64 -Wall -Winvalid-pch -Wextra -Werror -std=c11 -O3 -include rte_config.h -Wvla -Wcast-qual -Wdeprecated -Wformat -Wformat-nonliteral -Wformat-security -Wmissing-declarations -Wmissing-prototypes -Wnested-externs -Wold-style-definition -Wpointer-arith -Wshadow -Wsign-compare -Wstrict-prototypes -Wundef -Wwrite-strings -Wno-packed-not-aligned -Wno-missing-field-initializers -D_GNU_SOURCE -march=native -mrtm -DALLOW_EXPERIMENTAL_API -Wno-vla -Wno-shadow -fno-strict-aliasing -DALLOW_INTERNAL_API -DTEST_BPF_ELF_LOAD -MD -MQ app/dpdk-test.p/test_test_cryptodev_asym.c.o -MF app/dpdk-test.p/test_test_cryptodev_asym.c.o.d -o app/dpdk-test.p/test_test_cryptodev_asym.c.o -c ../app/test/test_cryptodev_asym.c
../app/test/test_cryptodev_asym.c: In function ‘queue_ops_rsa_pss_sign_verify’:
../app/test/test_cryptodev_asym.c:691:35: error: assignment discards ‘const’ qualifier from pointer target type [-Werror=discarded-qualifiers]
691 | asym_op->rsa.message.data = rsa_pss_digest_sha256.data;
| ^
cc1: all warnings being treated as errors
[3553/3864] Compiling C object app/dpdk-test.p/test_test_efd_perf.c.o
[3554/3864] Compiling C object app/dpdk-test.p/test_test_ethdev_api.c.o
[3555/3864] Compiling C object app/dpdk-test.p/test_test_ethdev_link.c.o
[3556/3864] Compiling C object app/dpdk-test.p/test_test_distributor.c.o
[3557/3864] Compiling C object app/dpdk-test.p/test_test_dmadev.c.o
[3558/3864] Compiling C object app/dpdk-test.p/test_test_event_dma_adapter.c.o
[3559/3864] Compiling C object app/dpdk-test.p/test_test_event_eth_rx_adapter.c.o
[3560/3864] Compiling C object app/dpdk-test.p/test_test_event_crypto_adapter.c.o
[3561/3864] Compiling C object app/dpdk-test.p/test_test_cryptodev.c.o
ninja: build stopped
*Build Failed #21:
OS: Fedora44-64
Target: x86_64-native-linuxapp-gcc
FAILED: app/dpdk-test.p/test_test_cryptodev_asym.c.o
gcc -Iapp/dpdk-test.p -Iapp -I../app -Ilib/cmdline -I../lib/cmdline -Ilib/eal/common -I../lib/eal/common -I. -I.. -Iconfig -I../config -Ilib/eal/include -I../lib/eal/include -Ilib/eal/linux/include -I../lib/eal/linux/include -Ilib/eal/x86/include -I../lib/eal/x86/include -I../kernel/linux -Ilib/eal -I../lib/eal -Ilib/kvargs -I../lib/kvargs -Ilib/log -I../lib/log -Ilib/metrics -I../lib/metrics -Ilib/telemetry -I../lib/telemetry -Ilib/argparse -I../lib/argparse -Ilib/net -I../lib/net -Ilib/mbuf -I../lib/mbuf -Ilib/mempool -I../lib/mempool -Ilib/ring -I../lib/ring -Idrivers/net/ring -I../drivers/net/ring -Ilib/ethdev -I../lib/ethdev -Ilib/meter -I../lib/meter -Idrivers/bus/pci -I../drivers/bus/pci -I../drivers/bus/pci/linux -Ilib/pci -I../lib/pci -Idrivers/bus/vdev -I../drivers/bus/vdev -Ilib/acl -I../lib/acl -Ilib/hash -I../lib/hash -Ilib/rcu -I../lib/rcu -Ilib/bitratestats -I../lib/bitratestats -Ilib/bpf -I../lib/bpf -Ilib/cfgfile -I../lib/cfgfile -Ilib/compressdev -I../lib/compressdev -Ilib/cryptodev -I../lib/cryptodev -Ilib/security -I../lib/security -Ilib/dispatcher -I../lib/dispatcher -Ilib/eventdev -I../lib/eventdev -Ilib/timer -I../lib/timer -Ilib/dmadev -I../lib/dmadev -Ilib/distributor -I../lib/distributor -Ilib/efd -I../lib/efd -Ilib/fib -I../lib/fib -Ilib/rib -I../lib/rib -Ilib/table -I../lib/table -Ilib/lpm -I../lib/lpm -Ilib/graph -I../lib/graph -Ilib/pcapng -I../lib/pcapng -Ilib/ip_frag -I../lib/ip_frag -Ilib/ipsec -I../lib/ipsec -Ilib/latencystats -I../lib/latencystats -Idrivers/net/bonding -I../drivers/net/bonding -Ilib/sched -I../lib/sched -Idrivers/net/null -I../drivers/net/null -Ilib/member -I../lib/member -Ilib/pdcp -I../lib/pdcp -Ilib/reorder -I../lib/reorder -Ilib/pdump -I../lib/pdump -Idrivers/net/af_packet -I../drivers/net/af_packet -Idrivers/net/tap -I../drivers/net/tap -Ilib/gso -I../lib/gso -Ilib/pmu -I../lib/pmu -Ilib/power -I../lib/power -Idrivers/power/acpi -I../drivers/power/acpi -Idrivers/power/kvm_vm -I../drivers/power/kvm_vm -Idrivers/power/intel_pstate -I../drivers/power/intel_pstate -Idrivers/power/amd_pstate -I../drivers/power/amd_pstate -Idrivers/power/cppc -I../drivers/power/cppc -Idrivers/power/intel_uncore -I../drivers/power/intel_uncore -Ilib/ptr_compress -I../lib/ptr_compress -Ilib/rawdev -I../lib/rawdev -Idrivers/raw/skeleton -I../drivers/raw/skeleton -Ilib/stack -I../lib/stack -Idrivers/crypto/scheduler -I../drivers/crypto/scheduler -Iapp/test/test_cfgfiles -fdiagnostics-color=always -D_FILE_OFFSET_BITS=64 -Wall -Winvalid-pch -Wextra -Werror -std=c11 -O3 -include rte_config.h -Wvla -Wcast-qual -Wdeprecated -Wformat -Wformat-nonliteral -Wformat-security -Wmissing-declarations -Wmissing-prototypes -Wnested-externs -Wold-style-definition -Wpointer-arith -Wshadow -Wsign-compare -Wstrict-prototypes -Wundef -Wwrite-strings -Wno-packed-not-aligned -Wno-missing-field-initializers -fzero-init-padding-bits=all -D_GNU_SOURCE -DWITH_GZFILEOP -march=native -mrtm -DALLOW_EXPERIMENTAL_API -Wno-vla -Wno-shadow -fno-strict-aliasing -DALLOW_INTERNAL_API -MD -MQ app/dpdk-test.p/test_test_cryptodev_asym.c.o -MF app/dpdk-test.p/test_test_cryptodev_asym.c.o.d -o app/dpdk-test.p/test_test_cryptodev_asym.c.o -c ../app/test/test_cryptodev_asym.c
../app/test/test_cryptodev_asym.c: In function ‘queue_ops_rsa_pss_sign_verify’:
../app/test/test_cryptodev_asym.c:691:35: error: assignment discards ‘const’ qualifier from pointer target type [-Werror=discarded-qualifiers]
691 | asym_op->rsa.message.data = rsa_pss_digest_sha256.data;
| ^
cc1: all warnings being treated as errors
[3306/3623] Compiling C object app/dpdk-test.p/test_test_errno.c.o
[3307/3623] Compiling C object app/dpdk-test.p/test_test_eal_flags.c.o
[3308/3623] Compiling C object app/dpdk-test.p/test_test_efd.c.o
[3309/3623] Compiling C object app/dpdk-test.p/test_test_efd_perf.c.o
[3310/3623] Compiling C object app/dpdk-test.p/test_test_ethdev_api.c.o
[3311/3623] Compiling C object app/dpdk-test.p/test_test_ethdev_link.c.o
[3312/3623] Compiling C object app/dpdk-test.p/test_test_dmadev.c.o
[3313/3623] Compiling C object app/dpdk-test.p/test_test_distributor.c.o
[3314/3623] Compiling C object app/dpdk-test.p/test_test_cryptodev.c.o
ninja: build stopped
*Build Failed #22:
OS: Fedora44-64
Target: x86_64-native-linuxapp-clang
FAILED: app/dpdk-test.p/test_test_cryptodev_asym.c.o
clang -Iapp/dpdk-test.p -Iapp -I../app -Ilib/cmdline -I../lib/cmdline -Ilib/eal/common -I../lib/eal/common -I. -I.. -Iconfig -I../config -Ilib/eal/include -I../lib/eal/include -Ilib/eal/linux/include -I../lib/eal/linux/include -Ilib/eal/x86/include -I../lib/eal/x86/include -I../kernel/linux -Ilib/eal -I../lib/eal -Ilib/kvargs -I../lib/kvargs -Ilib/log -I../lib/log -Ilib/metrics -I../lib/metrics -Ilib/telemetry -I../lib/telemetry -Ilib/argparse -I../lib/argparse -Ilib/net -I../lib/net -Ilib/mbuf -I../lib/mbuf -Ilib/mempool -I../lib/mempool -Ilib/ring -I../lib/ring -Idrivers/net/ring -I../drivers/net/ring -Ilib/ethdev -I../lib/ethdev -Ilib/meter -I../lib/meter -Idrivers/bus/pci -I../drivers/bus/pci -I../drivers/bus/pci/linux -Ilib/pci -I../lib/pci -Idrivers/bus/vdev -I../drivers/bus/vdev -Ilib/acl -I../lib/acl -Ilib/hash -I../lib/hash -Ilib/rcu -I../lib/rcu -Ilib/bitratestats -I../lib/bitratestats -Ilib/bpf -I../lib/bpf -Ilib/cfgfile -I../lib/cfgfile -Ilib/compressdev -I../lib/compressdev -Ilib/cryptodev -I../lib/cryptodev -Ilib/security -I../lib/security -Ilib/dispatcher -I../lib/dispatcher -Ilib/eventdev -I../lib/eventdev -Ilib/timer -I../lib/timer -Ilib/dmadev -I../lib/dmadev -Ilib/distributor -I../lib/distributor -Ilib/efd -I../lib/efd -Ilib/fib -I../lib/fib -Ilib/rib -I../lib/rib -Ilib/table -I../lib/table -Ilib/lpm -I../lib/lpm -Ilib/graph -I../lib/graph -Ilib/pcapng -I../lib/pcapng -Ilib/ip_frag -I../lib/ip_frag -Ilib/ipsec -I../lib/ipsec -Ilib/latencystats -I../lib/latencystats -Idrivers/net/bonding -I../drivers/net/bonding -Ilib/sched -I../lib/sched -Idrivers/net/null -I../drivers/net/null -Ilib/member -I../lib/member -Ilib/pdcp -I../lib/pdcp -Ilib/reorder -I../lib/reorder -Ilib/pdump -I../lib/pdump -Idrivers/net/af_packet -I../drivers/net/af_packet -Idrivers/net/tap -I../drivers/net/tap -Ilib/gso -I../lib/gso -Ilib/pmu -I../lib/pmu -Ilib/power -I../lib/power -Idrivers/power/acpi -I../drivers/power/acpi -Idrivers/power/kvm_vm -I../drivers/power/kvm_vm -Idrivers/power/intel_pstate -I../drivers/power/intel_pstate -Idrivers/power/amd_pstate -I../drivers/power/amd_pstate -Idrivers/power/cppc -I../drivers/power/cppc -Idrivers/power/intel_uncore -I../drivers/power/intel_uncore -Ilib/ptr_compress -I../lib/ptr_compress -Ilib/rawdev -I../lib/rawdev -Idrivers/raw/skeleton -I../drivers/raw/skeleton -Ilib/stack -I../lib/stack -Idrivers/crypto/scheduler -I../drivers/crypto/scheduler -Iapp/test/test_cfgfiles -fdiagnostics-color=always -D_FILE_OFFSET_BITS=64 -Wall -Winvalid-pch -Wextra -Werror -std=c11 -O3 -include rte_config.h -Wvla -Wcast-qual -Wcomma -Wdeprecated -Wformat -Wformat-nonliteral -Wformat-security -Wmissing-declarations -Wmissing-prototypes -Wnested-externs -Wold-style-definition -Wpointer-arith -Wshadow -Wsign-compare -Wstrict-prototypes -Wundef -Wwrite-strings -Wno-missing-field-initializers -D_GNU_SOURCE -DWITH_GZFILEOP -march=native -mrtm -DALLOW_EXPERIMENTAL_API -Wno-vla -Wno-shadow -fno-strict-aliasing -DALLOW_INTERNAL_API -MD -MQ app/dpdk-test.p/test_test_cryptodev_asym.c.o -MF app/dpdk-test.p/test_test_cryptodev_asym.c.o.d -o app/dpdk-test.p/test_test_cryptodev_asym.c.o -c ../app/test/test_cryptodev_asym.c
../app/test/test_cryptodev_asym.c:691:28: error: assigning to 'uint8_t *' (aka 'unsigned char *') from 'const uint8_t[4096]' (aka 'const unsigned char[4096]') discards qualifiers [-Werror,-Wincompatible-pointer-types-discards-qualifiers]
691 | asym_op->rsa.message.data = rsa_pss_digest_sha256.data;
| ^ ~~~~~~~~~~~~~~~~~~~~~~~~~~
1 error generated.
[3297/3623] Compiling C object app/dpdk-test.p/test_test_debug.c.o
[3298/3623] Compiling C object app/dpdk-test.p/test_test_cryptodev_security_ipsec.c.o
[3299/3623] Compiling C object app/dpdk-test.p/test_test_cycles.c.o
[3300/3623] Compiling C object app/dpdk-test.p/test_test_cryptodev_security_tls_record.c.o
[3301/3623] Compiling C object app/dpdk-test.p/test_test_cryptodev_security_pdcp.c.o
[3302/3623] Compiling C object app/dpdk-test.p/test_test_compressdev.c.o
[3303/3623] Compiling C object app/dpdk-test.p/test_test_cryptodev_crosscheck.c.o
[3304/3623] Compiling C object app/dpdk-test.p/test_test_cryptodev_blockcipher.c.o
[3305/3623] Compiling C object app/dpdk-test.p/test_test_cryptodev.c.o
ninja: build stopped
*Build Failed #23:
OS: OpenEuler2404-64
Target: x86_64-native-linuxapp-gcc
FAILED: app/dpdk-test.p/test_test_cryptodev_asym.c.o
gcc -Iapp/dpdk-test.p -Iapp -I../app -Ilib/cmdline -I../lib/cmdline -Ilib/eal/common -I../lib/eal/common -I. -I.. -Iconfig -I../config -Ilib/eal/include -I../lib/eal/include -Ilib/eal/linux/include -I../lib/eal/linux/include -Ilib/eal/x86/include -I../lib/eal/x86/include -I../kernel/linux -Ilib/eal -I../lib/eal -Ilib/kvargs -I../lib/kvargs -Ilib/log -I../lib/log -Ilib/metrics -I../lib/metrics -Ilib/telemetry -I../lib/telemetry -Ilib/argparse -I../lib/argparse -Ilib/net -I../lib/net -Ilib/mbuf -I../lib/mbuf -Ilib/mempool -I../lib/mempool -Ilib/ring -I../lib/ring -Idrivers/net/ring -I../drivers/net/ring -Ilib/ethdev -I../lib/ethdev -Ilib/meter -I../lib/meter -Idrivers/bus/pci -I../drivers/bus/pci -I../drivers/bus/pci/linux -Ilib/pci -I../lib/pci -Idrivers/bus/vdev -I../drivers/bus/vdev -Ilib/acl -I../lib/acl -Ilib/hash -I../lib/hash -Ilib/rcu -I../lib/rcu -Ilib/bitratestats -I../lib/bitratestats -Ilib/bpf -I../lib/bpf -Ilib/cfgfile -I../lib/cfgfile -Ilib/compressdev -I../lib/compressdev -Ilib/cryptodev -I../lib/cryptodev -Ilib/security -I../lib/security -Ilib/dispatcher -I../lib/dispatcher -Ilib/eventdev -I../lib/eventdev -Ilib/timer -I../lib/timer -Ilib/dmadev -I../lib/dmadev -Ilib/distributor -I../lib/distributor -Ilib/efd -I../lib/efd -Ilib/fib -I../lib/fib -Ilib/rib -I../lib/rib -Ilib/table -I../lib/table -Ilib/lpm -I../lib/lpm -Ilib/graph -I../lib/graph -Ilib/pcapng -I../lib/pcapng -Ilib/ip_frag -I../lib/ip_frag -Ilib/ipsec -I../lib/ipsec -Ilib/latencystats -I../lib/latencystats -Idrivers/net/bonding -I../drivers/net/bonding -Ilib/sched -I../lib/sched -Idrivers/net/null -I../drivers/net/null -Ilib/member -I../lib/member -Ilib/pdcp -I../lib/pdcp -Ilib/reorder -I../lib/reorder -Ilib/pdump -I../lib/pdump -Idrivers/net/af_packet -I../drivers/net/af_packet -Idrivers/net/tap -I../drivers/net/tap -Ilib/gso -I../lib/gso -Ilib/pmu -I../lib/pmu -Ilib/power -I../lib/power -Idrivers/power/acpi -I../drivers/power/acpi -Idrivers/power/kvm_vm -I../drivers/power/kvm_vm -Idrivers/power/intel_pstate -I../drivers/power/intel_pstate -Idrivers/power/amd_pstate -I../drivers/power/amd_pstate -Idrivers/power/cppc -I../drivers/power/cppc -Idrivers/power/intel_uncore -I../drivers/power/intel_uncore -Ilib/ptr_compress -I../lib/ptr_compress -Ilib/rawdev -I../lib/rawdev -Idrivers/raw/skeleton -I../drivers/raw/skeleton -Ilib/stack -I../lib/stack -Idrivers/crypto/scheduler -I../drivers/crypto/scheduler -Iapp/test/test_cfgfiles -fdiagnostics-color=always -D_FILE_OFFSET_BITS=64 -Wall -Winvalid-pch -Wextra -Werror -std=c11 -O3 -include rte_config.h -Wvla -Wcast-qual -Wdeprecated -Wformat -Wformat-nonliteral -Wformat-security -Wmissing-declarations -Wmissing-prototypes -Wnested-externs -Wold-style-definition -Wpointer-arith -Wshadow -Wsign-compare -Wstrict-prototypes -Wundef -Wwrite-strings -Wno-packed-not-aligned -Wno-missing-field-initializers -D_GNU_SOURCE -march=native -mrtm -DALLOW_EXPERIMENTAL_API -Wno-vla -Wno-shadow -fno-strict-aliasing -DALLOW_INTERNAL_API -MD -MQ app/dpdk-test.p/test_test_cryptodev_asym.c.o -MF app/dpdk-test.p/test_test_cryptodev_asym.c.o.d -o app/dpdk-test.p/test_test_cryptodev_asym.c.o -c ../app/test/test_cryptodev_asym.c
../app/test/test_cryptodev_asym.c: In function ‘queue_ops_rsa_pss_sign_verify’:
../app/test/test_cryptodev_asym.c:691:35: error: assignment discards ‘const’ qualifier from pointer target type [-Werror=discarded-qualifiers]
691 | asym_op->rsa.message.data = rsa_pss_digest_sha256.data;
| ^
cc1: all warnings being treated as errors
[3307/3623] Compiling C object app/dpdk-test.p/test_test_efd.c.o
[3308/3623] Compiling C object app/dpdk-test.p/test_test_efd_perf.c.o
[3309/3623] Compiling C object app/dpdk-test.p/test_test_ethdev_api.c.o
[3310/3623] Compiling C object app/dpdk-test.p/test_test_distributor.c.o
[3311/3623] Compiling C object app/dpdk-test.p/test_test_ethdev_link.c.o
[3312/3623] Compiling C object app/dpdk-test.p/test_test_dmadev.c.o
[3313/3623] Compiling C object app/dpdk-test.p/test_test_event_dma_adapter.c.o
[3314/3623] Compiling C object app/dpdk-test.p/test_test_event_crypto_adapter.c.o
[3315/3623] Compiling C object app/dpdk-test.p/test_test_cryptodev.c.o
ninja: build stopped
DPDK STV team
More information about the test-report
mailing list