[dpdk-test-report] |FAILURE| pw50465[7/7] mempool/stack: add non-blocking stack mempool handler

sys_stv at intel.com sys_stv at intel.com
Fri Feb 22 17:20:37 CET 2019


Test-Label: Intel-compilation
Test-Status: FAILURE
http://dpdk.org/patch/50465

_Compilation issues_

Submitter: Gage Eads <gage.eads at intel.com>
Date: 2019-02-22 16:06:55
Reply_mail: 20190222160655.3346-8-gage.eads at intel.com
DPDK git baseline: Repo:dpdk-master, CommitID: b13baac8d5ffb6b0b7a6ca0def884d3f1a82babb

Build Summary: 16 Builds Done, 3 Successful, 13 Failures

Test environment and configuration as below:

OS: UB1604
	Kernel Version: 4.4.0-78-generic
	CPU info: Intel(R) Xeon(R) CPU E5-2699 v3 @ 2.30GHz
	GCC Version: gcc (Ubuntu 5.4.0-6ubuntu1~16.04.10) 5.4.0 20160609
	Clang Version: 3.8.0-2ubuntu4 (tags/RELEASE_380/final)
	x86_64-native-linuxapp-gcc
	x86_64-native-linuxapp-clang
	x86_64-native-linuxapp-gcc-shared
	i686-native-linuxapp-gcc

OS: CENTOS
	Kernel Version: 3.10.0-957.1.3.el7.x86_64
	CPU info: Intel(R) Xeon(R) CPU E5-2699 v3 @ 2.30GHz
	GCC Version: gcc (GCC) 4.8.5 20150623 (Red Hat 4.8.5-36)
	Clang Version: 3.4.2 (tags/RELEASE_34/dot2-final)
	x86_64-native-linuxapp-clang
	x86_64-native-linuxapp-gcc-shared
	x86_64-native-linuxapp-gcc
	i686-native-linuxapp-gcc

OS: UBT1804
	Kernel Version: 4.15.0-29-generic
	CPU info: Intel(R) Xeon(R) Platinum 8180M CPU @ 2.50GHz
	GCC Version: gcc (Ubuntu 7.3.0-27ubuntu1~18.04) 7.3.0
	Clang Version: 6.0.0-1ubuntu2 (tags/RELEASE_600/final)
	x86_64-native-linuxapp-gcc

OS: FC25
	Kernel Version: 4.5.5-300.fc24.x86_64
	CPU info: Intel(R) Xeon(R) CPU E5-2699 v3 @ 2.30GHz
	GCC Version: gcc (GCC) 6.1.1 20160510 (Red Hat 6.1.1-2)
	Clang Version: 3.8.0 (tags/RELEASE_380/final)
	x86_64-native-linuxapp-gcc
	x86_64-native-linuxapp-gcc-debug

OS: FC24
	Kernel Version: 4.11.12-100.fc24.x86_64
	CPU info: Intel(R) Xeon(R) CPU E5-2699 v3 @ 2.30GHz
	GCC Version: gcc (GCC) 6.3.1 20161221 (Red Hat 6.3.1-1)
	Clang Version: 3.8.1 (tags/RELEASE_381/final)
	x86_64-native-linuxapp-clang
	x86_64-native-linuxapp-gcc-shared
	i686-native-linuxapp-gcc

OS: FreeBSD
	Kernel Version: 10.3-RELEASE
	CPU info: Intel(R) Xeon(R) CPU E5-2699 v3 @ 2.30GHz (2294.75-MHz K8-class CPU)
	GCC Version: gcc (FreeBSD Ports Collection) 7.3.0
	Clang Version: 3.4.1 (tags/RELEASE_34/dot1-final 208032) 20140512
	x86_64-native-bsdapp-clang
	x86_64-native-bsdapp-gcc

*Failed Build #1:
OS: FC25
Target: x86_64-native-linuxapp-gcc
  SYMLINK-FILE include/rte_stack_c11_mem.h
  CC rte_stack.o
In file included from /tmp/FC25_K4.8.6_GCC6.3.1/x86_64-native-linuxapp-gcc/91c7295957a14970a0a90581237546fe/dpdk/lib/librte_stack/rte_stack.h:94:0,
                 from /tmp/FC25_K4.8.6_GCC6.3.1/x86_64-native-linuxapp-gcc/91c7295957a14970a0a90581237546fe/dpdk/lib/librte_stack/rte_stack.c:16:
/tmp/FC25_K4.8.6_GCC6.3.1/x86_64-native-linuxapp-gcc/91c7295957a14970a0a90581237546fe/dpdk/lib/librte_stack/rte_stack_generic.h: In function ‘__nb_lifo_push’:
/tmp/FC25_K4.8.6_GCC6.3.1/x86_64-native-linuxapp-gcc/91c7295957a14970a0a90581237546fe/dpdk/lib/librte_stack/rte_stack_generic.h:66:13: warning: implicit declaration of function ‘rte_atomic128_cmpxchg’ [-Wimplicit-function-declaration]
   success = rte_atomic128_cmpxchg((rte_int128_t *)&lifo->head,
             ^~~~~~~~~~~~~~~~~~~~~
/tmp/FC25_K4.8.6_GCC6.3.1/x86_64-native-linuxapp-gcc/91c7295957a14970a0a90581237546fe/dpdk/lib/librte_stack/rte_stack_generic.h:66:3: warning: nested extern declaration of ‘rte_atomic128_cmpxchg’ [-Wnested-externs]
   success = rte_atomic128_cmpxchg((rte_int128_t *)&lifo->head,
   ^~~~~~~
/tmp/FC25_K4.8.6_GCC6.3.1/x86_64-native-linuxapp-gcc/91c7295957a14970a0a90581237546fe/dpdk/lib/librte_stack/rte_stack_generic.h:66:36: error: ‘rte_int128_t’ undeclared (first use in this function)
   success = rte_atomic128_cmpxchg((rte_int128_t *)&lifo->head,
                                    ^~~~~~~~~~~~
/tmp/FC25_K4.8.6_GCC6.3.1/x86_64-native-linuxapp-gcc/91c7295957a14970a0a90581237546fe/dpdk/lib/librte_stack/rte_stack_generic.h:66:36: note: each undeclared identifier is reported only once for each function it appears in
/tmp/FC25_K4.8.6_GCC6.3.1/x86_64-native-linuxapp-gcc/91c7295957a14970a0a90581237546fe/dpdk/lib/librte_stack/rte_stack_generic.h:66:50: error: expected expression before ‘)’ token
   success = rte_atomic128_cmpxchg((rte_int128_t *)&lifo->head,
                                                  ^
/tmp/FC25_K4.8.6_GCC6.3.1/x86_64-native-linuxapp-gcc/91c7295957a14970a0a90581237546fe/dpdk/lib/librte_stack/rte_stack_generic.h:50:27: warning: variable ‘new_head’ set but not used [-Wunused-but-set-variable]
   struct rte_nb_lifo_head new_head;
                           ^~~~~~~~
/tmp/FC25_K4.8.6_GCC6.3.1/x86_64-native-linuxapp-gcc/91c7295957a14970a0a90581237546fe/dpdk/lib/librte_stack/rte_stack_generic.h: In function ‘__nb_lifo_pop’:
/tmp/FC25_K4.8.6_GCC6.3.1/x86_64-native-linuxapp-gcc/91c7295957a14970a0a90581237546fe/dpdk/lib/librte_stack/rte_stack_generic.h:146:36: error: ‘rte_int128_t’ undeclared (first use in this function)
   success = rte_atomic128_cmpxchg((rte_int128_t *)&lifo->head,
                                    ^~~~~~~~~~~~
/tmp/FC25_K4.8.6_GCC6.3.1/x86_64-native-linuxapp-gcc/91c7295957a14970a0a90581237546fe/dpdk/lib/librte_stack/rte_stack_generic.h:146:50: error: expected expression before ‘)’ token
   success = rte_atomic128_cmpxchg((rte_int128_t *)&lifo->head,
                                                  ^
/tmp/FC25_K4.8.6_GCC6.3.1/x86_64-native-linuxapp-gcc/91c7295957a14970a0a90581237546fe/dpdk/lib/librte_stack/rte_stack_generic.h:111:27: warning: variable ‘new_head’ set but not used [-Wunused-but-set-variable]
   struct rte_nb_lifo_head new_head;
                           ^~~~~~~~
/tmp/FC25_K4.8.6_GCC6.3.1/x86_64-native-linuxapp-gcc/91c7295957a14970a0a90581237546fe/dpdk/mk/internal/rte.compile-pre.mk:114: recipe for target 'rte_stack.o' failed
make[5]: *** [rte_stack.o] Error 1
/tmp/FC25_K4.8.6_GCC6.3.1/x86_64-native-linuxapp-gcc/91c7295957a14970a0a90581237546fe/dpdk/mk/rte.subdir.mk:35: recipe for target 'librte_stack' failed
make[4]: *** [librte_stack] Error 2
make[4]: *** Waiting for unfinished jobs....
  SYMLINK-FILE include/rte_mempool.h
  CC rte_mempool.o
  CC rte_mempool_ops.o
  AR librte_power.a
  INSTALL-LIB librte_power.a
  CC rte_mempool_ops_default.o
  AR librte_mempool.a
  INSTALL-LIB librte_mempool.a
/tmp/FC25_K4.8.6_GCC6.3.1/x86_64-native-linuxapp-gcc/91c7295957a14970a0a90581237546fe/dpdk/mk/rte.sdkbuild.mk:49: recipe for target 'lib' failed
make[3]: *** [lib] Error 2
/tmp/FC25_K4.8.6_GCC6.3.1/x86_64-native-linuxapp-gcc/91c7295957a14970a0a90581237546fe/dpdk/mk/rte.sdkroot.mk:100: recipe for target 'all' failed
make[2]: *** [all] Error 2
/tmp/FC25_K4.8.6_GCC6.3.1/x86_64-native-linuxapp-gcc/91c7295957a14970a0a90581237546fe/dpdk/mk/rte.sdkinstall.mk:57: recipe for target 'pre_install' failed
make[1]: *** [pre_install] Error 2
/tmp/FC25_K4.8.6_GCC6.3.1/x86_64-native-linuxapp-gcc/91c7295957a14970a0a90581237546fe/dpdk/mk/rte.sdkroot.mk:79: recipe for target 'install' failed
make: *** [install] Error 2

*Failed Build #2:
OS: UBT1804
Target: x86_64-native-linuxapp-gcc
  SYMLINK-FILE include/rte_stack_c11_mem.h
  CC rte_stack.o
In file included from /tmp/UBT1804_K4.15.0_GCC7.3.0/x86_64-native-linuxapp-gcc/91c7295957a14970a0a90581237546fe/dpdk/lib/librte_stack/rte_stack.h:94:0,
                 from /tmp/UBT1804_K4.15.0_GCC7.3.0/x86_64-native-linuxapp-gcc/91c7295957a14970a0a90581237546fe/dpdk/lib/librte_stack/rte_stack.c:16:
/tmp/UBT1804_K4.15.0_GCC7.3.0/x86_64-native-linuxapp-gcc/91c7295957a14970a0a90581237546fe/dpdk/lib/librte_stack/rte_stack_generic.h: In function ‘__nb_lifo_push’:
/tmp/UBT1804_K4.15.0_GCC7.3.0/x86_64-native-linuxapp-gcc/91c7295957a14970a0a90581237546fe/dpdk/lib/librte_stack/rte_stack_generic.h:66:13: warning: implicit declaration of function ‘rte_atomic128_cmpxchg’; did you mean ‘rte_atomic32_cmpset’? [-Wimplicit-function-declaration]
   success = rte_atomic128_cmpxchg((rte_int128_t *)&lifo->head,
             ^~~~~~~~~~~~~~~~~~~~~
             rte_atomic32_cmpset
/tmp/UBT1804_K4.15.0_GCC7.3.0/x86_64-native-linuxapp-gcc/91c7295957a14970a0a90581237546fe/dpdk/lib/librte_stack/rte_stack_generic.h:66:13: warning: nested extern declaration of ‘rte_atomic128_cmpxchg’ [-Wnested-externs]
/tmp/UBT1804_K4.15.0_GCC7.3.0/x86_64-native-linuxapp-gcc/91c7295957a14970a0a90581237546fe/dpdk/lib/librte_stack/rte_stack_generic.h:66:36: error: ‘rte_int128_t’ undeclared (first use in this function); did you mean ‘__int128_t’?
   success = rte_atomic128_cmpxchg((rte_int128_t *)&lifo->head,
                                    ^~~~~~~~~~~~
                                    __int128_t
/tmp/UBT1804_K4.15.0_GCC7.3.0/x86_64-native-linuxapp-gcc/91c7295957a14970a0a90581237546fe/dpdk/lib/librte_stack/rte_stack_generic.h:66:36: note: each undeclared identifier is reported only once for each function it appears in
/tmp/UBT1804_K4.15.0_GCC7.3.0/x86_64-native-linuxapp-gcc/91c7295957a14970a0a90581237546fe/dpdk/lib/librte_stack/rte_stack_generic.h:66:50: error: expected expression before ‘)’ token
   success = rte_atomic128_cmpxchg((rte_int128_t *)&lifo->head,
                                                  ^
/tmp/UBT1804_K4.15.0_GCC7.3.0/x86_64-native-linuxapp-gcc/91c7295957a14970a0a90581237546fe/dpdk/lib/librte_stack/rte_stack_generic.h:50:27: warning: variable ‘new_head’ set but not used [-Wunused-but-set-variable]
   struct rte_nb_lifo_head new_head;
                           ^~~~~~~~
/tmp/UBT1804_K4.15.0_GCC7.3.0/x86_64-native-linuxapp-gcc/91c7295957a14970a0a90581237546fe/dpdk/lib/librte_stack/rte_stack_generic.h: In function ‘__nb_lifo_pop’:
/tmp/UBT1804_K4.15.0_GCC7.3.0/x86_64-native-linuxapp-gcc/91c7295957a14970a0a90581237546fe/dpdk/lib/librte_stack/rte_stack_generic.h:146:36: error: ‘rte_int128_t’ undeclared (first use in this function); did you mean ‘__int128_t’?
   success = rte_atomic128_cmpxchg((rte_int128_t *)&lifo->head,
                                    ^~~~~~~~~~~~
                                    __int128_t
/tmp/UBT1804_K4.15.0_GCC7.3.0/x86_64-native-linuxapp-gcc/91c7295957a14970a0a90581237546fe/dpdk/lib/librte_stack/rte_stack_generic.h:146:50: error: expected expression before ‘)’ token
   success = rte_atomic128_cmpxchg((rte_int128_t *)&lifo->head,
                                                  ^
/tmp/UBT1804_K4.15.0_GCC7.3.0/x86_64-native-linuxapp-gcc/91c7295957a14970a0a90581237546fe/dpdk/lib/librte_stack/rte_stack_generic.h:111:27: warning: variable ‘new_head’ set but not used [-Wunused-but-set-variable]
   struct rte_nb_lifo_head new_head;
                           ^~~~~~~~
/tmp/UBT1804_K4.15.0_GCC7.3.0/x86_64-native-linuxapp-gcc/91c7295957a14970a0a90581237546fe/dpdk/mk/internal/rte.compile-pre.mk:114: recipe for target 'rte_stack.o' failed
make[5]: *** [rte_stack.o] Error 1
/tmp/UBT1804_K4.15.0_GCC7.3.0/x86_64-native-linuxapp-gcc/91c7295957a14970a0a90581237546fe/dpdk/mk/rte.subdir.mk:35: recipe for target 'librte_stack' failed
make[4]: *** [librte_stack] Error 2
make[4]: *** Waiting for unfinished jobs....
  AR librte_acl.a
  INSTALL-LIB librte_acl.a
  AR librte_power.a
  INSTALL-LIB librte_power.a
/tmp/UBT1804_K4.15.0_GCC7.3.0/x86_64-native-linuxapp-gcc/91c7295957a14970a0a90581237546fe/dpdk/mk/rte.sdkbuild.mk:49: recipe for target 'lib' failed
make[3]: *** [lib] Error 2
/tmp/UBT1804_K4.15.0_GCC7.3.0/x86_64-native-linuxapp-gcc/91c7295957a14970a0a90581237546fe/dpdk/mk/rte.sdkroot.mk:100: recipe for target 'all' failed
make[2]: *** [all] Error 2
/tmp/UBT1804_K4.15.0_GCC7.3.0/x86_64-native-linuxapp-gcc/91c7295957a14970a0a90581237546fe/dpdk/mk/rte.sdkinstall.mk:57: recipe for target 'pre_install' failed
make[1]: *** [pre_install] Error 2
/tmp/UBT1804_K4.15.0_GCC7.3.0/x86_64-native-linuxapp-gcc/91c7295957a14970a0a90581237546fe/dpdk/mk/rte.sdkroot.mk:79: recipe for target 'install' failed
make: *** [install] Error 2

*Failed Build #3:
OS: UB1604
Target: x86_64-native-linuxapp-gcc
  CC acl_run_scalar.o
  CC rte_stack.o
In file included from /tmp/UB1604_K4.8.0_GCC6.2.0/x86_64-native-linuxapp-gcc/91c7295957a14970a0a90581237546fe/dpdk/lib/librte_stack/rte_stack.h:94:0,
                 from /tmp/UB1604_K4.8.0_GCC6.2.0/x86_64-native-linuxapp-gcc/91c7295957a14970a0a90581237546fe/dpdk/lib/librte_stack/rte_stack.c:16:
/tmp/UB1604_K4.8.0_GCC6.2.0/x86_64-native-linuxapp-gcc/91c7295957a14970a0a90581237546fe/dpdk/lib/librte_stack/rte_stack_generic.h: In function ‘__nb_lifo_push’:
/tmp/UB1604_K4.8.0_GCC6.2.0/x86_64-native-linuxapp-gcc/91c7295957a14970a0a90581237546fe/dpdk/lib/librte_stack/rte_stack_generic.h:66:13: warning: implicit declaration of function ‘rte_atomic128_cmpxchg’ [-Wimplicit-function-declaration]
   success = rte_atomic128_cmpxchg((rte_int128_t *)&lifo->head,
             ^~~~~~~~~~~~~~~~~~~~~
/tmp/UB1604_K4.8.0_GCC6.2.0/x86_64-native-linuxapp-gcc/91c7295957a14970a0a90581237546fe/dpdk/lib/librte_stack/rte_stack_generic.h:66:3: warning: nested extern declaration of ‘rte_atomic128_cmpxchg’ [-Wnested-externs]
   success = rte_atomic128_cmpxchg((rte_int128_t *)&lifo->head,
   ^~~~~~~
/tmp/UB1604_K4.8.0_GCC6.2.0/x86_64-native-linuxapp-gcc/91c7295957a14970a0a90581237546fe/dpdk/lib/librte_stack/rte_stack_generic.h:66:36: error: ‘rte_int128_t’ undeclared (first use in this function)
   success = rte_atomic128_cmpxchg((rte_int128_t *)&lifo->head,
                                    ^~~~~~~~~~~~
/tmp/UB1604_K4.8.0_GCC6.2.0/x86_64-native-linuxapp-gcc/91c7295957a14970a0a90581237546fe/dpdk/lib/librte_stack/rte_stack_generic.h:66:36: note: each undeclared identifier is reported only once for each function it appears in
/tmp/UB1604_K4.8.0_GCC6.2.0/x86_64-native-linuxapp-gcc/91c7295957a14970a0a90581237546fe/dpdk/lib/librte_stack/rte_stack_generic.h:66:50: error: expected expression before ‘)’ token
   success = rte_atomic128_cmpxchg((rte_int128_t *)&lifo->head,
                                                  ^
/tmp/UB1604_K4.8.0_GCC6.2.0/x86_64-native-linuxapp-gcc/91c7295957a14970a0a90581237546fe/dpdk/lib/librte_stack/rte_stack_generic.h:50:27: warning: variable ‘new_head’ set but not used [-Wunused-but-set-variable]
   struct rte_nb_lifo_head new_head;
                           ^~~~~~~~
/tmp/UB1604_K4.8.0_GCC6.2.0/x86_64-native-linuxapp-gcc/91c7295957a14970a0a90581237546fe/dpdk/lib/librte_stack/rte_stack_generic.h: In function ‘__nb_lifo_pop’:
/tmp/UB1604_K4.8.0_GCC6.2.0/x86_64-native-linuxapp-gcc/91c7295957a14970a0a90581237546fe/dpdk/lib/librte_stack/rte_stack_generic.h:146:36: error: ‘rte_int128_t’ undeclared (first use in this function)
   success = rte_atomic128_cmpxchg((rte_int128_t *)&lifo->head,
                                    ^~~~~~~~~~~~
/tmp/UB1604_K4.8.0_GCC6.2.0/x86_64-native-linuxapp-gcc/91c7295957a14970a0a90581237546fe/dpdk/lib/librte_stack/rte_stack_generic.h:146:50: error: expected expression before ‘)’ token
   success = rte_atomic128_cmpxchg((rte_int128_t *)&lifo->head,
                                                  ^
/tmp/UB1604_K4.8.0_GCC6.2.0/x86_64-native-linuxapp-gcc/91c7295957a14970a0a90581237546fe/dpdk/lib/librte_stack/rte_stack_generic.h:111:27: warning: variable ‘new_head’ set but not used [-Wunused-but-set-variable]
   struct rte_nb_lifo_head new_head;
                           ^~~~~~~~
/tmp/UB1604_K4.8.0_GCC6.2.0/x86_64-native-linuxapp-gcc/91c7295957a14970a0a90581237546fe/dpdk/mk/internal/rte.compile-pre.mk:114: recipe for target 'rte_stack.o' failed
make[5]: *** [rte_stack.o] Error 1
/tmp/UB1604_K4.8.0_GCC6.2.0/x86_64-native-linuxapp-gcc/91c7295957a14970a0a90581237546fe/dpdk/mk/rte.subdir.mk:35: recipe for target 'librte_stack' failed
make[4]: *** [librte_stack] Error 2
make[4]: *** Waiting for unfinished jobs....
  CC acl_run_sse.o
  CC power_kvm_vm.o
  CC acl_run_avx2.o
--
  CC power_pstate_cpufreq.o
  AR librte_power.a
  INSTALL-LIB librte_power.a
  AR librte_acl.a
  INSTALL-LIB librte_acl.a
/tmp/UB1604_K4.8.0_GCC6.2.0/x86_64-native-linuxapp-gcc/91c7295957a14970a0a90581237546fe/dpdk/mk/rte.sdkbuild.mk:49: recipe for target 'lib' failed
make[3]: *** [lib] Error 2
/tmp/UB1604_K4.8.0_GCC6.2.0/x86_64-native-linuxapp-gcc/91c7295957a14970a0a90581237546fe/dpdk/mk/rte.sdkroot.mk:100: recipe for target 'all' failed
make[2]: *** [all] Error 2
/tmp/UB1604_K4.8.0_GCC6.2.0/x86_64-native-linuxapp-gcc/91c7295957a14970a0a90581237546fe/dpdk/mk/rte.sdkinstall.mk:57: recipe for target 'pre_install' failed
make[1]: *** [pre_install] Error 2
/tmp/UB1604_K4.8.0_GCC6.2.0/x86_64-native-linuxapp-gcc/91c7295957a14970a0a90581237546fe/dpdk/mk/rte.sdkroot.mk:79: recipe for target 'install' failed
make: *** [install] Error 2

*Failed Build #4:
OS: CENTOS
Target: x86_64-native-linuxapp-clang
  SYMLINK-FILE include/rte_stack_c11_mem.h
  CC rte_power.o
  CC rte_stack.o
In file included from /tmp/CENTOS_K3.10.0_GCC4.8.5/x86_64-native-linuxapp-clang/91c7295957a14970a0a90581237546fe/dpdk/lib/librte_stack/rte_stack.c:16:
In file included from /tmp/CENTOS_K3.10.0_GCC4.8.5/x86_64-native-linuxapp-clang/91c7295957a14970a0a90581237546fe/dpdk/lib/librte_stack/rte_stack.h:94:
/tmp/CENTOS_K3.10.0_GCC4.8.5/x86_64-native-linuxapp-clang/91c7295957a14970a0a90581237546fe/dpdk/lib/librte_stack/rte_stack_generic.h:66:13: warning: implicit declaration of function 'rte_atomic128_cmpxchg' is invalid in C99 [-Wimplicit-function-declaration]
                success = rte_atomic128_cmpxchg((rte_int128_t *)&lifo->head,
                          ^
  CC acl_run_sse.o
  CC power_acpi_cpufreq.o
  CC acl_run_avx2.o
/tmp/CENTOS_K3.10.0_GCC4.8.5/x86_64-native-linuxapp-clang/91c7295957a14970a0a90581237546fe/dpdk/lib/librte_stack/rte_stack_generic.h:66:36: error: use of undeclared identifier 'rte_int128_t'; did you mean '__int128_t'?
                success = rte_atomic128_cmpxchg((rte_int128_t *)&lifo->head,
                                                 ^
note: '__int128_t' declared here
/tmp/CENTOS_K3.10.0_GCC4.8.5/x86_64-native-linuxapp-clang/91c7295957a14970a0a90581237546fe/dpdk/lib/librte_stack/rte_stack_generic.h:66:50: error: expected expression
                success = rte_atomic128_cmpxchg((rte_int128_t *)&lifo->head,
                                                               ^
/tmp/CENTOS_K3.10.0_GCC4.8.5/x86_64-native-linuxapp-clang/91c7295957a14970a0a90581237546fe/dpdk/lib/librte_stack/rte_stack_generic.h:146:36: error: use of undeclared identifier 'rte_int128_t'; did you mean '__int128_t'?
                success = rte_atomic128_cmpxchg((rte_int128_t *)&lifo->head,
                                                 ^
note: '__int128_t' declared here
/tmp/CENTOS_K3.10.0_GCC4.8.5/x86_64-native-linuxapp-clang/91c7295957a14970a0a90581237546fe/dpdk/lib/librte_stack/rte_stack_generic.h:146:50: error: expected expression
                success = rte_atomic128_cmpxchg((rte_int128_t *)&lifo->head,
                                                               ^
1 warning and 4 errors generated.
make[5]: *** [rte_stack.o] Error 1
make[4]: *** [librte_stack] Error 2
make[4]: *** Waiting for unfinished jobs....
  CC power_kvm_vm.o
  CC guest_channel.o

*Failed Build #5:
OS: CENTOS
Target: x86_64-native-linuxapp-gcc-shared
  CC rte_stack.o
  CC power_acpi_cpufreq.o
In file included from /tmp/CENTOS_K3.10.0_GCC4.8.5/x86_64-native-linuxapp-gcc-shared/91c7295957a14970a0a90581237546fe/dpdk/lib/librte_stack/rte_stack.h:94:0,
                 from /tmp/CENTOS_K3.10.0_GCC4.8.5/x86_64-native-linuxapp-gcc-shared/91c7295957a14970a0a90581237546fe/dpdk/lib/librte_stack/rte_stack.c:16:
/tmp/CENTOS_K3.10.0_GCC4.8.5/x86_64-native-linuxapp-gcc-shared/91c7295957a14970a0a90581237546fe/dpdk/lib/librte_stack/rte_stack_generic.h: In function ‘__nb_lifo_push’:
/tmp/CENTOS_K3.10.0_GCC4.8.5/x86_64-native-linuxapp-gcc-shared/91c7295957a14970a0a90581237546fe/dpdk/lib/librte_stack/rte_stack_generic.h:66:3: warning: implicit declaration of function ‘rte_atomic128_cmpxchg’ [-Wimplicit-function-declaration]
   success = rte_atomic128_cmpxchg((rte_int128_t *)&lifo->head,
   ^
/tmp/CENTOS_K3.10.0_GCC4.8.5/x86_64-native-linuxapp-gcc-shared/91c7295957a14970a0a90581237546fe/dpdk/lib/librte_stack/rte_stack_generic.h:66:3: warning: nested extern declaration of ‘rte_atomic128_cmpxchg’ [-Wnested-externs]
/tmp/CENTOS_K3.10.0_GCC4.8.5/x86_64-native-linuxapp-gcc-shared/91c7295957a14970a0a90581237546fe/dpdk/lib/librte_stack/rte_stack_generic.h:66:36: error: ‘rte_int128_t’ undeclared (first use in this function)
   success = rte_atomic128_cmpxchg((rte_int128_t *)&lifo->head,
                                    ^
/tmp/CENTOS_K3.10.0_GCC4.8.5/x86_64-native-linuxapp-gcc-shared/91c7295957a14970a0a90581237546fe/dpdk/lib/librte_stack/rte_stack_generic.h:66:36: note: each undeclared identifier is reported only once for each function it appears in
/tmp/CENTOS_K3.10.0_GCC4.8.5/x86_64-native-linuxapp-gcc-shared/91c7295957a14970a0a90581237546fe/dpdk/lib/librte_stack/rte_stack_generic.h:66:50: error: expected expression before ‘)’ token
   success = rte_atomic128_cmpxchg((rte_int128_t *)&lifo->head,
                                                  ^
/tmp/CENTOS_K3.10.0_GCC4.8.5/x86_64-native-linuxapp-gcc-shared/91c7295957a14970a0a90581237546fe/dpdk/lib/librte_stack/rte_stack_generic.h:50:27: warning: variable ‘new_head’ set but not used [-Wunused-but-set-variable]
   struct rte_nb_lifo_head new_head;
                           ^
/tmp/CENTOS_K3.10.0_GCC4.8.5/x86_64-native-linuxapp-gcc-shared/91c7295957a14970a0a90581237546fe/dpdk/lib/librte_stack/rte_stack_generic.h: In function ‘__nb_lifo_pop’:
/tmp/CENTOS_K3.10.0_GCC4.8.5/x86_64-native-linuxapp-gcc-shared/91c7295957a14970a0a90581237546fe/dpdk/lib/librte_stack/rte_stack_generic.h:146:36: error: ‘rte_int128_t’ undeclared (first use in this function)
   success = rte_atomic128_cmpxchg((rte_int128_t *)&lifo->head,
                                    ^
/tmp/CENTOS_K3.10.0_GCC4.8.5/x86_64-native-linuxapp-gcc-shared/91c7295957a14970a0a90581237546fe/dpdk/lib/librte_stack/rte_stack_generic.h:146:50: error: expected expression before ‘)’ token
   success = rte_atomic128_cmpxchg((rte_int128_t *)&lifo->head,
                                                  ^
/tmp/CENTOS_K3.10.0_GCC4.8.5/x86_64-native-linuxapp-gcc-shared/91c7295957a14970a0a90581237546fe/dpdk/lib/librte_stack/rte_stack_generic.h:111:27: warning: variable ‘new_head’ set but not used [-Wunused-but-set-variable]
   struct rte_nb_lifo_head new_head;
                           ^
make[5]: *** [rte_stack.o] Error 1
make[4]: *** [librte_stack] Error 2
make[4]: *** Waiting for unfinished jobs....

*Failed Build #6:
OS: UB1604
Target: x86_64-native-linuxapp-clang
  CC rte_stack.o
  CC power_acpi_cpufreq.o
  CC acl_run_avx2.o
In file included from /tmp/UB1604_K4.4.0_GCC5.4.0/x86_64-native-linuxapp-clang/91c7295957a14970a0a90581237546fe/dpdk/lib/librte_stack/rte_stack.c:16:
In file included from /tmp/UB1604_K4.4.0_GCC5.4.0/x86_64-native-linuxapp-clang/91c7295957a14970a0a90581237546fe/dpdk/lib/librte_stack/rte_stack.h:94:
/tmp/UB1604_K4.4.0_GCC5.4.0/x86_64-native-linuxapp-clang/91c7295957a14970a0a90581237546fe/dpdk/lib/librte_stack/rte_stack_generic.h:66:13: warning: implicit declaration of function 'rte_atomic128_cmpxchg' is invalid in C99 [-Wimplicit-function-declaration]
                success = rte_atomic128_cmpxchg((rte_int128_t *)&lifo->head,
                          ^
/tmp/UB1604_K4.4.0_GCC5.4.0/x86_64-native-linuxapp-clang/91c7295957a14970a0a90581237546fe/dpdk/lib/librte_stack/rte_stack_generic.h:66:50: error: expected expression
                success = rte_atomic128_cmpxchg((rte_int128_t *)&lifo->head,
                                                               ^
/tmp/UB1604_K4.4.0_GCC5.4.0/x86_64-native-linuxapp-clang/91c7295957a14970a0a90581237546fe/dpdk/lib/librte_stack/rte_stack_generic.h:66:36: error: use of undeclared identifier 'rte_int128_t'
                success = rte_atomic128_cmpxchg((rte_int128_t *)&lifo->head,
                                                 ^
/tmp/UB1604_K4.4.0_GCC5.4.0/x86_64-native-linuxapp-clang/91c7295957a14970a0a90581237546fe/dpdk/lib/librte_stack/rte_stack_generic.h:67:28: error: expected expression
                                               (rte_int128_t *)&old_head,
                                                              ^
/tmp/UB1604_K4.4.0_GCC5.4.0/x86_64-native-linuxapp-clang/91c7295957a14970a0a90581237546fe/dpdk/lib/librte_stack/rte_stack_generic.h:67:14: error: use of undeclared identifier 'rte_int128_t'
                                               (rte_int128_t *)&old_head,
                                                ^
/tmp/UB1604_K4.4.0_GCC5.4.0/x86_64-native-linuxapp-clang/91c7295957a14970a0a90581237546fe/dpdk/lib/librte_stack/rte_stack_generic.h:68:28: error: expected expression
                                               (rte_int128_t *)&new_head,
                                                              ^
/tmp/UB1604_K4.4.0_GCC5.4.0/x86_64-native-linuxapp-clang/91c7295957a14970a0a90581237546fe/dpdk/lib/librte_stack/rte_stack_generic.h:68:14: error: use of undeclared identifier 'rte_int128_t'
                                               (rte_int128_t *)&new_head,
                                                ^
/tmp/UB1604_K4.4.0_GCC5.4.0/x86_64-native-linuxapp-clang/91c7295957a14970a0a90581237546fe/dpdk/lib/librte_stack/rte_stack_generic.h:146:50: error: expected expression
                success = rte_atomic128_cmpxchg((rte_int128_t *)&lifo->head,
                                                               ^
/tmp/UB1604_K4.4.0_GCC5.4.0/x86_64-native-linuxapp-clang/91c7295957a14970a0a90581237546fe/dpdk/lib/librte_stack/rte_stack_generic.h:146:36: error: use of undeclared identifier 'rte_int128_t'
                success = rte_atomic128_cmpxchg((rte_int128_t *)&lifo->head,
                                                 ^
/tmp/UB1604_K4.4.0_GCC5.4.0/x86_64-native-linuxapp-clang/91c7295957a14970a0a90581237546fe/dpdk/lib/librte_stack/rte_stack_generic.h:147:22: error: expected expression
                                                (rte_int128_t *)&old_head,
                                                               ^
/tmp/UB1604_K4.4.0_GCC5.4.0/x86_64-native-linuxapp-clang/91c7295957a14970a0a90581237546fe/dpdk/lib/librte_stack/rte_stack_generic.h:147:8: error: use of undeclared identifier 'rte_int128_t'
                                                (rte_int128_t *)&old_head,
                                                 ^
/tmp/UB1604_K4.4.0_GCC5.4.0/x86_64-native-linuxapp-clang/91c7295957a14970a0a90581237546fe/dpdk/lib/librte_stack/rte_stack_generic.h:148:22: error: expected expression
                                                (rte_int128_t *)&new_head,
                                                               ^
/tmp/UB1604_K4.4.0_GCC5.4.0/x86_64-native-linuxapp-clang/91c7295957a14970a0a90581237546fe/dpdk/lib/librte_stack/rte_stack_generic.h:148:8: error: use of undeclared identifier 'rte_int128_t'
                                                (rte_int128_t *)&new_head,
                                                 ^
1 warning and 12 errors generated.
/tmp/UB1604_K4.4.0_GCC5.4.0/x86_64-native-linuxapp-clang/91c7295957a14970a0a90581237546fe/dpdk/mk/internal/rte.compile-pre.mk:114: recipe for target 'rte_stack.o' failed
make[5]: *** [rte_stack.o] Error 1
/tmp/UB1604_K4.4.0_GCC5.4.0/x86_64-native-linuxapp-clang/91c7295957a14970a0a90581237546fe/dpdk/mk/rte.subdir.mk:35: recipe for target 'librte_stack' failed
make[4]: *** [librte_stack] Error 2
make[4]: *** Waiting for unfinished jobs....
  CC power_kvm_vm.o
  CC guest_channel.o
  CC rte_power_empty_poll.o
  CC power_pstate_cpufreq.o
  AR librte_acl.a
  INSTALL-LIB librte_acl.a
  AR librte_power.a
  INSTALL-LIB librte_power.a
/tmp/UB1604_K4.4.0_GCC5.4.0/x86_64-native-linuxapp-clang/91c7295957a14970a0a90581237546fe/dpdk/mk/rte.sdkbuild.mk:49: recipe for target 'lib' failed
make[3]: *** [lib] Error 2
/tmp/UB1604_K4.4.0_GCC5.4.0/x86_64-native-linuxapp-clang/91c7295957a14970a0a90581237546fe/dpdk/mk/rte.sdkroot.mk:100: recipe for target 'all' failed
make[2]: *** [all] Error 2
/tmp/UB1604_K4.4.0_GCC5.4.0/x86_64-native-linuxapp-clang/91c7295957a14970a0a90581237546fe/dpdk/mk/rte.sdkinstall.mk:57: recipe for target 'pre_install' failed
make[1]: *** [pre_install] Error 2
/tmp/UB1604_K4.4.0_GCC5.4.0/x86_64-native-linuxapp-clang/91c7295957a14970a0a90581237546fe/dpdk/mk/rte.sdkroot.mk:79: recipe for target 'install' failed
make: *** [install] Error 2

*Failed Build #7:
OS: CENTOS
Target: x86_64-native-linuxapp-gcc
  SYMLINK-FILE include/rte_stack_c11_mem.h
  CC rte_stack.o
In file included from /tmp/CENTOS_K3.10.0_GCC4.8.5/x86_64-native-linuxapp-gcc/91c7295957a14970a0a90581237546fe/dpdk/lib/librte_stack/rte_stack.h:94:0,
                 from /tmp/CENTOS_K3.10.0_GCC4.8.5/x86_64-native-linuxapp-gcc/91c7295957a14970a0a90581237546fe/dpdk/lib/librte_stack/rte_stack.c:16:
/tmp/CENTOS_K3.10.0_GCC4.8.5/x86_64-native-linuxapp-gcc/91c7295957a14970a0a90581237546fe/dpdk/lib/librte_stack/rte_stack_generic.h: In function ‘__nb_lifo_push’:
/tmp/CENTOS_K3.10.0_GCC4.8.5/x86_64-native-linuxapp-gcc/91c7295957a14970a0a90581237546fe/dpdk/lib/librte_stack/rte_stack_generic.h:66:3: warning: implicit declaration of function ‘rte_atomic128_cmpxchg’ [-Wimplicit-function-declaration]
   success = rte_atomic128_cmpxchg((rte_int128_t *)&lifo->head,
   ^
/tmp/CENTOS_K3.10.0_GCC4.8.5/x86_64-native-linuxapp-gcc/91c7295957a14970a0a90581237546fe/dpdk/lib/librte_stack/rte_stack_generic.h:66:3: warning: nested extern declaration of ‘rte_atomic128_cmpxchg’ [-Wnested-externs]
/tmp/CENTOS_K3.10.0_GCC4.8.5/x86_64-native-linuxapp-gcc/91c7295957a14970a0a90581237546fe/dpdk/lib/librte_stack/rte_stack_generic.h:66:36: error: ‘rte_int128_t’ undeclared (first use in this function)
   success = rte_atomic128_cmpxchg((rte_int128_t *)&lifo->head,
                                    ^
/tmp/CENTOS_K3.10.0_GCC4.8.5/x86_64-native-linuxapp-gcc/91c7295957a14970a0a90581237546fe/dpdk/lib/librte_stack/rte_stack_generic.h:66:36: note: each undeclared identifier is reported only once for each function it appears in
/tmp/CENTOS_K3.10.0_GCC4.8.5/x86_64-native-linuxapp-gcc/91c7295957a14970a0a90581237546fe/dpdk/lib/librte_stack/rte_stack_generic.h:66:50: error: expected expression before ‘)’ token
   success = rte_atomic128_cmpxchg((rte_int128_t *)&lifo->head,
                                                  ^
/tmp/CENTOS_K3.10.0_GCC4.8.5/x86_64-native-linuxapp-gcc/91c7295957a14970a0a90581237546fe/dpdk/lib/librte_stack/rte_stack_generic.h:50:27: warning: variable ‘new_head’ set but not used [-Wunused-but-set-variable]
   struct rte_nb_lifo_head new_head;
                           ^
/tmp/CENTOS_K3.10.0_GCC4.8.5/x86_64-native-linuxapp-gcc/91c7295957a14970a0a90581237546fe/dpdk/lib/librte_stack/rte_stack_generic.h: In function ‘__nb_lifo_pop’:
/tmp/CENTOS_K3.10.0_GCC4.8.5/x86_64-native-linuxapp-gcc/91c7295957a14970a0a90581237546fe/dpdk/lib/librte_stack/rte_stack_generic.h:146:36: error: ‘rte_int128_t’ undeclared (first use in this function)
   success = rte_atomic128_cmpxchg((rte_int128_t *)&lifo->head,
                                    ^
/tmp/CENTOS_K3.10.0_GCC4.8.5/x86_64-native-linuxapp-gcc/91c7295957a14970a0a90581237546fe/dpdk/lib/librte_stack/rte_stack_generic.h:146:50: error: expected expression before ‘)’ token
   success = rte_atomic128_cmpxchg((rte_int128_t *)&lifo->head,
                                                  ^
/tmp/CENTOS_K3.10.0_GCC4.8.5/x86_64-native-linuxapp-gcc/91c7295957a14970a0a90581237546fe/dpdk/lib/librte_stack/rte_stack_generic.h:111:27: warning: variable ‘new_head’ set but not used [-Wunused-but-set-variable]
   struct rte_nb_lifo_head new_head;
                           ^
make[5]: *** [rte_stack.o] Error 1
make[4]: *** [librte_stack] Error 2
make[4]: *** Waiting for unfinished jobs....

*Failed Build #8:
OS: UB1604
Target: x86_64-native-linuxapp-gcc-shared
  SYMLINK-FILE include/rte_stack_c11_mem.h
  CC rte_stack.o
In file included from /tmp/UB1604_K4.4.0_GCC5.4.0/x86_64-native-linuxapp-gcc-shared/91c7295957a14970a0a90581237546fe/dpdk/lib/librte_stack/rte_stack.h:94:0,
                 from /tmp/UB1604_K4.4.0_GCC5.4.0/x86_64-native-linuxapp-gcc-shared/91c7295957a14970a0a90581237546fe/dpdk/lib/librte_stack/rte_stack.c:16:
/tmp/UB1604_K4.4.0_GCC5.4.0/x86_64-native-linuxapp-gcc-shared/91c7295957a14970a0a90581237546fe/dpdk/lib/librte_stack/rte_stack_generic.h: In function ‘__nb_lifo_push’:
/tmp/UB1604_K4.4.0_GCC5.4.0/x86_64-native-linuxapp-gcc-shared/91c7295957a14970a0a90581237546fe/dpdk/lib/librte_stack/rte_stack_generic.h:66:13: warning: implicit declaration of function ‘rte_atomic128_cmpxchg’ [-Wimplicit-function-declaration]
   success = rte_atomic128_cmpxchg((rte_int128_t *)&lifo->head,
             ^
/tmp/UB1604_K4.4.0_GCC5.4.0/x86_64-native-linuxapp-gcc-shared/91c7295957a14970a0a90581237546fe/dpdk/lib/librte_stack/rte_stack_generic.h:66:3: warning: nested extern declaration of ‘rte_atomic128_cmpxchg’ [-Wnested-externs]
   success = rte_atomic128_cmpxchg((rte_int128_t *)&lifo->head,
   ^
/tmp/UB1604_K4.4.0_GCC5.4.0/x86_64-native-linuxapp-gcc-shared/91c7295957a14970a0a90581237546fe/dpdk/lib/librte_stack/rte_stack_generic.h:66:36: error: ‘rte_int128_t’ undeclared (first use in this function)
   success = rte_atomic128_cmpxchg((rte_int128_t *)&lifo->head,
                                    ^
/tmp/UB1604_K4.4.0_GCC5.4.0/x86_64-native-linuxapp-gcc-shared/91c7295957a14970a0a90581237546fe/dpdk/lib/librte_stack/rte_stack_generic.h:66:36: note: each undeclared identifier is reported only once for each function it appears in
/tmp/UB1604_K4.4.0_GCC5.4.0/x86_64-native-linuxapp-gcc-shared/91c7295957a14970a0a90581237546fe/dpdk/lib/librte_stack/rte_stack_generic.h:66:50: error: expected expression before ‘)’ token
   success = rte_atomic128_cmpxchg((rte_int128_t *)&lifo->head,
                                                  ^
/tmp/UB1604_K4.4.0_GCC5.4.0/x86_64-native-linuxapp-gcc-shared/91c7295957a14970a0a90581237546fe/dpdk/lib/librte_stack/rte_stack_generic.h:50:27: warning: variable ‘new_head’ set but not used [-Wunused-but-set-variable]
   struct rte_nb_lifo_head new_head;
                           ^
/tmp/UB1604_K4.4.0_GCC5.4.0/x86_64-native-linuxapp-gcc-shared/91c7295957a14970a0a90581237546fe/dpdk/lib/librte_stack/rte_stack_generic.h: In function ‘__nb_lifo_pop’:
/tmp/UB1604_K4.4.0_GCC5.4.0/x86_64-native-linuxapp-gcc-shared/91c7295957a14970a0a90581237546fe/dpdk/lib/librte_stack/rte_stack_generic.h:146:36: error: ‘rte_int128_t’ undeclared (first use in this function)
   success = rte_atomic128_cmpxchg((rte_int128_t *)&lifo->head,
                                    ^
/tmp/UB1604_K4.4.0_GCC5.4.0/x86_64-native-linuxapp-gcc-shared/91c7295957a14970a0a90581237546fe/dpdk/lib/librte_stack/rte_stack_generic.h:146:50: error: expected expression before ‘)’ token
   success = rte_atomic128_cmpxchg((rte_int128_t *)&lifo->head,
                                                  ^
/tmp/UB1604_K4.4.0_GCC5.4.0/x86_64-native-linuxapp-gcc-shared/91c7295957a14970a0a90581237546fe/dpdk/lib/librte_stack/rte_stack_generic.h:111:27: warning: variable ‘new_head’ set but not used [-Wunused-but-set-variable]
   struct rte_nb_lifo_head new_head;
                           ^
/tmp/UB1604_K4.4.0_GCC5.4.0/x86_64-native-linuxapp-gcc-shared/91c7295957a14970a0a90581237546fe/dpdk/mk/internal/rte.compile-pre.mk:114: recipe for target 'rte_stack.o' failed
make[5]: *** [rte_stack.o] Error 1
/tmp/UB1604_K4.4.0_GCC5.4.0/x86_64-native-linuxapp-gcc-shared/91c7295957a14970a0a90581237546fe/dpdk/mk/rte.subdir.mk:35: recipe for target 'librte_stack' failed
make[4]: *** [librte_stack] Error 2
make[4]: *** Waiting for unfinished jobs....
  CC power_kvm_vm.o
  CC guest_channel.o
  LD librte_acl.so.2.1
  INSTALL-LIB librte_acl.so.2.1
  CC rte_power_empty_poll.o
  CC power_pstate_cpufreq.o
  LD librte_power.so.1.1
  INSTALL-LIB librte_power.so.1.1
/tmp/UB1604_K4.4.0_GCC5.4.0/x86_64-native-linuxapp-gcc-shared/91c7295957a14970a0a90581237546fe/dpdk/mk/rte.sdkbuild.mk:49: recipe for target 'lib' failed
make[3]: *** [lib] Error 2
/tmp/UB1604_K4.4.0_GCC5.4.0/x86_64-native-linuxapp-gcc-shared/91c7295957a14970a0a90581237546fe/dpdk/mk/rte.sdkroot.mk:100: recipe for target 'all' failed
make[2]: *** [all] Error 2
/tmp/UB1604_K4.4.0_GCC5.4.0/x86_64-native-linuxapp-gcc-shared/91c7295957a14970a0a90581237546fe/dpdk/mk/rte.sdkinstall.mk:57: recipe for target 'pre_install' failed
make[1]: *** [pre_install] Error 2
/tmp/UB1604_K4.4.0_GCC5.4.0/x86_64-native-linuxapp-gcc-shared/91c7295957a14970a0a90581237546fe/dpdk/mk/rte.sdkroot.mk:79: recipe for target 'install' failed
make: *** [install] Error 2

*Failed Build #9:
OS: FreeBSD
Target: x86_64-native-bsdapp-clang
In file included from /tmp/FreeBSD_K10.3_GCC4.8.5/x86_64-native-bsdapp-clang/91c7295957a14970a0a90581237546fe/dpdk/lib/librte_stack/rte_stack.c== Build lib/librte_mempool
  AR librte_acl.a
  INSTALL-LIB librte_acl.a
:16:
In file included from /tmp/FreeBSD_K10.3_GCC4.8.5/x86_64-native-bsdapp-clang/91c7295957a14970a0a90581237546fe/dpdk/lib/librte_stack/rte_stack.h:94:
/tmp/FreeBSD_K10.3_GCC4.8.5/x86_64-native-bsdapp-clang/91c7295957a14970a0a90581237546fe/dpdk/lib/librte_stack/rte_stack_generic.h:66:13: warning: implicit declaration of function 'rte_atomic128_cmpxchg' is invalid in C99 [-Wimplicit-function-declaration]
                success = rte_atomic128_cmpxchg((rte_int128_t *)&lifo->head,
                          ^
== Build lib/librte_efd
/tmp/FreeBSD_K10.3_GCC4.8.5/x86_64-native-bsdapp-clang/91c7295957a14970a0a90581237546fe/dpdk/lib/librte_stack/rte_stack_generic.h:66:36: error: use of undeclared identifier 'rte_int128_t'; did you mean '__int128_t'?
                success = rte_atomic128_cmpxchg((rte_int128_t *)&lifo->head,
                                                 ^
note: '__int128_t' declared here
/tmp/FreeBSD_K10.3_GCC4.8.5/x86_64-native-bsdapp-clang/91c7295957a14970a0a90581237546fe/dpdk/lib/librte_stack/rte_stack_generic.h:66:50: error: expected expression
                success = rte_atomic128_cmpxchg((rte_int128_t *)&lifo->head,
                                                               ^
/tmp/FreeBSD_K10.3_GCC4.8.5/x86_64-native-bsdapp-clang/91c7295957a14970a0a90581237546fe/dpdk/lib/librte_stack/rte_stack_generic.h:146:36: error: use of undeclared identifier 'rte_int128_t'; did you mean '__int128_t'?
                success = rte_atomic128_cmpxchg((rte_int128_t *)&lifo->head,
                                                 ^
note: '__int128_t' declared here
/tmp/FreeBSD_K10.3_GCC4.8.5/x86_64-native-bsdapp-clang/91c7295957a14970a0a90581237546fe/dpdk/lib/librte_stack/rte_stack_generic.h:146:50: error: expected expression
                success = rte_atomic128_cmpxchg((rte_int128_t *)&lifo->head,
                                                               ^
1 warning and 4 errors generated.
gmake[5]: *** [/tmp/FreeBSD_K10.3_GCC4.8.5/x86_64-native-bsdapp-clang/91c7295957a14970a0a90581237546fe/dpdk/mk/internal/rte.compile-pre.mk:116: rte_stack.o] Error 1
gmake[4]: *** [/tmp/FreeBSD_K10.3_GCC4.8.5/x86_64-native-bsdapp-clang/91c7295957a14970a0a90581237546fe/dpdk/mk/rte.subdir.mk:37: librte_stack] Error 2
gmake[4]: *** Waiting for unfinished jobs....
  SYMLINK-FILE include/rte_mempool.h
  CC rte_mempool.o

*Failed Build #10:
OS: FC24
Target: x86_64-native-linuxapp-clang
  SYMLINK-FILE include/rte_stack_generic.h
  SYMLINK-FILE include/rte_stack_c11_mem.h
  CC rte_stack.o
In file included from /tmp/FC24_K4.9.13_GCC6.2.1/x86_64-native-linuxapp-clang/91c7295957a14970a0a90581237546fe/dpdk/lib/librte_stack/rte_stack.c:16:
In file included from /tmp/FC24_K4.9.13_GCC6.2.1/x86_64-native-linuxapp-clang/91c7295957a14970a0a90581237546fe/dpdk/lib/librte_stack/rte_stack.h:94:
/tmp/FC24_K4.9.13_GCC6.2.1/x86_64-native-linuxapp-clang/91c7295957a14970a0a90581237546fe/dpdk/lib/librte_stack/rte_stack_generic.h:66:13: warning: implicit declaration of function 'rte_atomic128_cmpxchg' is invalid in C99 [-Wimplicit-function-declaration]
                success = rte_atomic128_cmpxchg((rte_int128_t *)&lifo->head,
                          ^
/tmp/FC24_K4.9.13_GCC6.2.1/x86_64-native-linuxapp-clang/91c7295957a14970a0a90581237546fe/dpdk/lib/librte_stack/rte_stack_generic.h:66:50: error: expected expression
                success = rte_atomic128_cmpxchg((rte_int128_t *)&lifo->head,
                                                               ^
/tmp/FC24_K4.9.13_GCC6.2.1/x86_64-native-linuxapp-clang/91c7295957a14970a0a90581237546fe/dpdk/lib/librte_stack/rte_stack_generic.h:66:36: error: use of undeclared identifier 'rte_int128_t'
                success = rte_atomic128_cmpxchg((rte_int128_t *)&lifo->head,
                                                 ^
/tmp/FC24_K4.9.13_GCC6.2.1/x86_64-native-linuxapp-clang/91c7295957a14970a0a90581237546fe/dpdk/lib/librte_stack/rte_stack_generic.h:67:28: error: expected expression
                                               (rte_int128_t *)&old_head,
                                                              ^
/tmp/FC24_K4.9.13_GCC6.2.1/x86_64-native-linuxapp-clang/91c7295957a14970a0a90581237546fe/dpdk/lib/librte_stack/rte_stack_generic.h:67:14: error: use of undeclared identifier 'rte_int128_t'
                                               (rte_int128_t *)&old_head,
                                                ^
/tmp/FC24_K4.9.13_GCC6.2.1/x86_64-native-linuxapp-clang/91c7295957a14970a0a90581237546fe/dpdk/lib/librte_stack/rte_stack_generic.h:68:28: error: expected expression
                                               (rte_int128_t *)&new_head,
                                                              ^
/tmp/FC24_K4.9.13_GCC6.2.1/x86_64-native-linuxapp-clang/91c7295957a14970a0a90581237546fe/dpdk/lib/librte_stack/rte_stack_generic.h:68:14: error: use of undeclared identifier 'rte_int128_t'
                                               (rte_int128_t *)&new_head,
                                                ^
/tmp/FC24_K4.9.13_GCC6.2.1/x86_64-native-linuxapp-clang/91c7295957a14970a0a90581237546fe/dpdk/lib/librte_stack/rte_stack_generic.h:146:50: error: expected expression
                success = rte_atomic128_cmpxchg((rte_int128_t *)&lifo->head,
                                                               ^
/tmp/FC24_K4.9.13_GCC6.2.1/x86_64-native-linuxapp-clang/91c7295957a14970a0a90581237546fe/dpdk/lib/librte_stack/rte_stack_generic.h:146:36: error: use of undeclared identifier 'rte_int128_t'
                success = rte_atomic128_cmpxchg((rte_int128_t *)&lifo->head,
                                                 ^
/tmp/FC24_K4.9.13_GCC6.2.1/x86_64-native-linuxapp-clang/91c7295957a14970a0a90581237546fe/dpdk/lib/librte_stack/rte_stack_generic.h:147:22: error: expected expression
                                                (rte_int128_t *)&old_head,
                                                               ^
/tmp/FC24_K4.9.13_GCC6.2.1/x86_64-native-linuxapp-clang/91c7295957a14970a0a90581237546fe/dpdk/lib/librte_stack/rte_stack_generic.h:147:8: error: use of undeclared identifier 'rte_int128_t'
                                                (rte_int128_t *)&old_head,
                                                 ^
/tmp/FC24_K4.9.13_GCC6.2.1/x86_64-native-linuxapp-clang/91c7295957a14970a0a90581237546fe/dpdk/lib/librte_stack/rte_stack_generic.h:148:22: error: expected expression
                                                (rte_int128_t *)&new_head,
                                                               ^
/tmp/FC24_K4.9.13_GCC6.2.1/x86_64-native-linuxapp-clang/91c7295957a14970a0a90581237546fe/dpdk/lib/librte_stack/rte_stack_generic.h:148:8: error: use of undeclared identifier 'rte_int128_t'
                                                (rte_int128_t *)&new_head,
                                                 ^
1 warning and 12 errors generated.
/tmp/FC24_K4.9.13_GCC6.2.1/x86_64-native-linuxapp-clang/91c7295957a14970a0a90581237546fe/dpdk/mk/internal/rte.compile-pre.mk:114: recipe for target 'rte_stack.o' failed
make[5]: *** [rte_stack.o] Error 1
/tmp/FC24_K4.9.13_GCC6.2.1/x86_64-native-linuxapp-clang/91c7295957a14970a0a90581237546fe/dpdk/mk/rte.subdir.mk:35: recipe for target 'librte_stack' failed
make[4]: *** [librte_stack] Error 2
make[4]: *** Waiting for unfinished jobs....
  CC power_kvm_vm.o
  AR librte_acl.a
  INSTALL-LIB librte_acl.a
  CC guest_channel.o
  CC rte_power_empty_poll.o
  CC power_pstate_cpufreq.o
  AR librte_power.a
  INSTALL-LIB librte_power.a
/tmp/FC24_K4.9.13_GCC6.2.1/x86_64-native-linuxapp-clang/91c7295957a14970a0a90581237546fe/dpdk/mk/rte.sdkbuild.mk:49: recipe for target 'lib' failed
make[3]: *** [lib] Error 2
/tmp/FC24_K4.9.13_GCC6.2.1/x86_64-native-linuxapp-clang/91c7295957a14970a0a90581237546fe/dpdk/mk/rte.sdkroot.mk:100: recipe for target 'all' failed
make[2]: *** [all] Error 2
/tmp/FC24_K4.9.13_GCC6.2.1/x86_64-native-linuxapp-clang/91c7295957a14970a0a90581237546fe/dpdk/mk/rte.sdkinstall.mk:57: recipe for target 'pre_install' failed
make[1]: *** [pre_install] Error 2
/tmp/FC24_K4.9.13_GCC6.2.1/x86_64-native-linuxapp-clang/91c7295957a14970a0a90581237546fe/dpdk/mk/rte.sdkroot.mk:79: recipe for target 'install' failed
make: *** [install] Error 2

*Failed Build #11:
OS: FC24
Target: x86_64-native-linuxapp-gcc-shared
  SYMLINK-FILE include/rte_stack_c11_mem.h
  CC rte_stack.o
In file included from /tmp/FC24_K4.9.13_GCC6.2.1/x86_64-native-linuxapp-gcc-shared/91c7295957a14970a0a90581237546fe/dpdk/lib/librte_stack/rte_stack.h:94:0,
                 from /tmp/FC24_K4.9.13_GCC6.2.1/x86_64-native-linuxapp-gcc-shared/91c7295957a14970a0a90581237546fe/dpdk/lib/librte_stack/rte_stack.c:16:
/tmp/FC24_K4.9.13_GCC6.2.1/x86_64-native-linuxapp-gcc-shared/91c7295957a14970a0a90581237546fe/dpdk/lib/librte_stack/rte_stack_generic.h: In function ‘__nb_lifo_push’:
/tmp/FC24_K4.9.13_GCC6.2.1/x86_64-native-linuxapp-gcc-shared/91c7295957a14970a0a90581237546fe/dpdk/lib/librte_stack/rte_stack_generic.h:66:13: warning: implicit declaration of function ‘rte_atomic128_cmpxchg’ [-Wimplicit-function-declaration]
   success = rte_atomic128_cmpxchg((rte_int128_t *)&lifo->head,
             ^~~~~~~~~~~~~~~~~~~~~
/tmp/FC24_K4.9.13_GCC6.2.1/x86_64-native-linuxapp-gcc-shared/91c7295957a14970a0a90581237546fe/dpdk/lib/librte_stack/rte_stack_generic.h:66:3: warning: nested extern declaration of ‘rte_atomic128_cmpxchg’ [-Wnested-externs]
   success = rte_atomic128_cmpxchg((rte_int128_t *)&lifo->head,
   ^~~~~~~
/tmp/FC24_K4.9.13_GCC6.2.1/x86_64-native-linuxapp-gcc-shared/91c7295957a14970a0a90581237546fe/dpdk/lib/librte_stack/rte_stack_generic.h:66:36: error: ‘rte_int128_t’ undeclared (first use in this function)
   success = rte_atomic128_cmpxchg((rte_int128_t *)&lifo->head,
                                    ^~~~~~~~~~~~
/tmp/FC24_K4.9.13_GCC6.2.1/x86_64-native-linuxapp-gcc-shared/91c7295957a14970a0a90581237546fe/dpdk/lib/librte_stack/rte_stack_generic.h:66:36: note: each undeclared identifier is reported only once for each function it appears in
/tmp/FC24_K4.9.13_GCC6.2.1/x86_64-native-linuxapp-gcc-shared/91c7295957a14970a0a90581237546fe/dpdk/lib/librte_stack/rte_stack_generic.h:66:50: error: expected expression before ‘)’ token
   success = rte_atomic128_cmpxchg((rte_int128_t *)&lifo->head,
                                                  ^
/tmp/FC24_K4.9.13_GCC6.2.1/x86_64-native-linuxapp-gcc-shared/91c7295957a14970a0a90581237546fe/dpdk/lib/librte_stack/rte_stack_generic.h:50:27: warning: variable ‘new_head’ set but not used [-Wunused-but-set-variable]
   struct rte_nb_lifo_head new_head;
                           ^~~~~~~~
/tmp/FC24_K4.9.13_GCC6.2.1/x86_64-native-linuxapp-gcc-shared/91c7295957a14970a0a90581237546fe/dpdk/lib/librte_stack/rte_stack_generic.h: In function ‘__nb_lifo_pop’:
/tmp/FC24_K4.9.13_GCC6.2.1/x86_64-native-linuxapp-gcc-shared/91c7295957a14970a0a90581237546fe/dpdk/lib/librte_stack/rte_stack_generic.h:146:36: error: ‘rte_int128_t’ undeclared (first use in this function)
   success = rte_atomic128_cmpxchg((rte_int128_t *)&lifo->head,
                                    ^~~~~~~~~~~~
/tmp/FC24_K4.9.13_GCC6.2.1/x86_64-native-linuxapp-gcc-shared/91c7295957a14970a0a90581237546fe/dpdk/lib/librte_stack/rte_stack_generic.h:146:50: error: expected expression before ‘)’ token
   success = rte_atomic128_cmpxchg((rte_int128_t *)&lifo->head,
                                                  ^
/tmp/FC24_K4.9.13_GCC6.2.1/x86_64-native-linuxapp-gcc-shared/91c7295957a14970a0a90581237546fe/dpdk/lib/librte_stack/rte_stack_generic.h:111:27: warning: variable ‘new_head’ set but not used [-Wunused-but-set-variable]
   struct rte_nb_lifo_head new_head;
                           ^~~~~~~~
/tmp/FC24_K4.9.13_GCC6.2.1/x86_64-native-linuxapp-gcc-shared/91c7295957a14970a0a90581237546fe/dpdk/mk/internal/rte.compile-pre.mk:114: recipe for target 'rte_stack.o' failed
make[5]: *** [rte_stack.o] Error 1
/tmp/FC24_K4.9.13_GCC6.2.1/x86_64-native-linuxapp-gcc-shared/91c7295957a14970a0a90581237546fe/dpdk/mk/rte.subdir.mk:35: recipe for target 'librte_stack' failed
make[4]: *** [librte_stack] Error 2
make[4]: *** Waiting for unfinished jobs....
  CC power_kvm_vm.o
  LD librte_acl.so.2.1
  INSTALL-LIB librte_acl.so.2.1
  CC guest_channel.o
  CC rte_power_empty_poll.o
  CC power_pstate_cpufreq.o
  LD librte_power.so.1.1
  INSTALL-LIB librte_power.so.1.1
/tmp/FC24_K4.9.13_GCC6.2.1/x86_64-native-linuxapp-gcc-shared/91c7295957a14970a0a90581237546fe/dpdk/mk/rte.sdkbuild.mk:49: recipe for target 'lib' failed
make[3]: *** [lib] Error 2
/tmp/FC24_K4.9.13_GCC6.2.1/x86_64-native-linuxapp-gcc-shared/91c7295957a14970a0a90581237546fe/dpdk/mk/rte.sdkroot.mk:100: recipe for target 'all' failed
make[2]: *** [all] Error 2
/tmp/FC24_K4.9.13_GCC6.2.1/x86_64-native-linuxapp-gcc-shared/91c7295957a14970a0a90581237546fe/dpdk/mk/rte.sdkinstall.mk:57: recipe for target 'pre_install' failed
make[1]: *** [pre_install] Error 2
/tmp/FC24_K4.9.13_GCC6.2.1/x86_64-native-linuxapp-gcc-shared/91c7295957a14970a0a90581237546fe/dpdk/mk/rte.sdkroot.mk:79: recipe for target 'install' failed
make: *** [install] Error 2

*Failed Build #12:
OS: FreeBSD
Target: x86_64-native-bsdapp-gcc
  SYMLINK-FILE include/rte_stack_c11_mem.h
  CC rte_stack.o
In file included from /tmp/FreeBSD_K10.3_GCC4.8.5/x86_64-native-bsdapp-gcc/91c7295957a14970a0a90581237546fe/dpdk/lib/librte_stack/rte_stack.h:94:0,
                 from /tmp/FreeBSD_K10.3_GCC4.8.5/x86_64-native-bsdapp-gcc/91c7295957a14970a0a90581237546fe/dpdk/lib/librte_stack/rte_stack.c:16:
/tmp/FreeBSD_K10.3_GCC4.8.5/x86_64-native-bsdapp-gcc/91c7295957a14970a0a90581237546fe/dpdk/lib/librte_stack/rte_stack_generic.h: In function '__nb_lifo_push':
/tmp/FreeBSD_K10.3_GCC4.8.5/x86_64-native-bsdapp-gcc/91c7295957a14970a0a90581237546fe/dpdk/lib/librte_stack/rte_stack_generic.h:66:13: warning: implicit declaration of function 'rte_atomic128_cmpxchg'; did you mean 'rte_atomic32_cmpset'? [-Wimplicit-function-declaration]
   success = rte_atomic128_cmpxchg((rte_int128_t *)&lifo->head,
             ^~~~~~~~~~~~~~~~~~~~~
             rte_atomic32_cmpset
/tmp/FreeBSD_K10.3_GCC4.8.5/x86_64-native-bsdapp-gcc/91c7295957a14970a0a90581237546fe/dpdk/lib/librte_stack/rte_stack_generic.h:66:13: warning: nested extern declaration of 'rte_atomic128_cmpxchg' [-Wnested-externs]
/tmp/FreeBSD_K10.3_GCC4.8.5/x86_64-native-bsdapp-gcc/91c7295957a14970a0a90581237546fe/dpdk/lib/librte_stack/rte_stack_generic.h:66:36: error: 'rte_int128_t' undeclared (first use in this function); did you mean '__int128_t'?
   success = rte_atomic128_cmpxchg((rte_int128_t *)&lifo->head,
                                    ^~~~~~~~~~~~
                                    __int128_t
/tmp/FreeBSD_K10.3_GCC4.8.5/x86_64-native-bsdapp-gcc/91c7295957a14970a0a90581237546fe/dpdk/lib/librte_stack/rte_stack_generic.h:66:36: note: each undeclared identifier is reported only once for each function it appears in
/tmp/FreeBSD_K10.3_GCC4.8.5/x86_64-native-bsdapp-gcc/91c7295957a14970a0a90581237546fe/dpdk/lib/librte_stack/rte_stack_generic.h:66:50: error: expected expression before ')' token
   success = rte_atomic128_cmpxchg((rte_int128_t *)&lifo->head,
                                                  ^
/tmp/FreeBSD_K10.3_GCC4.8.5/x86_64-native-bsdapp-gcc/91c7295957a14970a0a90581237546fe/dpdk/lib/librte_stack/rte_stack_generic.h:50:27: warning: variable 'new_head' set but not used [-Wunused-but-set-variable]
   struct rte_nb_lifo_head new_head;
                           ^~~~~~~~
/tmp/FreeBSD_K10.3_GCC4.8.5/x86_64-native-bsdapp-gcc/91c7295957a14970a0a90581237546fe/dpdk/lib/librte_stack/rte_stack_generic.h: In function '__nb_lifo_pop':
/tmp/FreeBSD_K10.3_GCC4.8.5/x86_64-native-bsdapp-gcc/91c7295957a14970a0a90581237546fe/dpdk/lib/librte_stack/rte_stack_generic.h:146:36: error: 'rte_int128_t' undeclared (first use in this function); did you mean '__int128_t'?
   success = rte_atomic128_cmpxchg((rte_int128_t *)&lifo->head,
                                    ^~~~~~~~~~~~
                                    __int128_t
/tmp/FreeBSD_K10.3_GCC4.8.5/x86_64-native-bsdapp-gcc/91c7295957a14970a0a90581237546fe/dpdk/lib/librte_stack/rte_stack_generic.h:146:50: error: expected expression before ')' token
   success = rte_atomic128_cmpxchg((rte_int128_t *)&lifo->head,
                                                  ^
/tmp/FreeBSD_K10.3_GCC4.8.5/x86_64-native-bsdapp-gcc/91c7295957a14970a0a90581237546fe/dpdk/lib/librte_stack/rte_stack_generic.h:111:27: warning: variable 'new_head' set but not used [-Wunused-but-set-variable]
   struct rte_nb_lifo_head new_head;
                           ^~~~~~~~
gmake[5]: *** [/tmp/FreeBSD_K10.3_GCC4.8.5/x86_64-native-bsdapp-gcc/91c7295957a14970a0a90581237546fe/dpdk/mk/internal/rte.compile-pre.mk:116: rte_stack.o] Error 1
gmake[4]: *** [/tmp/FreeBSD_K10.3_GCC4.8.5/x86_64-native-bsdapp-gcc/91c7295957a14970a0a90581237546fe/dpdk/mk/rte.subdir.mk:37: librte_stack] Error 2
gmake[4]: *** Waiting for unfinished jobs....

*Failed Build #13:
OS: FC25
Target: x86_64-native-linuxapp-gcc-debug
  SYMLINK-FILE include/rte_stack_c11_mem.h
  CC rte_stack.o
In file included from /tmp/FC25_K4.8.6_GCC6.3.1/x86_64-native-linuxapp-gcc-debug/91c7295957a14970a0a90581237546fe/dpdk/lib/librte_stack/rte_stack.h:94:0,
                 from /tmp/FC25_K4.8.6_GCC6.3.1/x86_64-native-linuxapp-gcc-debug/91c7295957a14970a0a90581237546fe/dpdk/lib/librte_stack/rte_stack.c:16:
/tmp/FC25_K4.8.6_GCC6.3.1/x86_64-native-linuxapp-gcc-debug/91c7295957a14970a0a90581237546fe/dpdk/lib/librte_stack/rte_stack_generic.h: In function ‘__nb_lifo_push’:
/tmp/FC25_K4.8.6_GCC6.3.1/x86_64-native-linuxapp-gcc-debug/91c7295957a14970a0a90581237546fe/dpdk/lib/librte_stack/rte_stack_generic.h:66:13: warning: implicit declaration of function ‘rte_atomic128_cmpxchg’ [-Wimplicit-function-declaration]
   success = rte_atomic128_cmpxchg((rte_int128_t *)&lifo->head,
             ^~~~~~~~~~~~~~~~~~~~~
/tmp/FC25_K4.8.6_GCC6.3.1/x86_64-native-linuxapp-gcc-debug/91c7295957a14970a0a90581237546fe/dpdk/lib/librte_stack/rte_stack_generic.h:66:3: warning: nested extern declaration of ‘rte_atomic128_cmpxchg’ [-Wnested-externs]
   success = rte_atomic128_cmpxchg((rte_int128_t *)&lifo->head,
   ^~~~~~~
/tmp/FC25_K4.8.6_GCC6.3.1/x86_64-native-linuxapp-gcc-debug/91c7295957a14970a0a90581237546fe/dpdk/lib/librte_stack/rte_stack_generic.h:66:36: error: ‘rte_int128_t’ undeclared (first use in this function)
   success = rte_atomic128_cmpxchg((rte_int128_t *)&lifo->head,
                                    ^~~~~~~~~~~~
/tmp/FC25_K4.8.6_GCC6.3.1/x86_64-native-linuxapp-gcc-debug/91c7295957a14970a0a90581237546fe/dpdk/lib/librte_stack/rte_stack_generic.h:66:36: note: each undeclared identifier is reported only once for each function it appears in
/tmp/FC25_K4.8.6_GCC6.3.1/x86_64-native-linuxapp-gcc-debug/91c7295957a14970a0a90581237546fe/dpdk/lib/librte_stack/rte_stack_generic.h:66:50: error: expected expression before ‘)’ token
   success = rte_atomic128_cmpxchg((rte_int128_t *)&lifo->head,
                                                  ^
/tmp/FC25_K4.8.6_GCC6.3.1/x86_64-native-linuxapp-gcc-debug/91c7295957a14970a0a90581237546fe/dpdk/lib/librte_stack/rte_stack_generic.h:50:27: warning: variable ‘new_head’ set but not used [-Wunused-but-set-variable]
   struct rte_nb_lifo_head new_head;
                           ^~~~~~~~
/tmp/FC25_K4.8.6_GCC6.3.1/x86_64-native-linuxapp-gcc-debug/91c7295957a14970a0a90581237546fe/dpdk/lib/librte_stack/rte_stack_generic.h: In function ‘__nb_lifo_pop’:
/tmp/FC25_K4.8.6_GCC6.3.1/x86_64-native-linuxapp-gcc-debug/91c7295957a14970a0a90581237546fe/dpdk/lib/librte_stack/rte_stack_generic.h:146:36: error: ‘rte_int128_t’ undeclared (first use in this function)
   success = rte_atomic128_cmpxchg((rte_int128_t *)&lifo->head,
                                    ^~~~~~~~~~~~
/tmp/FC25_K4.8.6_GCC6.3.1/x86_64-native-linuxapp-gcc-debug/91c7295957a14970a0a90581237546fe/dpdk/lib/librte_stack/rte_stack_generic.h:146:50: error: expected expression before ‘)’ token
   success = rte_atomic128_cmpxchg((rte_int128_t *)&lifo->head,
                                                  ^
/tmp/FC25_K4.8.6_GCC6.3.1/x86_64-native-linuxapp-gcc-debug/91c7295957a14970a0a90581237546fe/dpdk/lib/librte_stack/rte_stack_generic.h:111:27: warning: variable ‘new_head’ set but not used [-Wunused-but-set-variable]
   struct rte_nb_lifo_head new_head;
                           ^~~~~~~~
/tmp/FC25_K4.8.6_GCC6.3.1/x86_64-native-linuxapp-gcc-debug/91c7295957a14970a0a90581237546fe/dpdk/mk/internal/rte.compile-pre.mk:114: recipe for target 'rte_stack.o' failed
make[5]: *** [rte_stack.o] Error 1
/tmp/FC25_K4.8.6_GCC6.3.1/x86_64-native-linuxapp-gcc-debug/91c7295957a14970a0a90581237546fe/dpdk/mk/rte.subdir.mk:35: recipe for target 'librte_stack' failed
make[4]: *** [librte_stack] Error 2
make[4]: *** Waiting for unfinished jobs....
  CC power_kvm_vm.o
  CC guest_channel.o
  CC rte_power_empty_poll.o
  CC power_pstate_cpufreq.o
  AR librte_power.a
  INSTALL-LIB librte_power.a
  AR librte_acl.a
  INSTALL-LIB librte_acl.a
/tmp/FC25_K4.8.6_GCC6.3.1/x86_64-native-linuxapp-gcc-debug/91c7295957a14970a0a90581237546fe/dpdk/mk/rte.sdkbuild.mk:49: recipe for target 'lib' failed
make[3]: *** [lib] Error 2
/tmp/FC25_K4.8.6_GCC6.3.1/x86_64-native-linuxapp-gcc-debug/91c7295957a14970a0a90581237546fe/dpdk/mk/rte.sdkroot.mk:100: recipe for target 'all' failed
make[2]: *** [all] Error 2
/tmp/FC25_K4.8.6_GCC6.3.1/x86_64-native-linuxapp-gcc-debug/91c7295957a14970a0a90581237546fe/dpdk/mk/rte.sdkinstall.mk:57: recipe for target 'pre_install' failed
make[1]: *** [pre_install] Error 2
/tmp/FC25_K4.8.6_GCC6.3.1/x86_64-native-linuxapp-gcc-debug/91c7295957a14970a0a90581237546fe/dpdk/mk/rte.sdkroot.mk:79: recipe for target 'install' failed
make: *** [install] Error 2

DPDK STV team


More information about the test-report mailing list