[dpdk-test-report] |FAILURE| pw50459-50465 [PATCH] [1/7] stack: introduce rte stack library

dpdklab at iol.unh.edu dpdklab at iol.unh.edu
Fri Feb 22 17:48:48 CET 2019


Test-Label: Performance-Testing
Test-Status: FAILURE
http://dpdk.org/patch/50459

_build patch failure_

Submitter: Gage Eads <gage.eads at intel.com>
Date: Friday, February 22 2019 16:06:49 
Applied on: Branch: dpdk
  CommitID:b13baac8d5ffb6b0b7a6ca0def884d3f1a82babb
Apply patch set 50459-50465 failed:

Configuration done using x86_64-native-linuxapp-gcc
== Build lib
== Build lib/librte_compat
== Build lib/librte_kvargs
== Build lib/librte_eal
== Build lib/librte_eal/common
== Build lib/librte_eal/linuxapp
== Build lib/librte_eal/linuxapp/eal
== Build lib/librte_pci
== Build lib/librte_ring
== Build lib/librte_mempool
  SYMLINK-FILE include/rte_mempool.h
  CC rte_mempool.o
  CC rte_mempool_ops.o
  CC rte_mempool_ops_default.o
  AR librte_mempool.a
  INSTALL-LIB librte_mempool.a
== Build lib/librte_mbuf
  SYMLINK-FILE include/rte_mbuf.h
  SYMLINK-FILE include/rte_mbuf_ptype.h
  SYMLINK-FILE include/rte_mbuf_pool_ops.h
  CC rte_mbuf.o
  CC rte_mbuf_ptype.o
  CC rte_mbuf_pool_ops.o
  AR librte_mbuf.a
  INSTALL-LIB librte_mbuf.a
== Build lib/librte_timer
== Build lib/librte_cfgfile
== Build lib/librte_cmdline
== Build lib/librte_net
  SYMLINK-FILE include/rte_ip.h
  SYMLINK-FILE include/rte_tcp.h
  SYMLINK-FILE include/rte_udp.h
  SYMLINK-FILE include/rte_esp.h
  SYMLINK-FILE include/rte_sctp.h
  SYMLINK-FILE include/rte_icmp.h
  SYMLINK-FILE include/rte_arp.h
  SYMLINK-FILE include/rte_ether.h
  SYMLINK-FILE include/rte_gre.h
  SYMLINK-FILE include/rte_net.h
  SYMLINK-FILE include/rte_net_crc.h
  SYMLINK-FILE include/rte_mpls.h
  CC rte_net.o
  CC rte_net_crc.o
  CC rte_arp.o
  AR librte_net.a
  INSTALL-LIB librte_net.a
== Build lib/librte_meter
== Build lib/librte_ethdev
  SYMLINK-FILE include/rte_ethdev.h
  SYMLINK-FILE include/rte_ethdev_driver.h
  SYMLINK-FILE include/rte_ethdev_core.h
  SYMLINK-FILE include/rte_ethdev_pci.h
  SYMLINK-FILE include/rte_ethdev_vdev.h
  SYMLINK-FILE include/rte_eth_ctrl.h
  SYMLINK-FILE include/rte_dev_info.h
  SYMLINK-FILE include/rte_flow.h
  SYMLINK-FILE include/rte_flow_driver.h
  SYMLINK-FILE include/rte_tm.h
  SYMLINK-FILE include/rte_tm_driver.h
  SYMLINK-FILE include/rte_mtr.h
  SYMLINK-FILE include/rte_mtr_driver.h
  CC ethdev_private.o
  CC rte_ethdev.o
  CC rte_class_eth.o
  CC rte_flow.o
  CC rte_tm.o
  CC rte_mtr.o
  CC ethdev_profile.o
  AR librte_ethdev.a
  INSTALL-LIB librte_ethdev.a
== Build lib/librte_bbdev
  SYMLINK-FILE include/rte_bbdev_op.h
  SYMLINK-FILE include/rte_bbdev.h
  SYMLINK-FILE include/rte_bbdev_pmd.h
  CC rte_bbdev.o
  AR librte_bbdev.a
  INSTALL-LIB librte_bbdev.a
== Build lib/librte_cryptodev
  SYMLINK-FILE include/rte_crypto.h
  SYMLINK-FILE include/rte_crypto_sym.h
  SYMLINK-FILE include/rte_cryptodev.h
  SYMLINK-FILE include/rte_cryptodev_pmd.h
  SYMLINK-FILE include/rte_crypto_asym.h
  CC rte_cryptodev.o
  CC rte_cryptodev_pmd.o
  AR librte_cryptodev.a
  INSTALL-LIB librte_cryptodev.a
== Build lib/librte_security
  SYMLINK-FILE include/rte_security.h
  SYMLINK-FILE include/rte_security_driver.h
  CC rte_security.o
  AR librte_security.a
  INSTALL-LIB librte_security.a
== Build lib/librte_compressdev
  SYMLINK-FILE include/rte_comp.h
  SYMLINK-FILE include/rte_compressdev.h
  SYMLINK-FILE include/rte_compressdev_pmd.h
  SYMLINK-FILE include/rte_compressdev_internal.h
  CC rte_compressdev.o
  CC rte_compressdev_pmd.o
  CC rte_comp.o
  AR librte_compressdev.a
  INSTALL-LIB librte_compressdev.a
== Build lib/librte_hash
  SYMLINK-FILE include/rte_hash.h
  SYMLINK-FILE include/rte_hash_crc.h
  SYMLINK-FILE include/rte_jhash.h
  SYMLINK-FILE include/rte_thash.h
  SYMLINK-FILE include/rte_fbk_hash.h
  CC rte_cuckoo_hash.o
  CC rte_fbk_hash.o
  AR librte_hash.a
  INSTALL-LIB librte_hash.a
== Build lib/librte_eventdev
  SYMLINK-FILE include/rte_eventdev.h
  SYMLINK-FILE include/rte_eventdev_pmd.h
  SYMLINK-FILE include/rte_eventdev_pmd_pci.h
  SYMLINK-FILE include/rte_eventdev_pmd_vdev.h
  SYMLINK-FILE include/rte_event_ring.h
  SYMLINK-FILE include/rte_event_eth_rx_adapter.h
  SYMLINK-FILE include/rte_event_timer_adapter.h
  SYMLINK-FILE include/rte_event_timer_adapter_pmd.h
  SYMLINK-FILE include/rte_event_crypto_adapter.h
  SYMLINK-FILE include/rte_event_eth_tx_adapter.h
  CC rte_eventdev.o
  CC rte_event_ring.o
  CC rte_event_eth_rx_adapter.o
  CC rte_event_timer_adapter.o
  CC rte_event_crypto_adapter.o
  CC rte_event_eth_tx_adapter.o
  AR librte_eventdev.a
  INSTALL-LIB librte_eventdev.a
== Build lib/librte_rawdev
  SYMLINK-FILE include/rte_rawdev.h
  SYMLINK-FILE include/rte_rawdev_pmd.h
  CC rte_rawdev.o
  AR librte_rawdev.a
  INSTALL-LIB librte_rawdev.a
== Build lib/librte_vhost
  SYMLINK-FILE include/rte_vhost.h
  SYMLINK-FILE include/rte_vdpa.h
  SYMLINK-FILE include/rte_vhost_crypto.h
  CC fd_man.o
  CC iotlb.o
  CC socket.o
  CC vhost.o
  CC vhost_user.o
  CC virtio_net.o
  CC vdpa.o
  CC vhost_crypto.o
  AR librte_vhost.a
  INSTALL-LIB librte_vhost.a
== Build lib/librte_efd
  SYMLINK-FILE include/rte_efd.h
  CC rte_efd.o
  AR librte_efd.a
  INSTALL-LIB librte_efd.a
== Build lib/librte_lpm
  SYMLINK-FILE include/rte_lpm.h
  SYMLINK-FILE include/rte_lpm6.h
  SYMLINK-FILE include/rte_lpm_sse.h
  CC rte_lpm.o
  CC rte_lpm6.o
  AR librte_lpm.a
  INSTALL-LIB librte_lpm.a
== Build lib/librte_acl
== Build lib/librte_member
  SYMLINK-FILE include/rte_member.h
  CC rte_member.o
  CC rte_member_ht.o
  CC rte_member_vbf.o
  AR librte_member.a
  INSTALL-LIB librte_member.a
== Build lib/librte_ip_frag
  SYMLINK-FILE include/rte_ip_frag.h
  CC rte_ipv4_fragmentation.o
  CC rte_ipv6_fragmentation.o
  CC rte_ipv4_reassembly.o
  CC rte_ipv6_reassembly.o
  CC rte_ip_frag_common.o
  CC ip_frag_internal.o
  AR librte_ip_frag.a
  INSTALL-LIB librte_ip_frag.a
== Build lib/librte_gro
  SYMLINK-FILE include/rte_gro.h
  CC rte_gro.o
  CC gro_tcp4.o
  CC gro_vxlan_tcp4.o
  AR librte_gro.a
  INSTALL-LIB librte_gro.a
== Build lib/librte_jobstats
== Build lib/librte_metrics
== Build lib/librte_bitratestats
  SYMLINK-FILE include/rte_bitrate.h
  CC rte_bitrate.o
  AR librte_bitratestats.a
  INSTALL-LIB librte_bitratestats.a
== Build lib/librte_latencystats
  SYMLINK-FILE include/rte_latencystats.h
  CC rte_latencystats.o
  AR librte_latencystats.a
  INSTALL-LIB librte_latencystats.a
== Build lib/librte_power
== Build lib/librte_sched
  SYMLINK-FILE include/rte_sched.h
  SYMLINK-FILE include/rte_sched_common.h
  SYMLINK-FILE include/rte_red.h
  SYMLINK-FILE include/rte_approx.h
  CC rte_sched.o
  CC rte_red.o
  CC rte_approx.o
  AR librte_sched.a
  INSTALL-LIB librte_sched.a
== Build lib/librte_kni
  SYMLINK-FILE include/rte_kni.h
  CC rte_kni.o
  AR librte_kni.a
  INSTALL-LIB librte_kni.a
== Build lib/librte_port
  SYMLINK-FILE include/rte_port.h
  SYMLINK-FILE include/rte_port_ethdev.h
  SYMLINK-FILE include/rte_port_ring.h
  SYMLINK-FILE include/rte_port_frag.h
  SYMLINK-FILE include/rte_port_ras.h
  SYMLINK-FILE include/rte_port_sched.h
  SYMLINK-FILE include/rte_port_fd.h
  SYMLINK-FILE include/rte_port_kni.h
  SYMLINK-FILE include/rte_port_source_sink.h
  SYMLINK-FILE include/rte_port_sym_crypto.h
  CC rte_port_ethdev.o
  CC rte_port_ring.o
  CC rte_port_frag.o
  CC rte_port_ras.o
  CC rte_port_sched.o
  CC rte_port_fd.o
  CC rte_port_kni.o
  CC rte_port_source_sink.o
  CC rte_port_sym_crypto.o
  AR librte_port.a
  INSTALL-LIB librte_port.a
== Build lib/librte_table
  SYMLINK-FILE include/rte_table.h
  SYMLINK-FILE include/rte_table_lpm.h
  SYMLINK-FILE include/rte_table_lpm_ipv6.h
  SYMLINK-FILE include/rte_table_acl.h
  SYMLINK-FILE include/rte_table_hash.h
  SYMLINK-FILE include/rte_table_hash_cuckoo.h
  SYMLINK-FILE include/rte_table_hash_func.h
  SYMLINK-FILE include/rte_table_hash_func_arm64.h
  SYMLINK-FILE include/rte_lru.h
  SYMLINK-FILE include/rte_lru_x86.h
  SYMLINK-FILE include/rte_table_array.h
  SYMLINK-FILE include/rte_table_stub.h
  CC rte_table_lpm.o
  CC rte_table_lpm_ipv6.o
  CC rte_table_acl.o
  CC rte_table_hash_cuckoo.o
  CC rte_table_hash_key8.o
  CC rte_table_hash_key16.o
  CC rte_table_hash_key32.o
  CC rte_table_hash_ext.o
  CC rte_table_hash_lru.o
  CC rte_table_array.o
  CC rte_table_stub.o
  AR librte_table.a
  INSTALL-LIB librte_table.a
== Build lib/librte_flow_classify
  SYMLINK-FILE include/rte_flow_classify.h
  CC rte_flow_classify.o
  CC rte_flow_classify_parse.o
  AR librte_flow_classify.a
  INSTALL-LIB librte_flow_classify.a
== Build lib/librte_distributor
  SYMLINK-FILE include/rte_distributor.h
  CC rte_distributor_v20.o
  CC rte_distributor.o
  CC rte_distributor_match_sse.o
  AR librte_distributor.a
  INSTALL-LIB librte_distributor.a
== Build lib/librte_pipeline
  SYMLINK-FILE include/rte_pipeline.h
  SYMLINK-FILE include/rte_port_in_action.h
  SYMLINK-FILE include/rte_table_action.h
  CC rte_pipeline.o
  CC rte_port_in_action.o
  CC rte_table_action.o
  AR librte_pipeline.a
  INSTALL-LIB librte_pipeline.a
== Build lib/librte_reorder
  SYMLINK-FILE include/rte_reorder.h
  CC rte_reorder.o
  AR librte_reorder.a
  INSTALL-LIB librte_reorder.a
== Build lib/librte_pdump
  SYMLINK-FILE include/rte_pdump.h
  CC rte_pdump.o
  AR librte_pdump.a
  INSTALL-LIB librte_pdump.a
== Build lib/librte_gso
  SYMLINK-FILE include/rte_gso.h
  CC rte_gso.o
  CC gso_common.o
  CC gso_tcp4.o
  CC gso_tunnel_tcp4.o
  CC gso_udp4.o
  AR librte_gso.a
  INSTALL-LIB librte_gso.a
== Build lib/librte_bpf
  SYMLINK-FILE include/bpf_def.h
  SYMLINK-FILE include/rte_bpf.h
  SYMLINK-FILE include/rte_bpf_ethdev.h
  CC bpf.o
  CC bpf_exec.o
  CC bpf_load.o
  CC bpf_pkt.o
  CC bpf_validate.o
  CC bpf_jit_x86.o
  AR librte_bpf.a
  INSTALL-LIB librte_bpf.a
== Build lib/librte_ipsec
  SYMLINK-FILE include/rte_ipsec.h
  SYMLINK-FILE include/rte_ipsec_group.h
  SYMLINK-FILE include/rte_ipsec_sa.h
  CC sa.o
  CC ses.o
  AR librte_ipsec.a
  INSTALL-LIB librte_ipsec.a
== Build lib/librte_stack
  CC rte_stack.o
In file included from /var/lib/jenkins/workspace/Apply-One-Patch-Set/dpdk/lib/librte_stack/rte_stack.h:94:0,
                 from /var/lib/jenkins/workspace/Apply-One-Patch-Set/dpdk/lib/librte_stack/rte_stack.c:16:
/var/lib/jenkins/workspace/Apply-One-Patch-Set/dpdk/lib/librte_stack/rte_stack_generic.h: In function ‘__nb_lifo_push’:
/var/lib/jenkins/workspace/Apply-One-Patch-Set/dpdk/lib/librte_stack/rte_stack_generic.h:66:3: error: implicit declaration of function ‘rte_atomic128_cmpxchg’ [-Werror=implicit-function-declaration]
   success = rte_atomic128_cmpxchg((rte_int128_t *)&lifo->head,
   ^
/var/lib/jenkins/workspace/Apply-One-Patch-Set/dpdk/lib/librte_stack/rte_stack_generic.h:66:3: error: nested extern declaration of ‘rte_atomic128_cmpxchg’ [-Werror=nested-externs]
/var/lib/jenkins/workspace/Apply-One-Patch-Set/dpdk/lib/librte_stack/rte_stack_generic.h:66:36: error: ‘rte_int128_t’ undeclared (first use in this function)
   success = rte_atomic128_cmpxchg((rte_int128_t *)&lifo->head,
                                    ^
/var/lib/jenkins/workspace/Apply-One-Patch-Set/dpdk/lib/librte_stack/rte_stack_generic.h:66:36: note: each undeclared identifier is reported only once for each function it appears in
/var/lib/jenkins/workspace/Apply-One-Patch-Set/dpdk/lib/librte_stack/rte_stack_generic.h:66:50: error: expected expression before ‘)’ token
   success = rte_atomic128_cmpxchg((rte_int128_t *)&lifo->head,
                                                  ^
/var/lib/jenkins/workspace/Apply-One-Patch-Set/dpdk/lib/librte_stack/rte_stack_generic.h:50:27: error: variable ‘new_head’ set but not used [-Werror=unused-but-set-variable]
   struct rte_nb_lifo_head new_head;
                           ^
/var/lib/jenkins/workspace/Apply-One-Patch-Set/dpdk/lib/librte_stack/rte_stack_generic.h: In function ‘__nb_lifo_pop’:
/var/lib/jenkins/workspace/Apply-One-Patch-Set/dpdk/lib/librte_stack/rte_stack_generic.h:146:36: error: ‘rte_int128_t’ undeclared (first use in this function)
   success = rte_atomic128_cmpxchg((rte_int128_t *)&lifo->head,
                                    ^
/var/lib/jenkins/workspace/Apply-One-Patch-Set/dpdk/lib/librte_stack/rte_stack_generic.h:146:50: error: expected expression before ‘)’ token
   success = rte_atomic128_cmpxchg((rte_int128_t *)&lifo->head,
                                                  ^
/var/lib/jenkins/workspace/Apply-One-Patch-Set/dpdk/lib/librte_stack/rte_stack_generic.h:111:27: error: variable ‘new_head’ set but not used [-Werror=unused-but-set-variable]
   struct rte_nb_lifo_head new_head;
                           ^
cc1: all warnings being treated as errors
make[5]: *** [rte_stack.o] Error 1
make[4]: *** [librte_stack] Error 2
make[3]: *** [lib] Error 2
make[2]: *** [all] Error 2
make[1]: *** [pre_install] Error 2
make: *** [install] Error 2

https://lab.dpdk.org/results/dashboard/patchsets/4655/

UNH-IOL DPDK Performance Test Lab


More information about the test-report mailing list