[dpdk-test-report] |FAILURE| pw51310[v8, 6/6] mempool/ring: add lock-free ring handlers

sys_stv at intel.com sys_stv at intel.com
Tue Mar 19 02:28:51 CET 2019


Test-Label: Intel-compilation
Test-Status: FAILURE
http://dpdk.org/patch/51310

_Compilation issues_

Submitter: Gage Eads <gage.eads at intel.com>
Date: 2019-03-19 01:20:10
Reply_mail: 20190319012010.16793-7-gage.eads at intel.com
DPDK git baseline: Repo:dpdk-master, CommitID: 239912fa798e6e671072ca7ff987afd74c1e506c

Build Summary: 26 Builds Done, 2 Successful, 24 Failures

Test environment and configuration as below:

OS: SUSE15
	Kernel Version: 4.12.14-lp150.12.22-default
	CPU info: Intel(R) Xeon(R) CPU E5-2699 v3 @ 2.30GHz
	GCC Version: gcc (SUSE Linux) 7.3.1 20180323 [gcc-7-branch revision 258812]
	Clang Version: 5.0.1 (tags/RELEASE_501/final 312548)
	x86_64-native-linuxapp-gcc

OS: CENTOS76
	Kernel Version: 3.10.0-957.5.1.el7.x86_64
	CPU info: Intel(R) Xeon(R) CPU E5-2699 v4 @ 2.20GHz
	GCC Version: gcc (GCC) 4.8.5 20150623 (Red Hat 4.8.5-36)
	Clang Version: 3.4.2 (tags/RELEASE_34/dot2-final)
	x86_64-native-linuxapp-gcc

OS: UBT144-32
	Kernel Version: 3.13.0-161-generic
	CPU info: Intel(R) Xeon(R) CPU E5-2699 v3 @ 2.30GHz
	GCC Version: gcc (Ubuntu 4.8.4-2ubuntu1~14.04.4) 4.8.4
	Clang Version: NA
	i686-native-linuxapp-gcc

OS: UBT164-32
	Kernel Version: 4.4.0-131-generic
	CPU info: Intel(R) Xeon(R) CPU E5-2699 v3 @ 2.30GHz
	GCC Version: gcc (Ubuntu 5.4.0-6ubuntu1~16.04.10) 5.4.0 20160609
	Clang Version: NA
	i686-native-linuxapp-gcc

OS: SUSE12
	Kernel Version: 4.4.73-5-default
	CPU info: Intel(R) Xeon(R) CPU E5-2699 v4 @ 2.20GHz
	GCC Version: gcc (SUSE Linux) 7.1.1 20170607 [gcc-7-branch revision 248970]
	Clang Version: NA
	x86_64-native-linuxapp-gcc

OS: FreeBSD12.0
	Kernel Version: 12.0-RC3
	CPU info: Intel(R) Xeon(R) CPU E5-2699 v3 @ 2.30GHz (2294.74-MHz K8-class CPU)
	GCC Version: gcc (FreeBSD Ports Collection) 7.3.0
	Clang Version: 6.0.1 (tags/RELEASE_601/final 335540) (based on LLVM 6.0.1)
	x86_64-native-bsdapp-gcc
	x86_64-native-bsdapp-clang

OS: UBT144-64
	Kernel Version: 4.2.0-27-generic
	CPU info: Intel(R) Xeon(R) CPU E5-2699 v3 @ 2.30GHz
	GCC Version: gcc (Ubuntu 4.8.4-2ubuntu1~14.04.4) 4.8.4
	Clang Version: NA
	x86_64-native-linuxapp-gcc

OS: CENTOS75
	Kernel Version: 3.10.0-957.5.1.el7.x86_64
	CPU info: Intel(R) Xeon(R) CPU E5-2699 v4 @ 2.20GHz
	GCC Version: gcc (GCC) 4.8.5 20150623 (Red Hat 4.8.5-36)
	Clang Version: 3.4.2 (tags/RELEASE_34/dot2-final)
	x86_64-native-linuxapp-gcc

OS: UBT1804
	Kernel Version: 4.15.0-20-generic
	CPU info: Intel(R) Xeon(R) CPU E5-2699 v3 @ 2.30GHz
	GCC Version: gcc (Ubuntu 7.3.0-27ubuntu1~18.04) 7.3.0
	Clang Version: NA
	x86_64-native-linuxapp-clang
	x86_64-native-linuxapp-gcc
	x86_64-native-linuxapp-icc

OS: UBT1810
	Kernel Version: 4.18.0-10-generic
	CPU info: Intel(R) Xeon(R) CPU E5-2699 v3 @ 2.30GHz
	GCC Version: gcc (Ubuntu 8.2.0-7ubuntu1) 8.2.0
	Clang Version: NA
	x86_64-native-linuxapp-gcc

OS: RHEL74
	Kernel Version: 3.10.0-693.el7.x86_64
	CPU info: Intel(R) Xeon(R) CPU E5-2699 v4 @ 2.20GHz
	GCC Version: gcc (GCC) 4.8.5 20150623 (Red Hat 4.8.5-16)
	Clang Version: NA
	x86_64-native-linuxapp-gcc

OS: CENTOS74
	Kernel Version: 3.10.0-862.14.4.el7.x86_64
	CPU info: Intel(R) Xeon(R) CPU E5-2699 v4 @ 2.20GHz
	GCC Version: gcc (GCC) 4.8.5 20150623 (Red Hat 4.8.5-28)
	Clang Version: 3.4.2 (tags/RELEASE_34/dot2-final)
	x86_64-native-linuxapp-gcc

OS: FreeBSD11.2
	Kernel Version: 11.2-RELEASE
	CPU info: Intel(R) Xeon(R) CPU E5-2699 v3 @ 2.30GHz (2294.74-MHz K8-class CPU)
	GCC Version: gcc (FreeBSD Ports Collection) 6.4.0
	Clang Version: 6.0.0 (tags/RELEASE_600/final 326565) (based on LLVM 6.0.0)
	x86_64-native-bsdapp-clang
	x86_64-native-bsdapp-gcc

OS: UBT164-64
	Kernel Version: 4.4.0-47-generic
	CPU info: Intel(R) Xeon(R) CPU E5-2699 v3 @ 2.30GHz
	GCC Version: gcc (Ubuntu 5.4.0-6ubuntu1~16.04.10) 5.4.0 20160609
	Clang Version: 3.8.0-2ubuntu4 (tags/RELEASE_380/final)
	x86_64-native-linuxapp-gcc

OS: RHEL75
	Kernel Version: 3.10.0-862.el7.x86_64
	CPU info: Intel(R) Xeon(R) CPU E5-2699 v4 @ 2.20GHz
	GCC Version: gcc (GCC) 4.8.5 20150623 (Red Hat 4.8.5-28)
	Clang Version: NA
	x86_64-native-linuxapp-gcc

OS: RHEL76
	Kernel Version: 3.10.0-957.el7.x86_64
	CPU info: Intel(R) Xeon(R) CPU E5-2699 v4 @ 2.20GHz
	GCC Version: gcc (GCC) 4.8.5 20150623 (Red Hat 4.8.5-36)
	Clang Version: NA
	x86_64-native-linuxapp-gcc

OS: FC29
	Kernel Version: 4.18.16-300.fc29.x86_64
	CPU info: Intel(R) Xeon(R) CPU E5-2699 v4 @ 2.20GHz
	GCC Version: gcc (GCC) 8.2.1 20181215 (Red Hat 8.2.1-6)
	Clang Version: NA
	x86_64-native-linuxapp-gcc
	x86_64-native-linuxapp-clang
	x86_64-native-linuxapp-icc

OS: FC28
	Kernel Version: 4.16.3-301.fc28.x86_64
	CPU info: Intel(R) Xeon(R) CPU E5-2699 v4 @ 2.20GHz
	GCC Version: gcc (GCC) 8.1.1 20180712 (Red Hat 8.1.1-5)
	Clang Version: NA
	x86_64-native-linuxapp-clang
	x86_64-native-linuxapp-gcc
	x86_64-native-linuxapp-icc

*Failed Build #1:
OS: UBT164-64
Target: x86_64-native-linuxapp-gcc
  SYMLINK-FILE include/cmdline_parse_num.h
  AR librte_ring.a
  AR librte_pci.a
  INSTALL-LIB librte_ring.a
  CC rte_meter.o
make[5]: warning:  Clock skew detected.  Your build may be incomplete.
== Build lib/librte_mempool
  SYMLINK-FILE include/rte_timer.h
  INSTALL-LIB librte_pci.a
== Build lib/librte_hash
  SYMLINK-FILE include/cmdline_parse_ipaddr.h
--
== Build lib/librte_power
In file included from /tmp/UBT164-64_K4.4.0_GCC5.4.0/x86_64-native-linuxapp-gcc/17a519c90c8b4b879a147f2de71c86c4/dpdk/x86_64-native-linuxapp-gcc/include/rte_ring.h:436:0,
                 from /tmp/UBT164-64_K4.4.0_GCC5.4.0/x86_64-native-linuxapp-gcc/17a519c90c8b4b879a147f2de71c86c4/dpdk/lib/librte_mempool/rte_mempool.h:50,
                 from /tmp/UBT164-64_K4.4.0_GCC5.4.0/x86_64-native-linuxapp-gcc/17a519c90c8b4b879a147f2de71c86c4/dpdk/lib/librte_mempool/rte_mempool.c:34:
/tmp/UBT164-64_K4.4.0_GCC5.4.0/x86_64-native-linuxapp-gcc/17a519c90c8b4b879a147f2de71c86c4/dpdk/x86_64-native-linuxapp-gcc/include/rte_ring_generic.h: In function ‘__rte_ring_do_lf_enqueue_mp’:
/tmp/UBT164-64_K4.4.0_GCC5.4.0/x86_64-native-linuxapp-gcc/17a519c90c8b4b879a147f2de71c86c4/dpdk/x86_64-native-linuxapp-gcc/include/rte_ring_generic.h:511:14: warning: implicit declaration of function ‘rte_atomic128_cmp_exchange’ [-Wimplicit-function-declaration]
    success = rte_atomic128_cmp_exchange(
              ^
/tmp/UBT164-64_K4.4.0_GCC5.4.0/x86_64-native-linuxapp-gcc/17a519c90c8b4b879a147f2de71c86c4/dpdk/x86_64-native-linuxapp-gcc/include/rte_ring_generic.h:511:4: warning: nested extern declaration of ‘rte_atomic128_cmp_exchange’ [-Wnested-externs]
    success = rte_atomic128_cmp_exchange(
    ^
/tmp/UBT164-64_K4.4.0_GCC5.4.0/x86_64-native-linuxapp-gcc/17a519c90c8b4b879a147f2de71c86c4/dpdk/x86_64-native-linuxapp-gcc/include/rte_ring_generic.h:512:7: error: ‘rte_int128_t’ undeclared (first use in this function)
      (rte_int128_t *)ring_ptr,
       ^
/tmp/UBT164-64_K4.4.0_GCC5.4.0/x86_64-native-linuxapp-gcc/17a519c90c8b4b879a147f2de71c86c4/dpdk/x86_64-native-linuxapp-gcc/include/rte_ring_generic.h:512:7: note: each undeclared identifier is reported only once for each function it appears in
/tmp/UBT164-64_K4.4.0_GCC5.4.0/x86_64-native-linuxapp-gcc/17a519c90c8b4b879a147f2de71c86c4/dpdk/x86_64-native-linuxapp-gcc/include/rte_ring_generic.h:512:21: error: expected expression before ‘)’ token
      (rte_int128_t *)ring_ptr,
                     ^
/tmp/UBT164-64_K4.4.0_GCC5.4.0/x86_64-native-linuxapp-gcc/17a519c90c8b4b879a147f2de71c86c4/dpdk/x86_64-native-linuxapp-gcc/include/rte_ring_generic.h:473:40: warning: variable ‘new_value’ set but not used [-Wunused-but-set-variable]
    struct rte_ring_lf_entry old_value, new_value;
                                        ^
  SYMLINK-FILE include/rte_hash.h
  CC cmdline_parse_num.o
  CC cmdline_parse_string.o
--
  SYMLINK-FILE include/rte_jhash.h
  CC acl_run_avx2.o
  CC cmdline_vt100.o
  SYMLINK-FILE include/rte_thash.h
  CC cmdline_socket.o
/tmp/UBT164-64_K4.4.0_GCC5.4.0/x86_64-native-linuxapp-gcc/17a519c90c8b4b879a147f2de71c86c4/dpdk/mk/internal/rte.compile-pre.mk:114: recipe for target 'rte_mempool.o' failed
make[5]: *** [rte_mempool.o] Error 1
/tmp/UBT164-64_K4.4.0_GCC5.4.0/x86_64-native-linuxapp-gcc/17a519c90c8b4b879a147f2de71c86c4/dpdk/mk/rte.subdir.mk:35: recipe for target 'librte_mempool' failed
make[4]: *** [librte_mempool] Error 2
make[4]: *** Waiting for unfinished jobs....
  SYMLINK-FILE include/rte_fbk_hash.h
  CC cmdline_parse_portlist.o
  CC rte_cuckoo_hash.o
--
  INSTALL-LIB librte_power.a
  AR librte_acl.a
  INSTALL-LIB librte_acl.a
  AR librte_hash.a
  INSTALL-LIB librte_hash.a
/tmp/UBT164-64_K4.4.0_GCC5.4.0/x86_64-native-linuxapp-gcc/17a519c90c8b4b879a147f2de71c86c4/dpdk/mk/rte.sdkbuild.mk:46: recipe for target 'lib' failed
make[3]: *** [lib] Error 2
/tmp/UBT164-64_K4.4.0_GCC5.4.0/x86_64-native-linuxapp-gcc/17a519c90c8b4b879a147f2de71c86c4/dpdk/mk/rte.sdkroot.mk:98: recipe for target 'all' failed
make[2]: *** [all] Error 2
/tmp/UBT164-64_K4.4.0_GCC5.4.0/x86_64-native-linuxapp-gcc/17a519c90c8b4b879a147f2de71c86c4/dpdk/mk/rte.sdkinstall.mk:60: recipe for target 'pre_install' failed
make[1]: *** [pre_install] Error 2
/tmp/UBT164-64_K4.4.0_GCC5.4.0/x86_64-native-linuxapp-gcc/17a519c90c8b4b879a147f2de71c86c4/dpdk/mk/rte.sdkroot.mk:77: recipe for target 'install' failed
make: *** [install] Error 2

*Failed Build #2:
OS: UBT144-64
Target: x86_64-native-linuxapp-gcc
  INSTALL-LIB librte_metrics.a
  INSTALL-LIB librte_ring.a
  CC acl_run_avx2.o
== Build lib/librte_power
  CC cmdline_parse.o
make[5]: warning:  Clock skew detected.  Your build may be incomplete.
  CC cmdline_parse_etheraddr.o
== Build lib/librte_mempool
  AR librte_meter.a
  INSTALL-LIB librte_meter.a
== Build lib/librte_hash
--
  SYMLINK-FILE include/rte_hash.h
In file included from /tmp/UBT144-64_K4.2.0_GCC4.8.4/x86_64-native-linuxapp-gcc/17a519c90c8b4b879a147f2de71c86c4/dpdk/x86_64-native-linuxapp-gcc/include/rte_ring.h:436:0,
                 from /tmp/UBT144-64_K4.2.0_GCC4.8.4/x86_64-native-linuxapp-gcc/17a519c90c8b4b879a147f2de71c86c4/dpdk/lib/librte_mempool/rte_mempool.h:50,
                 from /tmp/UBT144-64_K4.2.0_GCC4.8.4/x86_64-native-linuxapp-gcc/17a519c90c8b4b879a147f2de71c86c4/dpdk/lib/librte_mempool/rte_mempool.c:34:
/tmp/UBT144-64_K4.2.0_GCC4.8.4/x86_64-native-linuxapp-gcc/17a519c90c8b4b879a147f2de71c86c4/dpdk/x86_64-native-linuxapp-gcc/include/rte_ring_generic.h: In function ‘__rte_ring_do_lf_enqueue_mp’:
/tmp/UBT144-64_K4.2.0_GCC4.8.4/x86_64-native-linuxapp-gcc/17a519c90c8b4b879a147f2de71c86c4/dpdk/x86_64-native-linuxapp-gcc/include/rte_ring_generic.h:511:4: warning: implicit declaration of function ‘rte_atomic128_cmp_exchange’ [-Wimplicit-function-declaration]
    success = rte_atomic128_cmp_exchange(
    ^
/tmp/UBT144-64_K4.2.0_GCC4.8.4/x86_64-native-linuxapp-gcc/17a519c90c8b4b879a147f2de71c86c4/dpdk/x86_64-native-linuxapp-gcc/include/rte_ring_generic.h:511:4: warning: nested extern declaration of ‘rte_atomic128_cmp_exchange’ [-Wnested-externs]
/tmp/UBT144-64_K4.2.0_GCC4.8.4/x86_64-native-linuxapp-gcc/17a519c90c8b4b879a147f2de71c86c4/dpdk/x86_64-native-linuxapp-gcc/include/rte_ring_generic.h:512:7: error: ‘rte_int128_t’ undeclared (first use in this function)
      (rte_int128_t *)ring_ptr,
       ^
/tmp/UBT144-64_K4.2.0_GCC4.8.4/x86_64-native-linuxapp-gcc/17a519c90c8b4b879a147f2de71c86c4/dpdk/x86_64-native-linuxapp-gcc/include/rte_ring_generic.h:512:7: note: each undeclared identifier is reported only once for each function it appears in
/tmp/UBT144-64_K4.2.0_GCC4.8.4/x86_64-native-linuxapp-gcc/17a519c90c8b4b879a147f2de71c86c4/dpdk/x86_64-native-linuxapp-gcc/include/rte_ring_generic.h:512:21: error: expected expression before ‘)’ token
      (rte_int128_t *)ring_ptr,
                     ^
/tmp/UBT144-64_K4.2.0_GCC4.8.4/x86_64-native-linuxapp-gcc/17a519c90c8b4b879a147f2de71c86c4/dpdk/x86_64-native-linuxapp-gcc/include/rte_ring_generic.h:473:40: warning: variable ‘new_value’ set but not used [-Wunused-but-set-variable]
    struct rte_ring_lf_entry old_value, new_value;
                                        ^
  SYMLINK-FILE include/rte_hash_crc.h
  SYMLINK-FILE include/rte_jhash.h
  SYMLINK-FILE include/rte_thash.h

*Failed Build #3:
OS: UBT1804
Target: x86_64-native-linuxapp-clang
  AR librte_ring.a
  CC cmdline_cirbuf.o
  AR librte_jobstats.a
  INSTALL-LIB librte_ring.a
  INSTALL-LIB librte_jobstats.a
make[5]: warning:  Clock skew detected.  Your build may be incomplete.
== Build lib/librte_mempool
== Build lib/librte_hash
  AR librte_timer.a
  INSTALL-LIB librte_timer.a
== Build lib/librte_power
--
  SYMLINK-FILE include/rte_hash_crc.h
  CC cmdline_rdline.o
In file included from /tmp/UBT1804_K4.15.0_Clang6.0.0/x86_64-native-linuxapp-clang/17a519c90c8b4b879a147f2de71c86c4/dpdk/lib/librte_mempool/rte_mempool.c:34:
In file included from /tmp/UBT1804_K4.15.0_Clang6.0.0/x86_64-native-linuxapp-clang/17a519c90c8b4b879a147f2de71c86c4/dpdk/lib/librte_mempool/rte_mempool.h:50:
In file included from /tmp/UBT1804_K4.15.0_Clang6.0.0/x86_64-native-linuxapp-clang/17a519c90c8b4b879a147f2de71c86c4/dpdk/x86_64-native-linuxapp-clang/include/rte_ring.h:436:
/tmp/UBT1804_K4.15.0_Clang6.0.0/x86_64-native-linuxapp-clang/17a519c90c8b4b879a147f2de71c86c4/dpdk/x86_64-native-linuxapp-clang/include/rte_ring_generic.h:511:14: warning: implicit declaration of function 'rte_atomic128_cmp_exchange' is invalid in C99 [-Wimplicit-function-declaration]
                        success = rte_atomic128_cmp_exchange(
                                  ^
/tmp/UBT1804_K4.15.0_Clang6.0.0/x86_64-native-linuxapp-clang/17a519c90c8b4b879a147f2de71c86c4/dpdk/x86_64-native-linuxapp-clang/include/rte_ring_generic.h:511:14: warning: this function declaration is not a prototype [-Wstrict-prototypes]
/tmp/UBT1804_K4.15.0_Clang6.0.0/x86_64-native-linuxapp-clang/17a519c90c8b4b879a147f2de71c86c4/dpdk/x86_64-native-linuxapp-clang/include/rte_ring_generic.h:512:21: error: expected expression
                                        (rte_int128_t *)ring_ptr,
                                                       ^
/tmp/UBT1804_K4.15.0_Clang6.0.0/x86_64-native-linuxapp-clang/17a519c90c8b4b879a147f2de71c86c4/dpdk/x86_64-native-linuxapp-clang/include/rte_ring_generic.h:512:7: error: use of undeclared identifier 'rte_int128_t'
                                        (rte_int128_t *)ring_ptr,
                                         ^
/tmp/UBT1804_K4.15.0_Clang6.0.0/x86_64-native-linuxapp-clang/17a519c90c8b4b879a147f2de71c86c4/dpdk/x86_64-native-linuxapp-clang/include/rte_ring_generic.h:513:21: error: expected expression
                                        (rte_int128_t *)&old_value,
                                                       ^
/tmp/UBT1804_K4.15.0_Clang6.0.0/x86_64-native-linuxapp-clang/17a519c90c8b4b879a147f2de71c86c4/dpdk/x86_64-native-linuxapp-clang/include/rte_ring_generic.h:513:7: error: use of undeclared identifier 'rte_int128_t'
                                        (rte_int128_t *)&old_value,
                                         ^
/tmp/UBT1804_K4.15.0_Clang6.0.0/x86_64-native-linuxapp-clang/17a519c90c8b4b879a147f2de71c86c4/dpdk/x86_64-native-linuxapp-clang/include/rte_ring_generic.h:514:21: error: expected expression
                                        (rte_int128_t *)&new_value,
                                                       ^
/tmp/UBT1804_K4.15.0_Clang6.0.0/x86_64-native-linuxapp-clang/17a519c90c8b4b879a147f2de71c86c4/dpdk/x86_64-native-linuxapp-clang/include/rte_ring_generic.h:514:7: error: use of undeclared identifier 'rte_int128_t'
                                        (rte_int128_t *)&new_value,
                                         ^
In file included from /tmp/UBT1804_K4.15.0_Clang6.0.0/x86_64-native-linuxapp-clang/17a519c90c8b4b879a147f2de71c86c4/dpdk/lib/librte_mempool/rte_mempool_ops.c:9:
In file included from /tmp/UBT1804_K4.15.0_Clang6.0.0/x86_64-native-linuxapp-clang/17a519c90c8b4b879a147f2de71c86c4/dpdk/x86_64-native-linuxapp-clang/include/rte_mempool.h:50:
In file included from /tmp/UBT1804_K4.15.0_Clang6.0.0/x86_64-native-linuxapp-clang/17a519c90c8b4b879a147f2de71c86c4/dpdk/x86_64-native-linuxapp-clang/include/rte_ring.h:436:
/tmp/UBT1804_K4.15.0_Clang6.0.0/x86_64-native-linuxapp-clang/17a519c90c8b4b879a147f2de71c86c4/dpdk/x86_64-native-linuxapp-clang/include/rte_ring_generic.h:511:14: warning: implicit declaration of function 'rte_atomic128_cmp_exchange' is invalid in C99 [-Wimplicit-function-declaration]
                        success = rte_atomic128_cmp_exchange(
                                  ^
/tmp/UBT1804_K4.15.0_Clang6.0.0/x86_64-native-linuxapp-clang/17a519c90c8b4b879a147f2de71c86c4/dpdk/x86_64-native-linuxapp-clang/include/rte_ring_generic.h:511:14: warning: this function declaration is not a prototype [-Wstrict-prototypes]
/tmp/UBT1804_K4.15.0_Clang6.0.0/x86_64-native-linuxapp-clang/17a519c90c8b4b879a147f2de71c86c4/dpdk/x86_64-native-linuxapp-clang/include/rte_ring_generic.h:512:21: error: expected expression
                                        (rte_int128_t *)ring_ptr,
                                                       ^
/tmp/UBT1804_K4.15.0_Clang6.0.0/x86_64-native-linuxapp-clang/17a519c90c8b4b879a147f2de71c86c4/dpdk/x86_64-native-linuxapp-clang/include/rte_ring_generic.h:512:7: error: use of undeclared identifier 'rte_int128_t'
                                        (rte_int128_t *)ring_ptr,
                                         ^
/tmp/UBT1804_K4.15.0_Clang6.0.0/x86_64-native-linuxapp-clang/17a519c90c8b4b879a147f2de71c86c4/dpdk/x86_64-native-linuxapp-clang/include/rte_ring_generic.h:513:21: error: expected expression
                                        (rte_int128_t *)&old_value,
                                                       ^
/tmp/UBT1804_K4.15.0_Clang6.0.0/x86_64-native-linuxapp-clang/17a519c90c8b4b879a147f2de71c86c4/dpdk/x86_64-native-linuxapp-clang/include/rte_ring_generic.h:513:7: error: use of undeclared identifier 'rte_int128_t'
                                        (rte_int128_t *)&old_value,
                                         ^
/tmp/UBT1804_K4.15.0_Clang6.0.0/x86_64-native-linuxapp-clang/17a519c90c8b4b879a147f2de71c86c4/dpdk/x86_64-native-linuxapp-clang/include/rte_ring_generic.h:514:21: error: expected expression
                                        (rte_int128_t *)&new_value,
                                                       ^
/tmp/UBT1804_K4.15.0_Clang6.0.0/x86_64-native-linuxapp-clang/17a519c90c8b4b879a147f2de71c86c4/dpdk/x86_64-native-linuxapp-clang/include/rte_ring_generic.h:514:7: error: use of undeclared identifier 'rte_int128_t'
                                        (rte_int128_t *)&new_value,
                                         ^
  SYMLINK-FILE include/rte_power_empty_poll.h
In file included from /tmp/UBT1804_K4.15.0_Clang6.0.0/x86_64-native-linuxapp-clang/17a519c90c8b4b879a147f2de71c86c4/dpdk/lib/librte_mempool/rte_mempool_ops_default.c:7:
In file included from /tmp/UBT1804_K4.15.0_Clang6.0.0/x86_64-native-linuxapp-clang/17a519c90c8b4b879a147f2de71c86c4/dpdk/x86_64-native-linuxapp-clang/include/rte_mempool.h:50:
In file included from /tmp/UBT1804_K4.15.0_Clang6.0.0/x86_64-native-linuxapp-clang/17a519c90c8b4b879a147f2de71c86c4/dpdk/x86_64-native-linuxapp-clang/include/rte_ring.h:436:
/tmp/UBT1804_K4.15.0_Clang6.0.0/x86_64-native-linuxapp-clang/17a519c90c8b4b879a147f2de71c86c4/dpdk/x86_64-native-linuxapp-clang/include/rte_ring_generic.h:511:14: warning: implicit declaration of function 'rte_atomic128_cmp_exchange' is invalid in C99 [-Wimplicit-function-declaration]
                        success = rte_atomic128_cmp_exchange(
                                  ^
/tmp/UBT1804_K4.15.0_Clang6.0.0/x86_64-native-linuxapp-clang/17a519c90c8b4b879a147f2de71c86c4/dpdk/x86_64-native-linuxapp-clang/include/rte_ring_generic.h:511:14: warning: this function declaration is not a prototype [-Wstrict-prototypes]
/tmp/UBT1804_K4.15.0_Clang6.0.0/x86_64-native-linuxapp-clang/17a519c90c8b4b879a147f2de71c86c4/dpdk/x86_64-native-linuxapp-clang/include/rte_ring_generic.h:512:21: error: expected expression
                                        (rte_int128_t *)ring_ptr,
                                                       ^
/tmp/UBT1804_K4.15.0_Clang6.0.0/x86_64-native-linuxapp-clang/17a519c90c8b4b879a147f2de71c86c4/dpdk/x86_64-native-linuxapp-clang/include/rte_ring_generic.h:512:7: error: use of undeclared identifier 'rte_int128_t'
                                        (rte_int128_t *)ring_ptr,
                                         ^
/tmp/UBT1804_K4.15.0_Clang6.0.0/x86_64-native-linuxapp-clang/17a519c90c8b4b879a147f2de71c86c4/dpdk/x86_64-native-linuxapp-clang/include/rte_ring_generic.h:513:21: error: expected expression
                                        (rte_int128_t *)&old_value,
                                                       ^
/tmp/UBT1804_K4.15.0_Clang6.0.0/x86_64-native-linuxapp-clang/17a519c90c8b4b879a147f2de71c86c4/dpdk/x86_64-native-linuxapp-clang/include/rte_ring_generic.h:513:7: error: use of undeclared identifier 'rte_int128_t'
                                        (rte_int128_t *)&old_value,
                                         ^
  SYMLINK-FILE include/rte_jhash.h
/tmp/UBT1804_K4.15.0_Clang6.0.0/x86_64-native-linuxapp-clang/17a519c90c8b4b879a147f2de71c86c4/dpdk/x86_64-native-linuxapp-clang/include/rte_ring_generic.h:514:21: error: expected expression
                                        (rte_int128_t *)&new_value,
                                                       ^
/tmp/UBT1804_K4.15.0_Clang6.0.0/x86_64-native-linuxapp-clang/17a519c90c8b4b879a147f2de71c86c4/dpdk/x86_64-native-linuxapp-clang/include/rte_ring_generic.h:514:7: error: use of undeclared identifier 'rte_int128_t'
                                        (rte_int128_t *)&new_value,
                                         ^
  CC rte_power.o
  SYMLINK-FILE include/rte_thash.h
  SYMLINK-FILE include/rte_fbk_hash.h
2 warnings and 6 errors generated.
/tmp/UBT1804_K4.15.0_Clang6.0.0/x86_64-native-linuxapp-clang/17a519c90c8b4b879a147f2de71c86c4/dpdk/mk/internal/rte.compile-pre.mk:114: recipe for target 'rte_mempool.o' failed
make[5]: *** [rte_mempool.o] Error 1
make[5]: *** Waiting for unfinished jobs....
  CC rte_cuckoo_hash.o
  CC cmdline_vt100.o
  CC rte_fbk_hash.o
  CC cmdline_socket.o
  CC cmdline_parse_portlist.o
2 warnings and 6 errors generated.
/tmp/UBT1804_K4.15.0_Clang6.0.0/x86_64-native-linuxapp-clang/17a519c90c8b4b879a147f2de71c86c4/dpdk/mk/internal/rte.compile-pre.mk:114: recipe for target 'rte_mempool_ops_default.o' failed
make[5]: *** [rte_mempool_ops_default.o] Error 1
  CC power_acpi_cpufreq.o
  CC power_kvm_vm.o
2 warnings and 6 errors generated.
/tmp/UBT1804_K4.15.0_Clang6.0.0/x86_64-native-linuxapp-clang/17a519c90c8b4b879a147f2de71c86c4/dpdk/mk/internal/rte.compile-pre.mk:114: recipe for target 'rte_mempool_ops.o' failed
make[5]: *** [rte_mempool_ops.o] Error 1
/tmp/UBT1804_K4.15.0_Clang6.0.0/x86_64-native-linuxapp-clang/17a519c90c8b4b879a147f2de71c86c4/dpdk/mk/rte.subdir.mk:35: recipe for target 'librte_mempool' failed
make[4]: *** [librte_mempool] Error 2
make[4]: *** Waiting for unfinished jobs....
  CC guest_channel.o
  CC power_pstate_cpufreq.o
  CC rte_power_empty_poll.o
--
  INSTALL-LIB librte_acl.a
  AR librte_power.a
  INSTALL-LIB librte_power.a
  AR librte_hash.a
  INSTALL-LIB librte_hash.a
/tmp/UBT1804_K4.15.0_Clang6.0.0/x86_64-native-linuxapp-clang/17a519c90c8b4b879a147f2de71c86c4/dpdk/mk/rte.sdkbuild.mk:46: recipe for target 'lib' failed
make[3]: *** [lib] Error 2
/tmp/UBT1804_K4.15.0_Clang6.0.0/x86_64-native-linuxapp-clang/17a519c90c8b4b879a147f2de71c86c4/dpdk/mk/rte.sdkroot.mk:98: recipe for target 'all' failed
make[2]: *** [all] Error 2
/tmp/UBT1804_K4.15.0_Clang6.0.0/x86_64-native-linuxapp-clang/17a519c90c8b4b879a147f2de71c86c4/dpdk/mk/rte.sdkinstall.mk:60: recipe for target 'pre_install' failed
make[1]: *** [pre_install] Error 2
/tmp/UBT1804_K4.15.0_Clang6.0.0/x86_64-native-linuxapp-clang/17a519c90c8b4b879a147f2de71c86c4/dpdk/mk/rte.sdkroot.mk:77: recipe for target 'install' failed
make: *** [install] Error 2

*Failed Build #4:
OS: UBT1810
Target: x86_64-native-linuxapp-gcc
  INSTALL-LIB librte_jobstats.a
  CC cmdline.o
  INSTALL-LIB librte_meter.a
  INSTALL-LIB librte_ring.a
  CC cmdline_cirbuf.o
make[5]: warning:  Clock skew detected.  Your build may be incomplete.
  AR librte_timer.a
== Build lib/librte_mempool
  INSTALL-LIB librte_timer.a
== Build lib/librte_hash
== Build lib/librte_power
--
  SYMLINK-FILE include/rte_fbk_hash.h
In file included from /tmp/UBT1810_K4.18.0_GCC8.2.0/x86_64-native-linuxapp-gcc/17a519c90c8b4b879a147f2de71c86c4/dpdk/x86_64-native-linuxapp-gcc/include/rte_ring.h:436,
                 from /tmp/UBT1810_K4.18.0_GCC8.2.0/x86_64-native-linuxapp-gcc/17a519c90c8b4b879a147f2de71c86c4/dpdk/lib/librte_mempool/rte_mempool.h:50,
                 from /tmp/UBT1810_K4.18.0_GCC8.2.0/x86_64-native-linuxapp-gcc/17a519c90c8b4b879a147f2de71c86c4/dpdk/lib/librte_mempool/rte_mempool.c:34:
/tmp/UBT1810_K4.18.0_GCC8.2.0/x86_64-native-linuxapp-gcc/17a519c90c8b4b879a147f2de71c86c4/dpdk/x86_64-native-linuxapp-gcc/include/rte_ring_generic.h: In function ‘__rte_ring_do_lf_enqueue_mp’:
/tmp/UBT1810_K4.18.0_GCC8.2.0/x86_64-native-linuxapp-gcc/17a519c90c8b4b879a147f2de71c86c4/dpdk/x86_64-native-linuxapp-gcc/include/rte_ring_generic.h:511:14: warning: implicit declaration of function ‘rte_atomic128_cmp_exchange’; did you mean ‘rte_atomic32_exchange’? [-Wimplicit-function-declaration]
    success = rte_atomic128_cmp_exchange(
              ^~~~~~~~~~~~~~~~~~~~~~~~~~
              rte_atomic32_exchange
/tmp/UBT1810_K4.18.0_GCC8.2.0/x86_64-native-linuxapp-gcc/17a519c90c8b4b879a147f2de71c86c4/dpdk/x86_64-native-linuxapp-gcc/include/rte_ring_generic.h:511:14: warning: nested extern declaration of ‘rte_atomic128_cmp_exchange’ [-Wnested-externs]
/tmp/UBT1810_K4.18.0_GCC8.2.0/x86_64-native-linuxapp-gcc/17a519c90c8b4b879a147f2de71c86c4/dpdk/x86_64-native-linuxapp-gcc/include/rte_ring_generic.h:512:7: error: ‘rte_int128_t’ undeclared (first use in this function); did you mean ‘rte_iova_t’?
      (rte_int128_t *)ring_ptr,
       ^~~~~~~~~~~~
       rte_iova_t
/tmp/UBT1810_K4.18.0_GCC8.2.0/x86_64-native-linuxapp-gcc/17a519c90c8b4b879a147f2de71c86c4/dpdk/x86_64-native-linuxapp-gcc/include/rte_ring_generic.h:512:7: note: each undeclared identifier is reported only once for each function it appears in
/tmp/UBT1810_K4.18.0_GCC8.2.0/x86_64-native-linuxapp-gcc/17a519c90c8b4b879a147f2de71c86c4/dpdk/x86_64-native-linuxapp-gcc/include/rte_ring_generic.h:512:21: error: expected expression before ‘)’ token
      (rte_int128_t *)ring_ptr,
                     ^
/tmp/UBT1810_K4.18.0_GCC8.2.0/x86_64-native-linuxapp-gcc/17a519c90c8b4b879a147f2de71c86c4/dpdk/x86_64-native-linuxapp-gcc/include/rte_ring_generic.h:473:40: warning: variable ‘new_value’ set but not used [-Wunused-but-set-variable]
    struct rte_ring_lf_entry old_value, new_value;
                                        ^~~~~~~~~
  CC rte_power.o
  CC power_acpi_cpufreq.o
In file included from /tmp/UBT1810_K4.18.0_GCC8.2.0/x86_64-native-linuxapp-gcc/17a519c90c8b4b879a147f2de71c86c4/dpdk/x86_64-native-linuxapp-gcc/include/rte_ring.h:436,
                 from /tmp/UBT1810_K4.18.0_GCC8.2.0/x86_64-native-linuxapp-gcc/17a519c90c8b4b879a147f2de71c86c4/dpdk/x86_64-native-linuxapp-gcc/include/rte_mempool.h:50,
                 from /tmp/UBT1810_K4.18.0_GCC8.2.0/x86_64-native-linuxapp-gcc/17a519c90c8b4b879a147f2de71c86c4/dpdk/lib/librte_mempool/rte_mempool_ops.c:9:
/tmp/UBT1810_K4.18.0_GCC8.2.0/x86_64-native-linuxapp-gcc/17a519c90c8b4b879a147f2de71c86c4/dpdk/x86_64-native-linuxapp-gcc/include/rte_ring_generic.h: In function ‘__rte_ring_do_lf_enqueue_mp’:
/tmp/UBT1810_K4.18.0_GCC8.2.0/x86_64-native-linuxapp-gcc/17a519c90c8b4b879a147f2de71c86c4/dpdk/x86_64-native-linuxapp-gcc/include/rte_ring_generic.h:511:14: warning: implicit declaration of function ‘rte_atomic128_cmp_exchange’; did you mean ‘rte_atomic32_exchange’? [-Wimplicit-function-declaration]
    success = rte_atomic128_cmp_exchange(
              ^~~~~~~~~~~~~~~~~~~~~~~~~~
              rte_atomic32_exchange
/tmp/UBT1810_K4.18.0_GCC8.2.0/x86_64-native-linuxapp-gcc/17a519c90c8b4b879a147f2de71c86c4/dpdk/x86_64-native-linuxapp-gcc/include/rte_ring_generic.h:511:14: warning: nested extern declaration of ‘rte_atomic128_cmp_exchange’ [-Wnested-externs]
/tmp/UBT1810_K4.18.0_GCC8.2.0/x86_64-native-linuxapp-gcc/17a519c90c8b4b879a147f2de71c86c4/dpdk/x86_64-native-linuxapp-gcc/include/rte_ring_generic.h:512:7: error: ‘rte_int128_t’ undeclared (first use in this function); did you mean ‘rte_iova_t’?
      (rte_int128_t *)ring_ptr,
       ^~~~~~~~~~~~
       rte_iova_t
/tmp/UBT1810_K4.18.0_GCC8.2.0/x86_64-native-linuxapp-gcc/17a519c90c8b4b879a147f2de71c86c4/dpdk/x86_64-native-linuxapp-gcc/include/rte_ring_generic.h:512:7: note: each undeclared identifier is reported only once for each function it appears in
/tmp/UBT1810_K4.18.0_GCC8.2.0/x86_64-native-linuxapp-gcc/17a519c90c8b4b879a147f2de71c86c4/dpdk/x86_64-native-linuxapp-gcc/include/rte_ring_generic.h:512:21: error: expected expression before ‘)’ token
      (rte_int128_t *)ring_ptr,
                     ^
/tmp/UBT1810_K4.18.0_GCC8.2.0/x86_64-native-linuxapp-gcc/17a519c90c8b4b879a147f2de71c86c4/dpdk/x86_64-native-linuxapp-gcc/include/rte_ring_generic.h:473:40: warning: variable ‘new_value’ set but not used [-Wunused-but-set-variable]
    struct rte_ring_lf_entry old_value, new_value;
                                        ^~~~~~~~~
In file included from /tmp/UBT1810_K4.18.0_GCC8.2.0/x86_64-native-linuxapp-gcc/17a519c90c8b4b879a147f2de71c86c4/dpdk/x86_64-native-linuxapp-gcc/include/rte_ring.h:436,
                 from /tmp/UBT1810_K4.18.0_GCC8.2.0/x86_64-native-linuxapp-gcc/17a519c90c8b4b879a147f2de71c86c4/dpdk/x86_64-native-linuxapp-gcc/include/rte_mempool.h:50,
                 from /tmp/UBT1810_K4.18.0_GCC8.2.0/x86_64-native-linuxapp-gcc/17a519c90c8b4b879a147f2de71c86c4/dpdk/lib/librte_mempool/rte_mempool_ops_default.c:7:
/tmp/UBT1810_K4.18.0_GCC8.2.0/x86_64-native-linuxapp-gcc/17a519c90c8b4b879a147f2de71c86c4/dpdk/x86_64-native-linuxapp-gcc/include/rte_ring_generic.h: In function ‘__rte_ring_do_lf_enqueue_mp’:
  CC power_kvm_vm.o
/tmp/UBT1810_K4.18.0_GCC8.2.0/x86_64-native-linuxapp-gcc/17a519c90c8b4b879a147f2de71c86c4/dpdk/x86_64-native-linuxapp-gcc/include/rte_ring_generic.h:511:14: warning: implicit declaration of function ‘rte_atomic128_cmp_exchange’; did you mean ‘rte_atomic32_exchange’? [-Wimplicit-function-declaration]
    success = rte_atomic128_cmp_exchange(
              ^~~~~~~~~~~~~~~~~~~~~~~~~~
              rte_atomic32_exchange
/tmp/UBT1810_K4.18.0_GCC8.2.0/x86_64-native-linuxapp-gcc/17a519c90c8b4b879a147f2de71c86c4/dpdk/x86_64-native-linuxapp-gcc/include/rte_ring_generic.h:511:14: warning: nested extern declaration of ‘rte_atomic128_cmp_exchange’ [-Wnested-externs]
/tmp/UBT1810_K4.18.0_GCC8.2.0/x86_64-native-linuxapp-gcc/17a519c90c8b4b879a147f2de71c86c4/dpdk/x86_64-native-linuxapp-gcc/include/rte_ring_generic.h:512:7: error: ‘rte_int128_t’ undeclared (first use in this function); did you mean ‘rte_iova_t’?
      (rte_int128_t *)ring_ptr,
       ^~~~~~~~~~~~
       rte_iova_t
/tmp/UBT1810_K4.18.0_GCC8.2.0/x86_64-native-linuxapp-gcc/17a519c90c8b4b879a147f2de71c86c4/dpdk/x86_64-native-linuxapp-gcc/include/rte_ring_generic.h:512:7: note: each undeclared identifier is reported only once for each function it appears in
/tmp/UBT1810_K4.18.0_GCC8.2.0/x86_64-native-linuxapp-gcc/17a519c90c8b4b879a147f2de71c86c4/dpdk/x86_64-native-linuxapp-gcc/include/rte_ring_generic.h:512:21: error: expected expression before ‘)’ token
      (rte_int128_t *)ring_ptr,
                     ^
/tmp/UBT1810_K4.18.0_GCC8.2.0/x86_64-native-linuxapp-gcc/17a519c90c8b4b879a147f2de71c86c4/dpdk/x86_64-native-linuxapp-gcc/include/rte_ring_generic.h:473:40: warning: variable ‘new_value’ set but not used [-Wunused-but-set-variable]
    struct rte_ring_lf_entry old_value, new_value;
                                        ^~~~~~~~~
  CC rte_cuckoo_hash.o
  CC rte_fbk_hash.o
  CC guest_channel.o

*Failed Build #5:
OS: UBT1804
Target: x86_64-native-linuxapp-gcc
  AR librte_ring.a
  SYMLINK-FILE include/cmdline_parse_num.h
  INSTALL-LIB librte_ring.a
  SYMLINK-FILE include/cmdline_parse_ipaddr.h
  SYMLINK-FILE include/cmdline_parse_etheraddr.h
make[5]: warning:  Clock skew detected.  Your build may be incomplete.
== Build lib/librte_mempool
  SYMLINK-FILE include/cmdline_parse_string.h
  AR librte_meter.a
  CC acl_gen.o
  INSTALL-LIB librte_meter.a
--
/tmp/UBT1804_K4.15.0_GCC7.3.0/x86_64-native-linuxapp-gcc/17a519c90c8b4b879a147f2de71c86c4/dpdk/x86_64-native-linuxapp-gcc/include/rte_ring_generic.h: In function ‘__rte_ring_do_lf_enqueue_mp’:
In file included from /tmp/UBT1804_K4.15.0_GCC7.3.0/x86_64-native-linuxapp-gcc/17a519c90c8b4b879a147f2de71c86c4/dpdk/x86_64-native-linuxapp-gcc/include/rte_ring.h:436:0,
                 from /tmp/UBT1804_K4.15.0_GCC7.3.0/x86_64-native-linuxapp-gcc/17a519c90c8b4b879a147f2de71c86c4/dpdk/x86_64-native-linuxapp-gcc/include/rte_mempool.h:50,
                 from /tmp/UBT1804_K4.15.0_GCC7.3.0/x86_64-native-linuxapp-gcc/17a519c90c8b4b879a147f2de71c86c4/dpdk/lib/librte_mempool/rte_mempool_ops_default.c:7:
/tmp/UBT1804_K4.15.0_GCC7.3.0/x86_64-native-linuxapp-gcc/17a519c90c8b4b879a147f2de71c86c4/dpdk/x86_64-native-linuxapp-gcc/include/rte_ring_generic.h: In function ‘__rte_ring_do_lf_enqueue_mp’:
/tmp/UBT1804_K4.15.0_GCC7.3.0/x86_64-native-linuxapp-gcc/17a519c90c8b4b879a147f2de71c86c4/dpdk/x86_64-native-linuxapp-gcc/include/rte_ring_generic.h:511:14: warning: implicit declaration of function ‘rte_atomic128_cmp_exchange’; did you mean ‘rte_atomic32_exchange’? [-Wimplicit-function-declaration]
    success = rte_atomic128_cmp_exchange(
              ^~~~~~~~~~~~~~~~~~~~~~~~~~
              rte_atomic32_exchange
/tmp/UBT1804_K4.15.0_GCC7.3.0/x86_64-native-linuxapp-gcc/17a519c90c8b4b879a147f2de71c86c4/dpdk/x86_64-native-linuxapp-gcc/include/rte_ring_generic.h:511:14: warning: nested extern declaration of ‘rte_atomic128_cmp_exchange’ [-Wnested-externs]
/tmp/UBT1804_K4.15.0_GCC7.3.0/x86_64-native-linuxapp-gcc/17a519c90c8b4b879a147f2de71c86c4/dpdk/x86_64-native-linuxapp-gcc/include/rte_ring_generic.h:512:7: error: ‘rte_int128_t’ undeclared (first use in this function); did you mean ‘__int128_t’?
      (rte_int128_t *)ring_ptr,
       ^~~~~~~~~~~~
       __int128_t
/tmp/UBT1804_K4.15.0_GCC7.3.0/x86_64-native-linuxapp-gcc/17a519c90c8b4b879a147f2de71c86c4/dpdk/x86_64-native-linuxapp-gcc/include/rte_ring_generic.h:512:7: note: each undeclared identifier is reported only once for each function it appears in
/tmp/UBT1804_K4.15.0_GCC7.3.0/x86_64-native-linuxapp-gcc/17a519c90c8b4b879a147f2de71c86c4/dpdk/x86_64-native-linuxapp-gcc/include/rte_ring_generic.h:512:21: error: expected expression before ‘)’ token
      (rte_int128_t *)ring_ptr,
                     ^
/tmp/UBT1804_K4.15.0_GCC7.3.0/x86_64-native-linuxapp-gcc/17a519c90c8b4b879a147f2de71c86c4/dpdk/x86_64-native-linuxapp-gcc/include/rte_ring_generic.h:473:40: warning: variable ‘new_value’ set but not used [-Wunused-but-set-variable]
    struct rte_ring_lf_entry old_value, new_value;
                                        ^~~~~~~~~
/tmp/UBT1804_K4.15.0_GCC7.3.0/x86_64-native-linuxapp-gcc/17a519c90c8b4b879a147f2de71c86c4/dpdk/x86_64-native-linuxapp-gcc/include/rte_ring_generic.h:511:14: warning: implicit declaration of function ‘rte_atomic128_cmp_exchange’; did you mean ‘rte_atomic32_exchange’? [-Wimplicit-function-declaration]
    success = rte_atomic128_cmp_exchange(
              ^~~~~~~~~~~~~~~~~~~~~~~~~~
              rte_atomic32_exchange
/tmp/UBT1804_K4.15.0_GCC7.3.0/x86_64-native-linuxapp-gcc/17a519c90c8b4b879a147f2de71c86c4/dpdk/x86_64-native-linuxapp-gcc/include/rte_ring_generic.h:511:14: warning: nested extern declaration of ‘rte_atomic128_cmp_exchange’ [-Wnested-externs]
  SYMLINK-FILE include/rte_hash_crc.h
/tmp/UBT1804_K4.15.0_GCC7.3.0/x86_64-native-linuxapp-gcc/17a519c90c8b4b879a147f2de71c86c4/dpdk/x86_64-native-linuxapp-gcc/include/rte_ring_generic.h:512:7: error: ‘rte_int128_t’ undeclared (first use in this function); did you mean ‘__int128_t’?
      (rte_int128_t *)ring_ptr,
       ^~~~~~~~~~~~
       __int128_t
/tmp/UBT1804_K4.15.0_GCC7.3.0/x86_64-native-linuxapp-gcc/17a519c90c8b4b879a147f2de71c86c4/dpdk/x86_64-native-linuxapp-gcc/include/rte_ring_generic.h:512:7: note: each undeclared identifier is reported only once for each function it appears in
/tmp/UBT1804_K4.15.0_GCC7.3.0/x86_64-native-linuxapp-gcc/17a519c90c8b4b879a147f2de71c86c4/dpdk/x86_64-native-linuxapp-gcc/include/rte_ring_generic.h:512:21: error: expected expression before ‘)’ token
      (rte_int128_t *)ring_ptr,
                     ^
/tmp/UBT1804_K4.15.0_GCC7.3.0/x86_64-native-linuxapp-gcc/17a519c90c8b4b879a147f2de71c86c4/dpdk/x86_64-native-linuxapp-gcc/include/rte_ring_generic.h:473:40: warning: variable ‘new_value’ set but not used [-Wunused-but-set-variable]
    struct rte_ring_lf_entry old_value, new_value;
                                        ^~~~~~~~~
  SYMLINK-FILE include/rte_jhash.h
  SYMLINK-FILE include/rte_thash.h
  SYMLINK-FILE include/rte_hash.h
In file included from /tmp/UBT1804_K4.15.0_GCC7.3.0/x86_64-native-linuxapp-gcc/17a519c90c8b4b879a147f2de71c86c4/dpdk/x86_64-native-linuxapp-gcc/include/rte_ring.h:436:0,
                 from /tmp/UBT1804_K4.15.0_GCC7.3.0/x86_64-native-linuxapp-gcc/17a519c90c8b4b879a147f2de71c86c4/dpdk/lib/librte_mempool/rte_mempool.h:50,
                 from /tmp/UBT1804_K4.15.0_GCC7.3.0/x86_64-native-linuxapp-gcc/17a519c90c8b4b879a147f2de71c86c4/dpdk/lib/librte_mempool/rte_mempool.c:34:
/tmp/UBT1804_K4.15.0_GCC7.3.0/x86_64-native-linuxapp-gcc/17a519c90c8b4b879a147f2de71c86c4/dpdk/x86_64-native-linuxapp-gcc/include/rte_ring_generic.h: In function ‘__rte_ring_do_lf_enqueue_mp’:
/tmp/UBT1804_K4.15.0_GCC7.3.0/x86_64-native-linuxapp-gcc/17a519c90c8b4b879a147f2de71c86c4/dpdk/x86_64-native-linuxapp-gcc/include/rte_ring_generic.h:511:14: warning: implicit declaration of function ‘rte_atomic128_cmp_exchange’; did you mean ‘rte_atomic32_exchange’? [-Wimplicit-function-declaration]
    success = rte_atomic128_cmp_exchange(
              ^~~~~~~~~~~~~~~~~~~~~~~~~~
              rte_atomic32_exchange
/tmp/UBT1804_K4.15.0_GCC7.3.0/x86_64-native-linuxapp-gcc/17a519c90c8b4b879a147f2de71c86c4/dpdk/x86_64-native-linuxapp-gcc/include/rte_ring_generic.h:511:14: warning: nested extern declaration of ‘rte_atomic128_cmp_exchange’ [-Wnested-externs]
/tmp/UBT1804_K4.15.0_GCC7.3.0/x86_64-native-linuxapp-gcc/17a519c90c8b4b879a147f2de71c86c4/dpdk/x86_64-native-linuxapp-gcc/include/rte_ring_generic.h:512:7: error: ‘rte_int128_t’ undeclared (first use in this function); did you mean ‘__int128_t’?
      (rte_int128_t *)ring_ptr,
       ^~~~~~~~~~~~
       __int128_t
/tmp/UBT1804_K4.15.0_GCC7.3.0/x86_64-native-linuxapp-gcc/17a519c90c8b4b879a147f2de71c86c4/dpdk/x86_64-native-linuxapp-gcc/include/rte_ring_generic.h:512:7: note: each undeclared identifier is reported only once for each function it appears in
/tmp/UBT1804_K4.15.0_GCC7.3.0/x86_64-native-linuxapp-gcc/17a519c90c8b4b879a147f2de71c86c4/dpdk/x86_64-native-linuxapp-gcc/include/rte_ring_generic.h:512:21: error: expected expression before ‘)’ token
      (rte_int128_t *)ring_ptr,
                     ^
/tmp/UBT1804_K4.15.0_GCC7.3.0/x86_64-native-linuxapp-gcc/17a519c90c8b4b879a147f2de71c86c4/dpdk/x86_64-native-linuxapp-gcc/include/rte_ring_generic.h:473:40: warning: variable ‘new_value’ set but not used [-Wunused-but-set-variable]
    struct rte_ring_lf_entry old_value, new_value;
                                        ^~~~~~~~~
  SYMLINK-FILE include/rte_fbk_hash.h
  CC rte_fbk_hash.o
  CC rte_cuckoo_hash.o
  SYMLINK-FILE include/rte_power_empty_poll.h
  SYMLINK-FILE include/rte_power.h
  CC rte_power.o
  CC power_acpi_cpufreq.o
/tmp/UBT1804_K4.15.0_GCC7.3.0/x86_64-native-linuxapp-gcc/17a519c90c8b4b879a147f2de71c86c4/dpdk/mk/internal/rte.compile-pre.mk:114: recipe for target 'rte_mempool_ops_default.o' failed
make[5]: *** [rte_mempool_ops_default.o] Error 1
make[5]: *** Waiting for unfinished jobs....
  CC power_kvm_vm.o
  CC guest_channel.o
  CC rte_power_empty_poll.o
/tmp/UBT1804_K4.15.0_GCC7.3.0/x86_64-native-linuxapp-gcc/17a519c90c8b4b879a147f2de71c86c4/dpdk/mk/internal/rte.compile-pre.mk:114: recipe for target 'rte_mempool_ops.o' failed
make[5]: *** [rte_mempool_ops.o] Error 1
/tmp/UBT1804_K4.15.0_GCC7.3.0/x86_64-native-linuxapp-gcc/17a519c90c8b4b879a147f2de71c86c4/dpdk/mk/internal/rte.compile-pre.mk:114: recipe for target 'rte_mempool.o' failed
make[5]: *** [rte_mempool.o] Error 1
/tmp/UBT1804_K4.15.0_GCC7.3.0/x86_64-native-linuxapp-gcc/17a519c90c8b4b879a147f2de71c86c4/dpdk/mk/rte.subdir.mk:35: recipe for target 'librte_mempool' failed
make[4]: *** [librte_mempool] Error 2
make[4]: *** Waiting for unfinished jobs....
  CC power_pstate_cpufreq.o
  AR librte_acl.a
  INSTALL-LIB librte_acl.a
  AR librte_power.a
  INSTALL-LIB librte_power.a
  AR librte_hash.a
  INSTALL-LIB librte_hash.a
/tmp/UBT1804_K4.15.0_GCC7.3.0/x86_64-native-linuxapp-gcc/17a519c90c8b4b879a147f2de71c86c4/dpdk/mk/rte.sdkbuild.mk:46: recipe for target 'lib' failed
make[3]: *** [lib] Error 2
/tmp/UBT1804_K4.15.0_GCC7.3.0/x86_64-native-linuxapp-gcc/17a519c90c8b4b879a147f2de71c86c4/dpdk/mk/rte.sdkroot.mk:98: recipe for target 'all' failed
make[2]: *** [all] Error 2
/tmp/UBT1804_K4.15.0_GCC7.3.0/x86_64-native-linuxapp-gcc/17a519c90c8b4b879a147f2de71c86c4/dpdk/mk/rte.sdkinstall.mk:60: recipe for target 'pre_install' failed
make[1]: *** [pre_install] Error 2
/tmp/UBT1804_K4.15.0_GCC7.3.0/x86_64-native-linuxapp-gcc/17a519c90c8b4b879a147f2de71c86c4/dpdk/mk/rte.sdkroot.mk:77: recipe for target 'install' failed
make: *** [install] Error 2

*Failed Build #6:
OS: UBT1804
Target: x86_64-native-linuxapp-icc
  INSTALL-LIB librte_metrics.a
  CC cmdline_cirbuf.o
  CC cmdline_parse.o
  AR librte_ring.a
  INSTALL-LIB librte_ring.a
make[5]: warning:  Clock skew detected.  Your build may be incomplete.
== Build lib/librte_mempool
  CC acl_gen.o
  AR librte_timer.a
  AR librte_meter.a
  INSTALL-LIB librte_timer.a
--
  CC guest_channel.o
  CC rte_power_empty_poll.o
In file included from /tmp/UBT1804_K4.15.0_ICC19.0.0/x86_64-native-linuxapp-icc/17a519c90c8b4b879a147f2de71c86c4/dpdk/x86_64-native-linuxapp-icc/include/rte_ring.h(436),
                 from /tmp/UBT1804_K4.15.0_ICC19.0.0/x86_64-native-linuxapp-icc/17a519c90c8b4b879a147f2de71c86c4/dpdk/lib/librte_mempool/rte_mempool.h(50),
                 from /tmp/UBT1804_K4.15.0_ICC19.0.0/x86_64-native-linuxapp-icc/17a519c90c8b4b879a147f2de71c86c4/dpdk/lib/librte_mempool/rte_mempool.c(34):
/tmp/UBT1804_K4.15.0_ICC19.0.0/x86_64-native-linuxapp-icc/17a519c90c8b4b879a147f2de71c86c4/dpdk/x86_64-native-linuxapp-icc/include/rte_ring_generic.h(511): warning #266: function "rte_atomic128_cmp_exchange" declared implicitly
  			success = rte_atomic128_cmp_exchange(
  			          ^

In file included from /tmp/UBT1804_K4.15.0_ICC19.0.0/x86_64-native-linuxapp-icc/17a519c90c8b4b879a147f2de71c86c4/dpdk/x86_64-native-linuxapp-icc/include/rte_ring.h(436),
                 from /tmp/UBT1804_K4.15.0_ICC19.0.0/x86_64-native-linuxapp-icc/17a519c90c8b4b879a147f2de71c86c4/dpdk/lib/librte_mempool/rte_mempool.h(50),
                 from /tmp/UBT1804_K4.15.0_ICC19.0.0/x86_64-native-linuxapp-icc/17a519c90c8b4b879a147f2de71c86c4/dpdk/lib/librte_mempool/rte_mempool.c(34):
/tmp/UBT1804_K4.15.0_ICC19.0.0/x86_64-native-linuxapp-icc/17a519c90c8b4b879a147f2de71c86c4/dpdk/x86_64-native-linuxapp-icc/include/rte_ring_generic.h(512): error: identifier "rte_int128_t" is undefined
  					(rte_int128_t *)ring_ptr,
  					 ^

In file included from /tmp/UBT1804_K4.15.0_ICC19.0.0/x86_64-native-linuxapp-icc/17a519c90c8b4b879a147f2de71c86c4/dpdk/x86_64-native-linuxapp-icc/include/rte_ring.h(436),
                 from /tmp/UBT1804_K4.15.0_ICC19.0.0/x86_64-native-linuxapp-icc/17a519c90c8b4b879a147f2de71c86c4/dpdk/lib/librte_mempool/rte_mempool.h(50),
                 from /tmp/UBT1804_K4.15.0_ICC19.0.0/x86_64-native-linuxapp-icc/17a519c90c8b4b879a147f2de71c86c4/dpdk/lib/librte_mempool/rte_mempool.c(34):
/tmp/UBT1804_K4.15.0_ICC19.0.0/x86_64-native-linuxapp-icc/17a519c90c8b4b879a147f2de71c86c4/dpdk/x86_64-native-linuxapp-icc/include/rte_ring_generic.h(512): error: expected an expression
  					(rte_int128_t *)ring_ptr,
  					               ^

In file included from /tmp/UBT1804_K4.15.0_ICC19.0.0/x86_64-native-linuxapp-icc/17a519c90c8b4b879a147f2de71c86c4/dpdk/x86_64-native-linuxapp-icc/include/rte_ring.h(436),
                 from /tmp/UBT1804_K4.15.0_ICC19.0.0/x86_64-native-linuxapp-icc/17a519c90c8b4b879a147f2de71c86c4/dpdk/lib/librte_mempool/rte_mempool.h(50),
                 from /tmp/UBT1804_K4.15.0_ICC19.0.0/x86_64-native-linuxapp-icc/17a519c90c8b4b879a147f2de71c86c4/dpdk/lib/librte_mempool/rte_mempool.c(34):
/tmp/UBT1804_K4.15.0_ICC19.0.0/x86_64-native-linuxapp-icc/17a519c90c8b4b879a147f2de71c86c4/dpdk/x86_64-native-linuxapp-icc/include/rte_ring_generic.h(512): error: expected a ")"
  					(rte_int128_t *)ring_ptr,
  					                ^

In file included from /tmp/UBT1804_K4.15.0_ICC19.0.0/x86_64-native-linuxapp-icc/17a519c90c8b4b879a147f2de71c86c4/dpdk/x86_64-native-linuxapp-icc/include/rte_ring.h(436),
                 from /tmp/UBT1804_K4.15.0_ICC19.0.0/x86_64-native-linuxapp-icc/17a519c90c8b4b879a147f2de71c86c4/dpdk/lib/librte_mempool/rte_mempool.h(50),
                 from /tmp/UBT1804_K4.15.0_ICC19.0.0/x86_64-native-linuxapp-icc/17a519c90c8b4b879a147f2de71c86c4/dpdk/lib/librte_mempool/rte_mempool.c(34):
/tmp/UBT1804_K4.15.0_ICC19.0.0/x86_64-native-linuxapp-icc/17a519c90c8b4b879a147f2de71c86c4/dpdk/x86_64-native-linuxapp-icc/include/rte_ring_generic.h(516): warning #12: parsing restarts here after previous syntax error
  					__ATOMIC_RELAXED);
  					                ^

  SYMLINK-FILE include/rte_jhash.h
compilation aborted for /tmp/UBT1804_K4.15.0_ICC19.0.0/x86_64-native-linuxapp-icc/17a519c90c8b4b879a147f2de71c86c4/dpdk/lib/librte_mempool/rte_mempool.c (code 2)
/tmp/UBT1804_K4.15.0_ICC19.0.0/x86_64-native-linuxapp-icc/17a519c90c8b4b879a147f2de71c86c4/dpdk/mk/internal/rte.compile-pre.mk:114: recipe for target 'rte_mempool.o' failed
make[5]: *** [rte_mempool.o] Error 2
make[5]: *** Waiting for unfinished jobs....
  SYMLINK-FILE include/rte_thash.h
In file included from /tmp/UBT1804_K4.15.0_ICC19.0.0/x86_64-native-linuxapp-icc/17a519c90c8b4b879a147f2de71c86c4/dpdk/x86_64-native-linuxapp-icc/include/rte_ring.h(436),
                 from /tmp/UBT1804_K4.15.0_ICC19.0.0/x86_64-native-linuxapp-icc/17a519c90c8b4b879a147f2de71c86c4/dpdk/x86_64-native-linuxapp-icc/include/rte_mempool.h(50),
                 from /tmp/UBT1804_K4.15.0_ICC19.0.0/x86_64-native-linuxapp-icc/17a519c90c8b4b879a147f2de71c86c4/dpdk/lib/librte_mempool/rte_mempool_ops_default.c(7):
/tmp/UBT1804_K4.15.0_ICC19.0.0/x86_64-native-linuxapp-icc/17a519c90c8b4b879a147f2de71c86c4/dpdk/x86_64-native-linuxapp-icc/include/rte_ring_generic.h(511): warning #266: function "rte_atomic128_cmp_exchange" declared implicitly
  			success = rte_atomic128_cmp_exchange(
  			          ^

In file included from /tmp/UBT1804_K4.15.0_ICC19.0.0/x86_64-native-linuxapp-icc/17a519c90c8b4b879a147f2de71c86c4/dpdk/x86_64-native-linuxapp-icc/include/rte_ring.h(436),
                 from /tmp/UBT1804_K4.15.0_ICC19.0.0/x86_64-native-linuxapp-icc/17a519c90c8b4b879a147f2de71c86c4/dpdk/x86_64-native-linuxapp-icc/include/rte_mempool.h(50),
                 from /tmp/UBT1804_K4.15.0_ICC19.0.0/x86_64-native-linuxapp-icc/17a519c90c8b4b879a147f2de71c86c4/dpdk/lib/librte_mempool/rte_mempool_ops_default.c(7):
/tmp/UBT1804_K4.15.0_ICC19.0.0/x86_64-native-linuxapp-icc/17a519c90c8b4b879a147f2de71c86c4/dpdk/x86_64-native-linuxapp-icc/include/rte_ring_generic.h(512): error: identifier "rte_int128_t" is undefined
  					(rte_int128_t *)ring_ptr,
  					 ^

In file included from /tmp/UBT1804_K4.15.0_ICC19.0.0/x86_64-native-linuxapp-icc/17a519c90c8b4b879a147f2de71c86c4/dpdk/x86_64-native-linuxapp-icc/include/rte_ring.h(436),
                 from /tmp/UBT1804_K4.15.0_ICC19.0.0/x86_64-native-linuxapp-icc/17a519c90c8b4b879a147f2de71c86c4/dpdk/x86_64-native-linuxapp-icc/include/rte_mempool.h(50),
                 from /tmp/UBT1804_K4.15.0_ICC19.0.0/x86_64-native-linuxapp-icc/17a519c90c8b4b879a147f2de71c86c4/dpdk/lib/librte_mempool/rte_mempool_ops_default.c(7):
/tmp/UBT1804_K4.15.0_ICC19.0.0/x86_64-native-linuxapp-icc/17a519c90c8b4b879a147f2de71c86c4/dpdk/x86_64-native-linuxapp-icc/include/rte_ring_generic.h(512): error: expected an expression
  					(rte_int128_t *)ring_ptr,
  					               ^

In file included from /tmp/UBT1804_K4.15.0_ICC19.0.0/x86_64-native-linuxapp-icc/17a519c90c8b4b879a147f2de71c86c4/dpdk/x86_64-native-linuxapp-icc/include/rte_ring.h(436),
                 from /tmp/UBT1804_K4.15.0_ICC19.0.0/x86_64-native-linuxapp-icc/17a519c90c8b4b879a147f2de71c86c4/dpdk/x86_64-native-linuxapp-icc/include/rte_mempool.h(50),
                 from /tmp/UBT1804_K4.15.0_ICC19.0.0/x86_64-native-linuxapp-icc/17a519c90c8b4b879a147f2de71c86c4/dpdk/lib/librte_mempool/rte_mempool_ops_default.c(7):
/tmp/UBT1804_K4.15.0_ICC19.0.0/x86_64-native-linuxapp-icc/17a519c90c8b4b879a147f2de71c86c4/dpdk/x86_64-native-linuxapp-icc/include/rte_ring_generic.h(512): error: expected a ")"
  					(rte_int128_t *)ring_ptr,
  					                ^

In file included from /tmp/UBT1804_K4.15.0_ICC19.0.0/x86_64-native-linuxapp-icc/17a519c90c8b4b879a147f2de71c86c4/dpdk/x86_64-native-linuxapp-icc/include/rte_ring.h(436),
                 from /tmp/UBT1804_K4.15.0_ICC19.0.0/x86_64-native-linuxapp-icc/17a519c90c8b4b879a147f2de71c86c4/dpdk/x86_64-native-linuxapp-icc/include/rte_mempool.h(50),
                 from /tmp/UBT1804_K4.15.0_ICC19.0.0/x86_64-native-linuxapp-icc/17a519c90c8b4b879a147f2de71c86c4/dpdk/lib/librte_mempool/rte_mempool_ops_default.c(7):
/tmp/UBT1804_K4.15.0_ICC19.0.0/x86_64-native-linuxapp-icc/17a519c90c8b4b879a147f2de71c86c4/dpdk/x86_64-native-linuxapp-icc/include/rte_ring_generic.h(516): warning #12: parsing restarts here after previous syntax error
  					__ATOMIC_RELAXED);
  					                ^

  SYMLINK-FILE include/rte_fbk_hash.h
compilation aborted for /tmp/UBT1804_K4.15.0_ICC19.0.0/x86_64-native-linuxapp-icc/17a519c90c8b4b879a147f2de71c86c4/dpdk/lib/librte_mempool/rte_mempool_ops_default.c (code 2)
/tmp/UBT1804_K4.15.0_ICC19.0.0/x86_64-native-linuxapp-icc/17a519c90c8b4b879a147f2de71c86c4/dpdk/mk/internal/rte.compile-pre.mk:114: recipe for target 'rte_mempool_ops_default.o' failed
make[5]: *** [rte_mempool_ops_default.o] Error 2
  CC rte_fbk_hash.o
  CC rte_cuckoo_hash.o
In file included from /tmp/UBT1804_K4.15.0_ICC19.0.0/x86_64-native-linuxapp-icc/17a519c90c8b4b879a147f2de71c86c4/dpdk/x86_64-native-linuxapp-icc/include/rte_ring.h(436),
                 from /tmp/UBT1804_K4.15.0_ICC19.0.0/x86_64-native-linuxapp-icc/17a519c90c8b4b879a147f2de71c86c4/dpdk/x86_64-native-linuxapp-icc/include/rte_mempool.h(50),
                 from /tmp/UBT1804_K4.15.0_ICC19.0.0/x86_64-native-linuxapp-icc/17a519c90c8b4b879a147f2de71c86c4/dpdk/lib/librte_mempool/rte_mempool_ops.c(9):
/tmp/UBT1804_K4.15.0_ICC19.0.0/x86_64-native-linuxapp-icc/17a519c90c8b4b879a147f2de71c86c4/dpdk/x86_64-native-linuxapp-icc/include/rte_ring_generic.h(511): warning #266: function "rte_atomic128_cmp_exchange" declared implicitly
  			success = rte_atomic128_cmp_exchange(
  			          ^

In file included from /tmp/UBT1804_K4.15.0_ICC19.0.0/x86_64-native-linuxapp-icc/17a519c90c8b4b879a147f2de71c86c4/dpdk/x86_64-native-linuxapp-icc/include/rte_ring.h(436),
                 from /tmp/UBT1804_K4.15.0_ICC19.0.0/x86_64-native-linuxapp-icc/17a519c90c8b4b879a147f2de71c86c4/dpdk/x86_64-native-linuxapp-icc/include/rte_mempool.h(50),
                 from /tmp/UBT1804_K4.15.0_ICC19.0.0/x86_64-native-linuxapp-icc/17a519c90c8b4b879a147f2de71c86c4/dpdk/lib/librte_mempool/rte_mempool_ops.c(9):
/tmp/UBT1804_K4.15.0_ICC19.0.0/x86_64-native-linuxapp-icc/17a519c90c8b4b879a147f2de71c86c4/dpdk/x86_64-native-linuxapp-icc/include/rte_ring_generic.h(512): error: identifier "rte_int128_t" is undefined
  					(rte_int128_t *)ring_ptr,
  					 ^

In file included from /tmp/UBT1804_K4.15.0_ICC19.0.0/x86_64-native-linuxapp-icc/17a519c90c8b4b879a147f2de71c86c4/dpdk/x86_64-native-linuxapp-icc/include/rte_ring.h(436),
                 from /tmp/UBT1804_K4.15.0_ICC19.0.0/x86_64-native-linuxapp-icc/17a519c90c8b4b879a147f2de71c86c4/dpdk/x86_64-native-linuxapp-icc/include/rte_mempool.h(50),
                 from /tmp/UBT1804_K4.15.0_ICC19.0.0/x86_64-native-linuxapp-icc/17a519c90c8b4b879a147f2de71c86c4/dpdk/lib/librte_mempool/rte_mempool_ops.c(9):
/tmp/UBT1804_K4.15.0_ICC19.0.0/x86_64-native-linuxapp-icc/17a519c90c8b4b879a147f2de71c86c4/dpdk/x86_64-native-linuxapp-icc/include/rte_ring_generic.h(512): error: expected an expression
  					(rte_int128_t *)ring_ptr,
  					               ^

In file included from /tmp/UBT1804_K4.15.0_ICC19.0.0/x86_64-native-linuxapp-icc/17a519c90c8b4b879a147f2de71c86c4/dpdk/x86_64-native-linuxapp-icc/include/rte_ring.h(436),
                 from /tmp/UBT1804_K4.15.0_ICC19.0.0/x86_64-native-linuxapp-icc/17a519c90c8b4b879a147f2de71c86c4/dpdk/x86_64-native-linuxapp-icc/include/rte_mempool.h(50),
                 from /tmp/UBT1804_K4.15.0_ICC19.0.0/x86_64-native-linuxapp-icc/17a519c90c8b4b879a147f2de71c86c4/dpdk/lib/librte_mempool/rte_mempool_ops.c(9):
/tmp/UBT1804_K4.15.0_ICC19.0.0/x86_64-native-linuxapp-icc/17a519c90c8b4b879a147f2de71c86c4/dpdk/x86_64-native-linuxapp-icc/include/rte_ring_generic.h(512): error: expected a ")"
  					(rte_int128_t *)ring_ptr,
  					                ^

In file included from /tmp/UBT1804_K4.15.0_ICC19.0.0/x86_64-native-linuxapp-icc/17a519c90c8b4b879a147f2de71c86c4/dpdk/x86_64-native-linuxapp-icc/include/rte_ring.h(436),
                 from /tmp/UBT1804_K4.15.0_ICC19.0.0/x86_64-native-linuxapp-icc/17a519c90c8b4b879a147f2de71c86c4/dpdk/x86_64-native-linuxapp-icc/include/rte_mempool.h(50),
                 from /tmp/UBT1804_K4.15.0_ICC19.0.0/x86_64-native-linuxapp-icc/17a519c90c8b4b879a147f2de71c86c4/dpdk/lib/librte_mempool/rte_mempool_ops.c(9):
/tmp/UBT1804_K4.15.0_ICC19.0.0/x86_64-native-linuxapp-icc/17a519c90c8b4b879a147f2de71c86c4/dpdk/x86_64-native-linuxapp-icc/include/rte_ring_generic.h(516): warning #12: parsing restarts here after previous syntax error
  					__ATOMIC_RELAXED);
  					                ^

compilation aborted for /tmp/UBT1804_K4.15.0_ICC19.0.0/x86_64-native-linuxapp-icc/17a519c90c8b4b879a147f2de71c86c4/dpdk/lib/librte_mempool/rte_mempool_ops.c (code 2)
/tmp/UBT1804_K4.15.0_ICC19.0.0/x86_64-native-linuxapp-icc/17a519c90c8b4b879a147f2de71c86c4/dpdk/mk/internal/rte.compile-pre.mk:114: recipe for target 'rte_mempool_ops.o' failed
make[5]: *** [rte_mempool_ops.o] Error 2
/tmp/UBT1804_K4.15.0_ICC19.0.0/x86_64-native-linuxapp-icc/17a519c90c8b4b879a147f2de71c86c4/dpdk/mk/rte.subdir.mk:35: recipe for target 'librte_mempool' failed
make[4]: *** [librte_mempool] Error 2
make[4]: *** Waiting for unfinished jobs....
  CC power_pstate_cpufreq.o
  AR librte_acl.a
  INSTALL-LIB librte_acl.a
  AR librte_power.a
  INSTALL-LIB librte_power.a
  AR librte_hash.a
  INSTALL-LIB librte_hash.a
/tmp/UBT1804_K4.15.0_ICC19.0.0/x86_64-native-linuxapp-icc/17a519c90c8b4b879a147f2de71c86c4/dpdk/mk/rte.sdkbuild.mk:46: recipe for target 'lib' failed
make[3]: *** [lib] Error 2
/tmp/UBT1804_K4.15.0_ICC19.0.0/x86_64-native-linuxapp-icc/17a519c90c8b4b879a147f2de71c86c4/dpdk/mk/rte.sdkroot.mk:98: recipe for target 'all' failed
make[2]: *** [all] Error 2
/tmp/UBT1804_K4.15.0_ICC19.0.0/x86_64-native-linuxapp-icc/17a519c90c8b4b879a147f2de71c86c4/dpdk/mk/rte.sdkinstall.mk:60: recipe for target 'pre_install' failed
make[1]: *** [pre_install] Error 2
/tmp/UBT1804_K4.15.0_ICC19.0.0/x86_64-native-linuxapp-icc/17a519c90c8b4b879a147f2de71c86c4/dpdk/mk/rte.sdkroot.mk:77: recipe for target 'install' failed
make: *** [install] Error 2

*Failed Build #7:
OS: FC28
Target: x86_64-native-linuxapp-clang
  CC cmdline_parse_etheraddr.o
  SYMLINK-FILE include/rte_thash.h
In file included from /tmp/FC28_K4.16.3_Clang6.0.1/x86_64-native-linuxapp-clang/17a519c90c8b4b879a147f2de71c86c4/dpdk/lib/librte_mempool/rte_mempool.c:34:
In file included from /tmp/FC28_K4.16.3_Clang6.0.1/x86_64-native-linuxapp-clang/17a519c90c8b4b879a147f2de71c86c4/dpdk/lib/librte_mempool/rte_mempool.h:50:
In file included from /tmp/FC28_K4.16.3_Clang6.0.1/x86_64-native-linuxapp-clang/17a519c90c8b4b879a147f2de71c86c4/dpdk/x86_64-native-linuxapp-clang/include/rte_ring.h:436:
/tmp/FC28_K4.16.3_Clang6.0.1/x86_64-native-linuxapp-clang/17a519c90c8b4b879a147f2de71c86c4/dpdk/x86_64-native-linuxapp-clang/include/rte_ring_generic.h:511:14: warning: implicit declaration of function 'rte_atomic128_cmp_exchange' is invalid in C99 [-Wimplicit-function-declaration]
                        success = rte_atomic128_cmp_exchange(
                                  ^
/tmp/FC28_K4.16.3_Clang6.0.1/x86_64-native-linuxapp-clang/17a519c90c8b4b879a147f2de71c86c4/dpdk/x86_64-native-linuxapp-clang/include/rte_ring_generic.h:511:14: warning: this function declaration is not a prototype [-Wstrict-prototypes]
/tmp/FC28_K4.16.3_Clang6.0.1/x86_64-native-linuxapp-clang/17a519c90c8b4b879a147f2de71c86c4/dpdk/x86_64-native-linuxapp-clang/include/rte_ring_generic.h:512:21: error: expected expression
                                        (rte_int128_t *)ring_ptr,
                                                       ^
/tmp/FC28_K4.16.3_Clang6.0.1/x86_64-native-linuxapp-clang/17a519c90c8b4b879a147f2de71c86c4/dpdk/x86_64-native-linuxapp-clang/include/rte_ring_generic.h:512:7: error: use of undeclared identifier 'rte_int128_t'
                                        (rte_int128_t *)ring_ptr,
                                         ^
/tmp/FC28_K4.16.3_Clang6.0.1/x86_64-native-linuxapp-clang/17a519c90c8b4b879a147f2de71c86c4/dpdk/x86_64-native-linuxapp-clang/include/rte_ring_generic.h:513:21: error: expected expression
                                        (rte_int128_t *)&old_value,
                                                       ^
/tmp/FC28_K4.16.3_Clang6.0.1/x86_64-native-linuxapp-clang/17a519c90c8b4b879a147f2de71c86c4/dpdk/x86_64-native-linuxapp-clang/include/rte_ring_generic.h:513:7: error: use of undeclared identifier 'rte_int128_t'
                                        (rte_int128_t *)&old_value,
                                         ^
/tmp/FC28_K4.16.3_Clang6.0.1/x86_64-native-linuxapp-clang/17a519c90c8b4b879a147f2de71c86c4/dpdk/x86_64-native-linuxapp-clang/include/rte_ring_generic.h:514:21: error: expected expression
                                        (rte_int128_t *)&new_value,
                                                       ^
/tmp/FC28_K4.16.3_Clang6.0.1/x86_64-native-linuxapp-clang/17a519c90c8b4b879a147f2de71c86c4/dpdk/x86_64-native-linuxapp-clang/include/rte_ring_generic.h:514:7: error: use of undeclared identifier 'rte_int128_t'
                                        (rte_int128_t *)&new_value,
                                         ^
  SYMLINK-FILE include/rte_fbk_hash.h
  CC power_acpi_cpufreq.o
  CC cmdline_parse_ipaddr.o
In file included from /tmp/FC28_K4.16.3_Clang6.0.1/x86_64-native-linuxapp-clang/17a519c90c8b4b879a147f2de71c86c4/dpdk/lib/librte_mempool/rte_mempool_ops.c:9:
In file included from /tmp/FC28_K4.16.3_Clang6.0.1/x86_64-native-linuxapp-clang/17a519c90c8b4b879a147f2de71c86c4/dpdk/x86_64-native-linuxapp-clang/include/rte_mempool.h:50:
In file included from /tmp/FC28_K4.16.3_Clang6.0.1/x86_64-native-linuxapp-clang/17a519c90c8b4b879a147f2de71c86c4/dpdk/x86_64-native-linuxapp-clang/include/rte_ring.h:436:
/tmp/FC28_K4.16.3_Clang6.0.1/x86_64-native-linuxapp-clang/17a519c90c8b4b879a147f2de71c86c4/dpdk/x86_64-native-linuxapp-clang/include/rte_ring_generic.h:511:14: warning: implicit declaration of function 'rte_atomic128_cmp_exchange' is invalid in C99 [-Wimplicit-function-declaration]
                        success = rte_atomic128_cmp_exchange(
                                  ^
/tmp/FC28_K4.16.3_Clang6.0.1/x86_64-native-linuxapp-clang/17a519c90c8b4b879a147f2de71c86c4/dpdk/x86_64-native-linuxapp-clang/include/rte_ring_generic.h:511:14: warning: this function declaration is not a prototype [-Wstrict-prototypes]
/tmp/FC28_K4.16.3_Clang6.0.1/x86_64-native-linuxapp-clang/17a519c90c8b4b879a147f2de71c86c4/dpdk/x86_64-native-linuxapp-clang/include/rte_ring_generic.h:512:21: error: expected expression
                                        (rte_int128_t *)ring_ptr,
                                                       ^
/tmp/FC28_K4.16.3_Clang6.0.1/x86_64-native-linuxapp-clang/17a519c90c8b4b879a147f2de71c86c4/dpdk/x86_64-native-linuxapp-clang/include/rte_ring_generic.h:512:7: error: use of undeclared identifier 'rte_int128_t'
                                        (rte_int128_t *)ring_ptr,
                                         ^
/tmp/FC28_K4.16.3_Clang6.0.1/x86_64-native-linuxapp-clang/17a519c90c8b4b879a147f2de71c86c4/dpdk/x86_64-native-linuxapp-clang/include/rte_ring_generic.h:513:21: error: expected expression
                                        (rte_int128_t *)&old_value,
                                                       ^
/tmp/FC28_K4.16.3_Clang6.0.1/x86_64-native-linuxapp-clang/17a519c90c8b4b879a147f2de71c86c4/dpdk/x86_64-native-linuxapp-clang/include/rte_ring_generic.h:513:7: error: use of undeclared identifier 'rte_int128_t'
                                        (rte_int128_t *)&old_value,
                                         ^
/tmp/FC28_K4.16.3_Clang6.0.1/x86_64-native-linuxapp-clang/17a519c90c8b4b879a147f2de71c86c4/dpdk/x86_64-native-linuxapp-clang/include/rte_ring_generic.h:514:21: error: expected expression
                                        (rte_int128_t *)&new_value,
                                                       ^
/tmp/FC28_K4.16.3_Clang6.0.1/x86_64-native-linuxapp-clang/17a519c90c8b4b879a147f2de71c86c4/dpdk/x86_64-native-linuxapp-clang/include/rte_ring_generic.h:514:7: error: use of undeclared identifier 'rte_int128_t'
                                        (rte_int128_t *)&new_value,
                                         ^
  CC cmdline_parse_num.o
  CC rte_mempool_ops_default.o
2 warnings and 6 errors generated.
make[5]: *** [/tmp/FC28_K4.16.3_Clang6.0.1/x86_64-native-linuxapp-clang/17a519c90c8b4b879a147f2de71c86c4/dpdk/mk/internal/rte.compile-pre.mk:116: rte_mempool.o] Error 1
make[5]: *** Waiting for unfinished jobs....
  CC rte_cuckoo_hash.o
  CC rte_fbk_hash.o
  CC cmdline_parse_string.o
  CC cmdline_rdline.o
  CC power_kvm_vm.o
In file included from /tmp/FC28_K4.16.3_Clang6.0.1/x86_64-native-linuxapp-clang/17a519c90c8b4b879a147f2de71c86c4/dpdk/lib/librte_mempool/rte_mempool_ops_default.c:7:
In file included from /tmp/FC28_K4.16.3_Clang6.0.1/x86_64-native-linuxapp-clang/17a519c90c8b4b879a147f2de71c86c4/dpdk/x86_64-native-linuxapp-clang/include/rte_mempool.h:50:
In file included from /tmp/FC28_K4.16.3_Clang6.0.1/x86_64-native-linuxapp-clang/17a519c90c8b4b879a147f2de71c86c4/dpdk/x86_64-native-linuxapp-clang/include/rte_ring.h:436:
/tmp/FC28_K4.16.3_Clang6.0.1/x86_64-native-linuxapp-clang/17a519c90c8b4b879a147f2de71c86c4/dpdk/x86_64-native-linuxapp-clang/include/rte_ring_generic.h:511:14: warning: implicit declaration of function 'rte_atomic128_cmp_exchange' is invalid in C99 [-Wimplicit-function-declaration]
                        success = rte_atomic128_cmp_exchange(
                                  ^
/tmp/FC28_K4.16.3_Clang6.0.1/x86_64-native-linuxapp-clang/17a519c90c8b4b879a147f2de71c86c4/dpdk/x86_64-native-linuxapp-clang/include/rte_ring_generic.h:511:14: warning: this function declaration is not a prototype [-Wstrict-prototypes]
/tmp/FC28_K4.16.3_Clang6.0.1/x86_64-native-linuxapp-clang/17a519c90c8b4b879a147f2de71c86c4/dpdk/x86_64-native-linuxapp-clang/include/rte_ring_generic.h:512:21: error: expected expression
                                        (rte_int128_t *)ring_ptr,
                                                       ^
/tmp/FC28_K4.16.3_Clang6.0.1/x86_64-native-linuxapp-clang/17a519c90c8b4b879a147f2de71c86c4/dpdk/x86_64-native-linuxapp-clang/include/rte_ring_generic.h:512:7: error: use of undeclared identifier 'rte_int128_t'
                                        (rte_int128_t *)ring_ptr,
                                         ^
/tmp/FC28_K4.16.3_Clang6.0.1/x86_64-native-linuxapp-clang/17a519c90c8b4b879a147f2de71c86c4/dpdk/x86_64-native-linuxapp-clang/include/rte_ring_generic.h:513:21: error: expected expression
                                        (rte_int128_t *)&old_value,
                                                       ^
/tmp/FC28_K4.16.3_Clang6.0.1/x86_64-native-linuxapp-clang/17a519c90c8b4b879a147f2de71c86c4/dpdk/x86_64-native-linuxapp-clang/include/rte_ring_generic.h:513:7: error: use of undeclared identifier 'rte_int128_t'
                                        (rte_int128_t *)&old_value,
                                         ^
/tmp/FC28_K4.16.3_Clang6.0.1/x86_64-native-linuxapp-clang/17a519c90c8b4b879a147f2de71c86c4/dpdk/x86_64-native-linuxapp-clang/include/rte_ring_generic.h:514:21: error: expected expression
                                        (rte_int128_t *)&new_value,
                                                       ^
/tmp/FC28_K4.16.3_Clang6.0.1/x86_64-native-linuxapp-clang/17a519c90c8b4b879a147f2de71c86c4/dpdk/x86_64-native-linuxapp-clang/include/rte_ring_generic.h:514:7: error: use of undeclared identifier 'rte_int128_t'
                                        (rte_int128_t *)&new_value,
                                         ^
  CC cmdline_vt100.o
2 warnings and 6 errors generated.
make[5]: *** [/tmp/FC28_K4.16.3_Clang6.0.1/x86_64-native-linuxapp-clang/17a519c90c8b4b879a147f2de71c86c4/dpdk/mk/internal/rte.compile-pre.mk:116: rte_mempool_ops.o] Error 1
  CC cmdline_socket.o
  CC cmdline_parse_portlist.o
  CC guest_channel.o
  CC rte_power_empty_poll.o
  AR librte_acl.a
  CC power_pstate_cpufreq.o
  INSTALL-LIB librte_acl.a
2 warnings and 6 errors generated.
make[5]: *** [/tmp/FC28_K4.16.3_Clang6.0.1/x86_64-native-linuxapp-clang/17a519c90c8b4b879a147f2de71c86c4/dpdk/mk/internal/rte.compile-pre.mk:116: rte_mempool_ops_default.o] Error 1
make[4]: *** [/tmp/FC28_K4.16.3_Clang6.0.1/x86_64-native-linuxapp-clang/17a519c90c8b4b879a147f2de71c86c4/dpdk/mk/rte.subdir.mk:35: librte_mempool] Error 2
make[4]: *** Waiting for unfinished jobs....
  AR librte_cmdline.a
  INSTALL-LIB librte_cmdline.a

*Failed Build #8:
OS: FC28
Target: x86_64-native-linuxapp-gcc
  CC rte_mempool_ops_default.o
In file included from /tmp/FC28_K4.16.3_GCC8.0.1/x86_64-native-linuxapp-gcc/17a519c90c8b4b879a147f2de71c86c4/dpdk/x86_64-native-linuxapp-gcc/include/rte_ring.h:436,
                 from /tmp/FC28_K4.16.3_GCC8.0.1/x86_64-native-linuxapp-gcc/17a519c90c8b4b879a147f2de71c86c4/dpdk/lib/librte_mempool/rte_mempool.h:50,
                 from /tmp/FC28_K4.16.3_GCC8.0.1/x86_64-native-linuxapp-gcc/17a519c90c8b4b879a147f2de71c86c4/dpdk/lib/librte_mempool/rte_mempool.c:34:
/tmp/FC28_K4.16.3_GCC8.0.1/x86_64-native-linuxapp-gcc/17a519c90c8b4b879a147f2de71c86c4/dpdk/x86_64-native-linuxapp-gcc/include/rte_ring_generic.h: In function ‘__rte_ring_do_lf_enqueue_mp’:
/tmp/FC28_K4.16.3_GCC8.0.1/x86_64-native-linuxapp-gcc/17a519c90c8b4b879a147f2de71c86c4/dpdk/x86_64-native-linuxapp-gcc/include/rte_ring_generic.h:511:14: warning: implicit declaration of function ‘rte_atomic128_cmp_exchange’; did you mean ‘rte_atomic32_exchange’? [-Wimplicit-function-declaration]
    success = rte_atomic128_cmp_exchange(
              ^~~~~~~~~~~~~~~~~~~~~~~~~~
              rte_atomic32_exchange
/tmp/FC28_K4.16.3_GCC8.0.1/x86_64-native-linuxapp-gcc/17a519c90c8b4b879a147f2de71c86c4/dpdk/x86_64-native-linuxapp-gcc/include/rte_ring_generic.h:511:14: warning: nested extern declaration of ‘rte_atomic128_cmp_exchange’ [-Wnested-externs]
  SYMLINK-FILE include/rte_fbk_hash.h
/tmp/FC28_K4.16.3_GCC8.0.1/x86_64-native-linuxapp-gcc/17a519c90c8b4b879a147f2de71c86c4/dpdk/x86_64-native-linuxapp-gcc/include/rte_ring_generic.h:512:7: error: ‘rte_int128_t’ undeclared (first use in this function); did you mean ‘rte_iova_t’?
      (rte_int128_t *)ring_ptr,
       ^~~~~~~~~~~~
       rte_iova_t
/tmp/FC28_K4.16.3_GCC8.0.1/x86_64-native-linuxapp-gcc/17a519c90c8b4b879a147f2de71c86c4/dpdk/x86_64-native-linuxapp-gcc/include/rte_ring_generic.h:512:7: note: each undeclared identifier is reported only once for each function it appears in
/tmp/FC28_K4.16.3_GCC8.0.1/x86_64-native-linuxapp-gcc/17a519c90c8b4b879a147f2de71c86c4/dpdk/x86_64-native-linuxapp-gcc/include/rte_ring_generic.h:512:21: error: expected expression before ‘)’ token
      (rte_int128_t *)ring_ptr,
                     ^
/tmp/FC28_K4.16.3_GCC8.0.1/x86_64-native-linuxapp-gcc/17a519c90c8b4b879a147f2de71c86c4/dpdk/x86_64-native-linuxapp-gcc/include/rte_ring_generic.h:473:40: warning: variable ‘new_value’ set but not used [-Wunused-but-set-variable]
    struct rte_ring_lf_entry old_value, new_value;
                                        ^~~~~~~~~
In file included from /tmp/FC28_K4.16.3_GCC8.0.1/x86_64-native-linuxapp-gcc/17a519c90c8b4b879a147f2de71c86c4/dpdk/x86_64-native-linuxapp-gcc/include/rte_ring.h:436,
                 from /tmp/FC28_K4.16.3_GCC8.0.1/x86_64-native-linuxapp-gcc/17a519c90c8b4b879a147f2de71c86c4/dpdk/x86_64-native-linuxapp-gcc/include/rte_mempool.h:50,
                 from /tmp/FC28_K4.16.3_GCC8.0.1/x86_64-native-linuxapp-gcc/17a519c90c8b4b879a147f2de71c86c4/dpdk/lib/librte_mempool/rte_mempool_ops.c:9:
/tmp/FC28_K4.16.3_GCC8.0.1/x86_64-native-linuxapp-gcc/17a519c90c8b4b879a147f2de71c86c4/dpdk/x86_64-native-linuxapp-gcc/include/rte_ring_generic.h: In function ‘__rte_ring_do_lf_enqueue_mp’:
  CC rte_cuckoo_hash.o
/tmp/FC28_K4.16.3_GCC8.0.1/x86_64-native-linuxapp-gcc/17a519c90c8b4b879a147f2de71c86c4/dpdk/x86_64-native-linuxapp-gcc/include/rte_ring_generic.h:511:14: warning: implicit declaration of function ‘rte_atomic128_cmp_exchange’; did you mean ‘rte_atomic32_exchange’? [-Wimplicit-function-declaration]
    success = rte_atomic128_cmp_exchange(
              ^~~~~~~~~~~~~~~~~~~~~~~~~~
              rte_atomic32_exchange
/tmp/FC28_K4.16.3_GCC8.0.1/x86_64-native-linuxapp-gcc/17a519c90c8b4b879a147f2de71c86c4/dpdk/x86_64-native-linuxapp-gcc/include/rte_ring_generic.h:511:14: warning: nested extern declaration of ‘rte_atomic128_cmp_exchange’ [-Wnested-externs]
  SYMLINK-FILE include/rte_power.h
/tmp/FC28_K4.16.3_GCC8.0.1/x86_64-native-linuxapp-gcc/17a519c90c8b4b879a147f2de71c86c4/dpdk/x86_64-native-linuxapp-gcc/include/rte_ring_generic.h:512:7: error: ‘rte_int128_t’ undeclared (first use in this function); did you mean ‘rte_iova_t’?
      (rte_int128_t *)ring_ptr,
       ^~~~~~~~~~~~
       rte_iova_t
In file included from /tmp/FC28_K4.16.3_GCC8.0.1/x86_64-native-linuxapp-gcc/17a519c90c8b4b879a147f2de71c86c4/dpdk/x86_64-native-linuxapp-gcc/include/rte_ring.h:436,
                 from /tmp/FC28_K4.16.3_GCC8.0.1/x86_64-native-linuxapp-gcc/17a519c90c8b4b879a147f2de71c86c4/dpdk/x86_64-native-linuxapp-gcc/include/rte_mempool.h:50,
                 from /tmp/FC28_K4.16.3_GCC8.0.1/x86_64-native-linuxapp-gcc/17a519c90c8b4b879a147f2de71c86c4/dpdk/lib/librte_mempool/rte_mempool_ops_default.c:7:
/tmp/FC28_K4.16.3_GCC8.0.1/x86_64-native-linuxapp-gcc/17a519c90c8b4b879a147f2de71c86c4/dpdk/x86_64-native-linuxapp-gcc/include/rte_ring_generic.h: In function ‘__rte_ring_do_lf_enqueue_mp’:
/tmp/FC28_K4.16.3_GCC8.0.1/x86_64-native-linuxapp-gcc/17a519c90c8b4b879a147f2de71c86c4/dpdk/x86_64-native-linuxapp-gcc/include/rte_ring_generic.h:512:7: note: each undeclared identifier is reported only once for each function it appears in
/tmp/FC28_K4.16.3_GCC8.0.1/x86_64-native-linuxapp-gcc/17a519c90c8b4b879a147f2de71c86c4/dpdk/x86_64-native-linuxapp-gcc/include/rte_ring_generic.h:512:21: error: expected expression before ‘)’ token
      (rte_int128_t *)ring_ptr,
                     ^
/tmp/FC28_K4.16.3_GCC8.0.1/x86_64-native-linuxapp-gcc/17a519c90c8b4b879a147f2de71c86c4/dpdk/x86_64-native-linuxapp-gcc/include/rte_ring_generic.h:473:40: warning: variable ‘new_value’ set but not used [-Wunused-but-set-variable]
    struct rte_ring_lf_entry old_value, new_value;
                                        ^~~~~~~~~
/tmp/FC28_K4.16.3_GCC8.0.1/x86_64-native-linuxapp-gcc/17a519c90c8b4b879a147f2de71c86c4/dpdk/x86_64-native-linuxapp-gcc/include/rte_ring_generic.h:511:14: warning: implicit declaration of function ‘rte_atomic128_cmp_exchange’; did you mean ‘rte_atomic32_exchange’? [-Wimplicit-function-declaration]
    success = rte_atomic128_cmp_exchange(
              ^~~~~~~~~~~~~~~~~~~~~~~~~~
              rte_atomic32_exchange
/tmp/FC28_K4.16.3_GCC8.0.1/x86_64-native-linuxapp-gcc/17a519c90c8b4b879a147f2de71c86c4/dpdk/x86_64-native-linuxapp-gcc/include/rte_ring_generic.h:511:14: warning: nested extern declaration of ‘rte_atomic128_cmp_exchange’ [-Wnested-externs]
/tmp/FC28_K4.16.3_GCC8.0.1/x86_64-native-linuxapp-gcc/17a519c90c8b4b879a147f2de71c86c4/dpdk/x86_64-native-linuxapp-gcc/include/rte_ring_generic.h:512:7: error: ‘rte_int128_t’ undeclared (first use in this function); did you mean ‘rte_iova_t’?
      (rte_int128_t *)ring_ptr,
       ^~~~~~~~~~~~
       rte_iova_t
/tmp/FC28_K4.16.3_GCC8.0.1/x86_64-native-linuxapp-gcc/17a519c90c8b4b879a147f2de71c86c4/dpdk/x86_64-native-linuxapp-gcc/include/rte_ring_generic.h:512:7: note: each undeclared identifier is reported only once for each function it appears in
/tmp/FC28_K4.16.3_GCC8.0.1/x86_64-native-linuxapp-gcc/17a519c90c8b4b879a147f2de71c86c4/dpdk/x86_64-native-linuxapp-gcc/include/rte_ring_generic.h:512:21: error: expected expression before ‘)’ token
      (rte_int128_t *)ring_ptr,
                     ^
/tmp/FC28_K4.16.3_GCC8.0.1/x86_64-native-linuxapp-gcc/17a519c90c8b4b879a147f2de71c86c4/dpdk/x86_64-native-linuxapp-gcc/include/rte_ring_generic.h:473:40: warning: variable ‘new_value’ set but not used [-Wunused-but-set-variable]
    struct rte_ring_lf_entry old_value, new_value;
                                        ^~~~~~~~~
  CC rte_fbk_hash.o
  SYMLINK-FILE include/rte_power_empty_poll.h
make[5]: *** [/tmp/FC28_K4.16.3_GCC8.0.1/x86_64-native-linuxapp-gcc/17a519c90c8b4b879a147f2de71c86c4/dpdk/mk/internal/rte.compile-pre.mk:116: rte_mempool.o] Error 1

*Failed Build #9:
OS: RHEL75
Target: x86_64-native-linuxapp-gcc
  CC rte_fbk_hash.o
In file included from /tmp/RHEL75_K3.10.0_GCC4.8.5/x86_64-native-linuxapp-gcc/17a519c90c8b4b879a147f2de71c86c4/dpdk/x86_64-native-linuxapp-gcc/include/rte_ring.h:436:0,
                 from /tmp/RHEL75_K3.10.0_GCC4.8.5/x86_64-native-linuxapp-gcc/17a519c90c8b4b879a147f2de71c86c4/dpdk/lib/librte_mempool/rte_mempool.h:50,
                 from /tmp/RHEL75_K3.10.0_GCC4.8.5/x86_64-native-linuxapp-gcc/17a519c90c8b4b879a147f2de71c86c4/dpdk/lib/librte_mempool/rte_mempool.c:34:
/tmp/RHEL75_K3.10.0_GCC4.8.5/x86_64-native-linuxapp-gcc/17a519c90c8b4b879a147f2de71c86c4/dpdk/x86_64-native-linuxapp-gcc/include/rte_ring_generic.h: In function ‘__rte_ring_do_lf_enqueue_mp’:
/tmp/RHEL75_K3.10.0_GCC4.8.5/x86_64-native-linuxapp-gcc/17a519c90c8b4b879a147f2de71c86c4/dpdk/x86_64-native-linuxapp-gcc/include/rte_ring_generic.h:511:4: warning: implicit declaration of function ‘rte_atomic128_cmp_exchange’ [-Wimplicit-function-declaration]
    success = rte_atomic128_cmp_exchange(
    ^
/tmp/RHEL75_K3.10.0_GCC4.8.5/x86_64-native-linuxapp-gcc/17a519c90c8b4b879a147f2de71c86c4/dpdk/x86_64-native-linuxapp-gcc/include/rte_ring_generic.h:511:4: warning: nested extern declaration of ‘rte_atomic128_cmp_exchange’ [-Wnested-externs]
/tmp/RHEL75_K3.10.0_GCC4.8.5/x86_64-native-linuxapp-gcc/17a519c90c8b4b879a147f2de71c86c4/dpdk/x86_64-native-linuxapp-gcc/include/rte_ring_generic.h:512:7: error: ‘rte_int128_t’ undeclared (first use in this function)
      (rte_int128_t *)ring_ptr,
       ^
/tmp/RHEL75_K3.10.0_GCC4.8.5/x86_64-native-linuxapp-gcc/17a519c90c8b4b879a147f2de71c86c4/dpdk/x86_64-native-linuxapp-gcc/include/rte_ring_generic.h:512:7: note: each undeclared identifier is reported only once for each function it appears in
/tmp/RHEL75_K3.10.0_GCC4.8.5/x86_64-native-linuxapp-gcc/17a519c90c8b4b879a147f2de71c86c4/dpdk/x86_64-native-linuxapp-gcc/include/rte_ring_generic.h:512:21: error: expected expression before ‘)’ token
      (rte_int128_t *)ring_ptr,
                     ^
/tmp/RHEL75_K3.10.0_GCC4.8.5/x86_64-native-linuxapp-gcc/17a519c90c8b4b879a147f2de71c86c4/dpdk/x86_64-native-linuxapp-gcc/include/rte_ring_generic.h:473:40: warning: variable ‘new_value’ set but not used [-Wunused-but-set-variable]
    struct rte_ring_lf_entry old_value, new_value;
                                        ^
  CC rte_mempool_ops.o
  AR librte_acl.a
  INSTALL-LIB librte_acl.a
--
  CC guest_channel.o
In file included from /tmp/RHEL75_K3.10.0_GCC4.8.5/x86_64-native-linuxapp-gcc/17a519c90c8b4b879a147f2de71c86c4/dpdk/x86_64-native-linuxapp-gcc/include/rte_ring.h:436:0,
                 from /tmp/RHEL75_K3.10.0_GCC4.8.5/x86_64-native-linuxapp-gcc/17a519c90c8b4b879a147f2de71c86c4/dpdk/x86_64-native-linuxapp-gcc/include/rte_mempool.h:50,
                 from /tmp/RHEL75_K3.10.0_GCC4.8.5/x86_64-native-linuxapp-gcc/17a519c90c8b4b879a147f2de71c86c4/dpdk/lib/librte_mempool/rte_mempool_ops.c:9:
/tmp/RHEL75_K3.10.0_GCC4.8.5/x86_64-native-linuxapp-gcc/17a519c90c8b4b879a147f2de71c86c4/dpdk/x86_64-native-linuxapp-gcc/include/rte_ring_generic.h: In function ‘__rte_ring_do_lf_enqueue_mp’:
/tmp/RHEL75_K3.10.0_GCC4.8.5/x86_64-native-linuxapp-gcc/17a519c90c8b4b879a147f2de71c86c4/dpdk/x86_64-native-linuxapp-gcc/include/rte_ring_generic.h:511:4: warning: implicit declaration of function ‘rte_atomic128_cmp_exchange’ [-Wimplicit-function-declaration]
    success = rte_atomic128_cmp_exchange(
    ^
/tmp/RHEL75_K3.10.0_GCC4.8.5/x86_64-native-linuxapp-gcc/17a519c90c8b4b879a147f2de71c86c4/dpdk/x86_64-native-linuxapp-gcc/include/rte_ring_generic.h:511:4: warning: nested extern declaration of ‘rte_atomic128_cmp_exchange’ [-Wnested-externs]
/tmp/RHEL75_K3.10.0_GCC4.8.5/x86_64-native-linuxapp-gcc/17a519c90c8b4b879a147f2de71c86c4/dpdk/x86_64-native-linuxapp-gcc/include/rte_ring_generic.h:512:7: error: ‘rte_int128_t’ undeclared (first use in this function)
      (rte_int128_t *)ring_ptr,
       ^
/tmp/RHEL75_K3.10.0_GCC4.8.5/x86_64-native-linuxapp-gcc/17a519c90c8b4b879a147f2de71c86c4/dpdk/x86_64-native-linuxapp-gcc/include/rte_ring_generic.h:512:7: note: each undeclared identifier is reported only once for each function it appears in
/tmp/RHEL75_K3.10.0_GCC4.8.5/x86_64-native-linuxapp-gcc/17a519c90c8b4b879a147f2de71c86c4/dpdk/x86_64-native-linuxapp-gcc/include/rte_ring_generic.h:512:21: error: expected expression before ‘)’ token
      (rte_int128_t *)ring_ptr,
                     ^
/tmp/RHEL75_K3.10.0_GCC4.8.5/x86_64-native-linuxapp-gcc/17a519c90c8b4b879a147f2de71c86c4/dpdk/x86_64-native-linuxapp-gcc/include/rte_ring_generic.h:473:40: warning: variable ‘new_value’ set but not used [-Wunused-but-set-variable]
    struct rte_ring_lf_entry old_value, new_value;
                                        ^
  CC cmdline_socket.o
make[5]: *** [rte_mempool_ops.o] Error 1
make[4]: *** [librte_mempool] Error 2

*Failed Build #10:
OS: SUSE15
Target: x86_64-native-linuxapp-gcc
  AR librte_ring.a
  AR librte_timer.a
  INSTALL-LIB librte_ring.a
  CC cmdline_parse_etheraddr.o
  INSTALL-LIB librte_timer.a
make[5]: warning:  Clock skew detected.  Your build may be incomplete.
  CC acl_run_scalar.o
== Build lib/librte_mempool
== Build lib/librte_hash
  CC acl_run_sse.o
  CC cmdline_parse_ipaddr.o
--
  SYMLINK-FILE include/rte_hash_crc.h
In file included from /tmp/SUSE15_K4.12.14_GCC7.3.1/x86_64-native-linuxapp-gcc/17a519c90c8b4b879a147f2de71c86c4/dpdk/x86_64-native-linuxapp-gcc/include/rte_ring.h:436:0,
                 from /tmp/SUSE15_K4.12.14_GCC7.3.1/x86_64-native-linuxapp-gcc/17a519c90c8b4b879a147f2de71c86c4/dpdk/lib/librte_mempool/rte_mempool.h:50,
                 from /tmp/SUSE15_K4.12.14_GCC7.3.1/x86_64-native-linuxapp-gcc/17a519c90c8b4b879a147f2de71c86c4/dpdk/lib/librte_mempool/rte_mempool.c:34:
/tmp/SUSE15_K4.12.14_GCC7.3.1/x86_64-native-linuxapp-gcc/17a519c90c8b4b879a147f2de71c86c4/dpdk/x86_64-native-linuxapp-gcc/include/rte_ring_generic.h: In function ‘__rte_ring_do_lf_enqueue_mp’:
/tmp/SUSE15_K4.12.14_GCC7.3.1/x86_64-native-linuxapp-gcc/17a519c90c8b4b879a147f2de71c86c4/dpdk/x86_64-native-linuxapp-gcc/include/rte_ring_generic.h:511:14: warning: implicit declaration of function ‘rte_atomic128_cmp_exchange’; did you mean ‘rte_atomic32_exchange’? [-Wimplicit-function-declaration]
    success = rte_atomic128_cmp_exchange(
              ^~~~~~~~~~~~~~~~~~~~~~~~~~
              rte_atomic32_exchange
/tmp/SUSE15_K4.12.14_GCC7.3.1/x86_64-native-linuxapp-gcc/17a519c90c8b4b879a147f2de71c86c4/dpdk/x86_64-native-linuxapp-gcc/include/rte_ring_generic.h:511:14: warning: nested extern declaration of ‘rte_atomic128_cmp_exchange’ [-Wnested-externs]
/tmp/SUSE15_K4.12.14_GCC7.3.1/x86_64-native-linuxapp-gcc/17a519c90c8b4b879a147f2de71c86c4/dpdk/x86_64-native-linuxapp-gcc/include/rte_ring_generic.h:512:7: error: ‘rte_int128_t’ undeclared (first use in this function); did you mean ‘__int128_t’?
      (rte_int128_t *)ring_ptr,
       ^~~~~~~~~~~~
       __int128_t
/tmp/SUSE15_K4.12.14_GCC7.3.1/x86_64-native-linuxapp-gcc/17a519c90c8b4b879a147f2de71c86c4/dpdk/x86_64-native-linuxapp-gcc/include/rte_ring_generic.h:512:7: note: each undeclared identifier is reported only once for each function it appears in
/tmp/SUSE15_K4.12.14_GCC7.3.1/x86_64-native-linuxapp-gcc/17a519c90c8b4b879a147f2de71c86c4/dpdk/x86_64-native-linuxapp-gcc/include/rte_ring_generic.h:512:21: error: expected expression before ‘)’ token
      (rte_int128_t *)ring_ptr,
                     ^
/tmp/SUSE15_K4.12.14_GCC7.3.1/x86_64-native-linuxapp-gcc/17a519c90c8b4b879a147f2de71c86c4/dpdk/x86_64-native-linuxapp-gcc/include/rte_ring_generic.h:473:40: warning: variable ‘new_value’ set but not used [-Wunused-but-set-variable]
    struct rte_ring_lf_entry old_value, new_value;
                                        ^~~~~~~~~
In file included from /tmp/SUSE15_K4.12.14_GCC7.3.1/x86_64-native-linuxapp-gcc/17a519c90c8b4b879a147f2de71c86c4/dpdk/x86_64-native-linuxapp-gcc/include/rte_ring.h:436:0,
                 from /tmp/SUSE15_K4.12.14_GCC7.3.1/x86_64-native-linuxapp-gcc/17a519c90c8b4b879a147f2de71c86c4/dpdk/x86_64-native-linuxapp-gcc/include/rte_mempool.h:50,
                 from /tmp/SUSE15_K4.12.14_GCC7.3.1/x86_64-native-linuxapp-gcc/17a519c90c8b4b879a147f2de71c86c4/dpdk/lib/librte_mempool/rte_mempool_ops.c:9:
/tmp/SUSE15_K4.12.14_GCC7.3.1/x86_64-native-linuxapp-gcc/17a519c90c8b4b879a147f2de71c86c4/dpdk/x86_64-native-linuxapp-gcc/include/rte_ring_generic.h: In function ‘__rte_ring_do_lf_enqueue_mp’:
/tmp/SUSE15_K4.12.14_GCC7.3.1/x86_64-native-linuxapp-gcc/17a519c90c8b4b879a147f2de71c86c4/dpdk/x86_64-native-linuxapp-gcc/include/rte_ring_generic.h:511:14: warning: implicit declaration of function ‘rte_atomic128_cmp_exchange’; did you mean ‘rte_atomic32_exchange’? [-Wimplicit-function-declaration]
    success = rte_atomic128_cmp_exchange(
              ^~~~~~~~~~~~~~~~~~~~~~~~~~
              rte_atomic32_exchange
/tmp/SUSE15_K4.12.14_GCC7.3.1/x86_64-native-linuxapp-gcc/17a519c90c8b4b879a147f2de71c86c4/dpdk/x86_64-native-linuxapp-gcc/include/rte_ring_generic.h:511:14: warning: nested extern declaration of ‘rte_atomic128_cmp_exchange’ [-Wnested-externs]
/tmp/SUSE15_K4.12.14_GCC7.3.1/x86_64-native-linuxapp-gcc/17a519c90c8b4b879a147f2de71c86c4/dpdk/x86_64-native-linuxapp-gcc/include/rte_ring_generic.h:512:7: error: ‘rte_int128_t’ undeclared (first use in this function); did you mean ‘__int128_t’?
      (rte_int128_t *)ring_ptr,
       ^~~~~~~~~~~~
       __int128_t
/tmp/SUSE15_K4.12.14_GCC7.3.1/x86_64-native-linuxapp-gcc/17a519c90c8b4b879a147f2de71c86c4/dpdk/x86_64-native-linuxapp-gcc/include/rte_ring_generic.h:512:7: note: each undeclared identifier is reported only once for each function it appears in
/tmp/SUSE15_K4.12.14_GCC7.3.1/x86_64-native-linuxapp-gcc/17a519c90c8b4b879a147f2de71c86c4/dpdk/x86_64-native-linuxapp-gcc/include/rte_ring_generic.h:512:21: error: expected expression before ‘)’ token
      (rte_int128_t *)ring_ptr,
                     ^
/tmp/SUSE15_K4.12.14_GCC7.3.1/x86_64-native-linuxapp-gcc/17a519c90c8b4b879a147f2de71c86c4/dpdk/x86_64-native-linuxapp-gcc/include/rte_ring_generic.h:473:40: warning: variable ‘new_value’ set but not used [-Wunused-but-set-variable]
    struct rte_ring_lf_entry old_value, new_value;
                                        ^~~~~~~~~
  SYMLINK-FILE include/rte_jhash.h
  SYMLINK-FILE include/rte_thash.h
In file included from /tmp/SUSE15_K4.12.14_GCC7.3.1/x86_64-native-linuxapp-gcc/17a519c90c8b4b879a147f2de71c86c4/dpdk/x86_64-native-linuxapp-gcc/include/rte_ring.h:436:0,
                 from /tmp/SUSE15_K4.12.14_GCC7.3.1/x86_64-native-linuxapp-gcc/17a519c90c8b4b879a147f2de71c86c4/dpdk/x86_64-native-linuxapp-gcc/include/rte_mempool.h:50,
                 from /tmp/SUSE15_K4.12.14_GCC7.3.1/x86_64-native-linuxapp-gcc/17a519c90c8b4b879a147f2de71c86c4/dpdk/lib/librte_mempool/rte_mempool_ops_default.c:7:
/tmp/SUSE15_K4.12.14_GCC7.3.1/x86_64-native-linuxapp-gcc/17a519c90c8b4b879a147f2de71c86c4/dpdk/x86_64-native-linuxapp-gcc/include/rte_ring_generic.h: In function ‘__rte_ring_do_lf_enqueue_mp’:
/tmp/SUSE15_K4.12.14_GCC7.3.1/x86_64-native-linuxapp-gcc/17a519c90c8b4b879a147f2de71c86c4/dpdk/x86_64-native-linuxapp-gcc/include/rte_ring_generic.h:511:14: warning: implicit declaration of function ‘rte_atomic128_cmp_exchange’; did you mean ‘rte_atomic32_exchange’? [-Wimplicit-function-declaration]
    success = rte_atomic128_cmp_exchange(
              ^~~~~~~~~~~~~~~~~~~~~~~~~~
              rte_atomic32_exchange
/tmp/SUSE15_K4.12.14_GCC7.3.1/x86_64-native-linuxapp-gcc/17a519c90c8b4b879a147f2de71c86c4/dpdk/x86_64-native-linuxapp-gcc/include/rte_ring_generic.h:511:14: warning: nested extern declaration of ‘rte_atomic128_cmp_exchange’ [-Wnested-externs]
/tmp/SUSE15_K4.12.14_GCC7.3.1/x86_64-native-linuxapp-gcc/17a519c90c8b4b879a147f2de71c86c4/dpdk/x86_64-native-linuxapp-gcc/include/rte_ring_generic.h:512:7: error: ‘rte_int128_t’ undeclared (first use in this function); did you mean ‘__int128_t’?
      (rte_int128_t *)ring_ptr,
       ^~~~~~~~~~~~
       __int128_t
/tmp/SUSE15_K4.12.14_GCC7.3.1/x86_64-native-linuxapp-gcc/17a519c90c8b4b879a147f2de71c86c4/dpdk/x86_64-native-linuxapp-gcc/include/rte_ring_generic.h:512:7: note: each undeclared identifier is reported only once for each function it appears in
/tmp/SUSE15_K4.12.14_GCC7.3.1/x86_64-native-linuxapp-gcc/17a519c90c8b4b879a147f2de71c86c4/dpdk/x86_64-native-linuxapp-gcc/include/rte_ring_generic.h:512:21: error: expected expression before ‘)’ token
      (rte_int128_t *)ring_ptr,
                     ^
/tmp/SUSE15_K4.12.14_GCC7.3.1/x86_64-native-linuxapp-gcc/17a519c90c8b4b879a147f2de71c86c4/dpdk/x86_64-native-linuxapp-gcc/include/rte_ring_generic.h:473:40: warning: variable ‘new_value’ set but not used [-Wunused-but-set-variable]
    struct rte_ring_lf_entry old_value, new_value;
                                        ^~~~~~~~~
  SYMLINK-FILE include/rte_fbk_hash.h
  CC rte_cuckoo_hash.o
  CC rte_fbk_hash.o

*Failed Build #11:
OS: FreeBSD11.2
Target: x86_64-native-bsdapp-clang
  AR librte_ring.a
  INSTALL-LIB librte_meter.a
  SYMLINK-FILE include/cmdline_rdline.h
  SYMLINK-FILE include/cmdline_vt100.h
  INSTALL-LIB librte_ring.a
gmake[5]: warning:  Clock skew detected.  Your build may be incomplete.
== Build lib/librte_mempool
== Build lib/librte_hash
  SYMLINK-FILE include/cmdline_socket.h
  SYMLINK-FILE include/cmdline_cirbuf.h
  SYMLINK-FILE include/cmdline_parse_portlist.h
--
  CC cmdline_parse_ipaddr.o
  CC cmdline_parse_num.o
In file included from /tmp/FreeBSD11.2_K11.2_Clang6.0.0/x86_64-native-bsdapp-clang/17a519c90c8b4b879a147f2de71c86c4/dpdk/lib/librte_mempool/rte_mempool.c:34:
In file included from /tmp/FreeBSD11.2_K11.2_Clang6.0.0/x86_64-native-bsdapp-clang/17a519c90c8b4b879a147f2de71c86c4/dpdk/lib/librte_mempool/rte_mempool.h:50:
In file included from /tmp/FreeBSD11.2_K11.2_Clang6.0.0/x86_64-native-bsdapp-clang/17a519c90c8b4b879a147f2de71c86c4/dpdk/x86_64-native-bsdapp-clang/include/rte_ring.h:436:
/tmp/FreeBSD11.2_K11.2_Clang6.0.0/x86_64-native-bsdapp-clang/17a519c90c8b4b879a147f2de71c86c4/dpdk/x86_64-native-bsdapp-clang/include/rte_ring_generic.h:511:14: warning: implicit declaration of function 'rte_atomic128_cmp_exchange' is invalid in C99 [-Wimplicit-function-declaration]
                        success = rte_atomic128_cmp_exchange(
                                  ^
/tmp/FreeBSD11.2_K11.2_Clang6.0.0/x86_64-native-bsdapp-clang/17a519c90c8b4b879a147f2de71c86c4/dpdk/x86_64-native-bsdapp-clang/include/rte_ring_generic.h:511:14: warning: this function declaration is not a prototype [-Wstrict-prototypes]
  CC cmdline_parse_string.o
  CC cmdline_rdline.o
  AR librte_acl.a
  INSTALL-LIB librte_acl.a
  CC rte_mempool_ops.o
  CC cmdline_vt100.o
/tmp/FreeBSD11.2_K11.2_Clang6.0.0/x86_64-native-bsdapp-clang/17a519c90c8b4b879a147f2de71c86c4/dpdk/x86_64-native-bsdapp-clang/include/rte_ring_generic.h:512:21: error: expected expression
                                        (rte_int128_t *)ring_ptr,
                                                       ^
/tmp/FreeBSD11.2_K11.2_Clang6.0.0/x86_64-native-bsdapp-clang/17a519c90c8b4b879a147f2de71c86c4/dpdk/x86_64-native-bsdapp-clang/include/rte_ring_generic.h:512:7: error: use of undeclared identifier 'rte_int128_t'
                                        (rte_int128_t *)ring_ptr,
                                         ^
/tmp/FreeBSD11.2_K11.2_Clang6.0.0/x86_64-native-bsdapp-clang/17a519c90c8b4b879a147f2de71c86c4/dpdk/x86_64-native-bsdapp-clang/include/rte_ring_generic.h:513:21: error: expected expression
                                        (rte_int128_t *)&old_value,
                                                       ^
/tmp/FreeBSD11.2_K11.2_Clang6.0.0/x86_64-native-bsdapp-clang/17a519c90c8b4b879a147f2de71c86c4/dpdk/x86_64-native-bsdapp-clang/include/rte_ring_generic.h:513:7: error: use of undeclared identifier 'rte_int128_t'
                                        (rte_int128_t *)&old_value,
                                         ^
/tmp/FreeBSD11.2_K11.2_Clang6.0.0/x86_64-native-bsdapp-clang/17a519c90c8b4b879a147f2de71c86c4/dpdk/x86_64-native-bsdapp-clang/include/rte_ring_generic.h:514:21: error: expected expression
                                        (rte_int128_t *)&new_value,
                                                       ^
/tmp/FreeBSD11.2_K11.2_Clang6.0.0/x86_64-native-bsdapp-clang/17a519c90c8b4b879a147f2de71c86c4/dpdk/x86_64-native-bsdapp-clang/include/rte_ring_generic.h:514:7: error: use of undeclared identifier 'rte_int128_t'
                                        (rte_int128_t *)&new_value,
                                         ^
  SYMLINK-FILE include/rte_hash.h
  SYMLINK-FILE include/rte_hash_crc.h
  CC rte_mempool_ops_default.o
  CC cmdline_socket.o
In file included from /tmp/FreeBSD11.2_K11.2_Clang6.0.0/x86_64-native-bsdapp-clang/17a519c90c8b4b879a147f2de71c86c4/dpdk/lib/librte_mempool/rte_mempool_ops_default.c:7:
In file included from /tmp/FreeBSD11.2_K11.2_Clang6.0.0/x86_64-native-bsdapp-clang/17a519c90c8b4b879a147f2de71c86c4/dpdk/x86_64-native-bsdapp-clang/include/rte_mempool.h:50:
In file included from /tmp/FreeBSD11.2_K11.2_Clang6.0.0/x86_64-native-bsdapp-clang/17a519c90c8b4b879a147f2de71c86c4/dpdk/x86_64-native-bsdapp-clang/include/rte_ring.h:436:
/tmp/FreeBSD11.2_K11.2_Clang6.0.0/x86_64-native-bsdapp-clang/17a519c90c8b4b879a147f2de71c86c4/dpdk/x86_64-native-bsdapp-clang/include/rte_ring_generic.h:511:14: warning: implicit declaration of function 'rte_atomic128_cmp_exchange' is invalid in C99 [-Wimplicit-function-declaration]
                        success = rte_atomic128_cmp_exchange(
                                  ^
/tmp/FreeBSD11.2_K11.2_Clang6.0.0/x86_64-native-bsdapp-clang/17a519c90c8b4b879a147f2de71c86c4/dpdk/x86_64-native-bsdapp-clang/include/rte_ring_generic.h:511:14: warning: this function declaration is not a prototype [-Wstrict-prototypes]
/tmp/FreeBSD11.2_K11.2_Clang6.0.0/x86_64-native-bsdapp-clang/17a519c90c8b4b879a147f2de71c86c4/dpdk/x86_64-native-bsdapp-clang/include/rte_ring_generic.h:512:21: error: expected expression
                                        (rte_int128_t *)ring_ptr,
                                                       ^
/tmp/FreeBSD11.2_K11.2_Clang6.0.0/x86_64-native-bsdapp-clang/17a519c90c8b4b879a147f2de71c86c4/dpdk/x86_64-native-bsdapp-clang/include/rte_ring_generic.h:512:7: error: use of undeclared identifier 'rte_int128_t'
                                        (rte_int128_t *)ring_ptr,
                                         ^
In file included from /tmp/FreeBSD11.2_K11.2_Clang6.0.0/x86_64-native-bsdapp-clang/17a519c90c8b4b879a147f2de71c86c4/dpdk/lib/librte_mempool/rte_mempool_ops.c:9:
In file included from /tmp/FreeBSD11.2_K11.2_Clang6.0.0/x86_64-native-bsdapp-clang/17a519c90c8b4b879a147f2de71c86c4/dpdk/x86_64-native-bsdapp-clang/include/rte_mempool.h:50:
In file included from /tmp/FreeBSD11.2_K11.2_Clang6.0.0/x86_64-native-bsdapp-clang/17a519c90c8b4b879a147f2de71c86c4/dpdk/x86_64-native-bsdapp-clang/include/rte_ring.h:436:
/tmp/FreeBSD11.2_K11.2_Clang6.0.0/x86_64-native-bsdapp-clang/17a519c90c8b4b879a147f2de71c86c4/dpdk/x86_64-native-bsdapp-clang/include/rte_ring_generic.h:511:14: warning: implicit declaration of function 'rte_atomic128_cmp_exchange' is invalid in C99 [-Wimplicit-function-declaration]
                        success = rte_atomic128_cmp_exchange(
                                  ^
/tmp/FreeBSD11.2_K11.2_Clang6.0.0/x86_64-native-bsdapp-clang/17a519c90c8b4b879a147f2de71c86c4/dpdk/x86_64-native-bsdapp-clang/include/rte_ring_generic.h:511:14: warning: this function declaration is not a prototype [-Wstrict-prototypes]
/tmp/FreeBSD11.2_K11.2_Clang6.0.0/x86_64-native-bsdapp-clang/17a519c90c8b4b879a147f2de71c86c4/dpdk/x86_64-native-bsdapp-clang/include/rte_ring_generic.h:513/tmp/FreeBSD11.2_K11.2_Clang6.0.0/x86_64-native-bsdapp-clang/17a519c90c8b4b879a147f2de71c86c4/dpdk/x86_64-native-bsdapp-clang/include/rte_ring_generic.h:512:21: error: expected expression
                                        (rte_int128_t *)ring_ptr,
                                                       ^
/tmp/FreeBSD11.2_K11.2_Clang6.0.0/x86_64-native-bsdapp-clang/17a519c90c8b4b879a147f2de71c86c4/dpdk/x86_64-native-bsdapp-clang/include/rte_ring_generic.h:512:7:21: error: use of undeclared identifier 'rte_int128_t'
                                        (rte_int128_t *)ring_ptr,
                                         ^
: /tmp/FreeBSD11.2_K11.2_Clang6.0.0/x86_64-native-bsdapp-clang/17a519c90c8b4b879a147f2de71c86c4/dpdk/x86_64-native-bsdapp-clang/include/rte_ring_generic.h:513:21: error: expected expression
                                        (rte_int128_t *)&old_value,
                                                       ^
/tmp/FreeBSD11.2_K11.2_Clang6.0.0/x86_64-native-bsdapp-clang/17a519c90c8b4b879a147f2de71c86c4/dpdk/x86_64-native-bsdapp-clang/include/rte_ring_generic.h:513:7: error: use of undeclared identifier 'rte_int128_t'
                                        (rte_int128_t *)&old_value,
                                         ^
/tmp/FreeBSD11.2_K11.2_Clang6.0.0/x86_64-native-bsdapp-clang/17a519c90c8b4b879a147f2de71c86c4/dpdk/x86_64-native-bsdapp-clang/include/rte_ring_generic.h:514:21: error: expected expression
                                        (rte_int128_t *)&new_value,
                                                       ^
/tmp/FreeBSD11.2_K11.2_Clang6.0.0/x86_64-native-bsdapp-clang/17a519c90c8b4b879a147f2de71c86c4/dpdk/x86_64-native-bsdapp-clang/include/rte_ring_generic.h:514:7: error: erroruse of undeclared identifier 'rte_int128_t'
                                        (rte_int128_t *)&new_value,
                                         ^
: expected expression
                                        (rte_int128_t *)&old_value,
                                                       ^
/tmp/FreeBSD11.2_K11.2_Clang6.0.0/x86_64-native-bsdapp-clang/17a519c90c8b4b879a147f2de71c86c4/dpdk/x86_64-native-bsdapp-clang/include/rte_ring_generic.h:513:7: error: use of undeclared identifier 'rte_int128_t'
                                        (rte_int128_t *)&old_value,
                                         ^
/tmp/FreeBSD11.2_K11.2_Clang6.0.0/x86_64-native-bsdapp-clang/17a519c90c8b4b879a147f2de71c86c4/dpdk/x86_64-native-bsdapp-clang/include/rte_ring_generic.h:514:21: error: expected expression
                                        (rte_int128_t *)&new_value,
                                                       ^
/tmp/FreeBSD11.2_K11.2_Clang6.0.0/x86_64-native-bsdapp-clang/17a519c90c8b4b879a147f2de71c86c4/dpdk/x86_64-native-bsdapp-clang/include/rte_ring_generic.h:514:7: error: use of undeclared identifier 'rte_int128_t'
                                        (rte_int128_t *)&new_value,
                                         ^
2 warnings and 6 errors generated.
gmake[5]: *** [/tmp/FreeBSD11.2_K11.2_Clang6.0.0/x86_64-native-bsdapp-clang/17a519c90c8b4b879a147f2de71c86c4/dpdk/mk/internal/rte.compile-pre.mk:116: rte_mempool.o] Error 1
gmake[5]: *** Waiting for unfinished jobs....
  SYMLINK-FILE include/rte_jhash.h
  CC cmdline_parse_portlist.o
  SYMLINK-FILE include/rte_thash.h
  SYMLINK-FILE include/rte_fbk_hash.h
  CC rte_cuckoo_hash.o
  CC rte_fbk_hash.o
  AR librte_cmdline.a
  INSTALL-LIB librte_cmdline.a
2 warnings and 6 errors generated.
gmake[5]: *** [/tmp/FreeBSD11.2_K11.2_Clang6.0.0/x86_64-native-bsdapp-clang/17a519c90c8b4b879a147f2de71c86c4/dpdk/mk/internal/rte.compile-pre.mk:116: rte_mempool_ops.o] Error 1
2 warnings and 6 errors generated.
gmake[5]: *** [/tmp/FreeBSD11.2_K11.2_Clang6.0.0/x86_64-native-bsdapp-clang/17a519c90c8b4b879a147f2de71c86c4/dpdk/mk/internal/rte.compile-pre.mk:116: rte_mempool_ops_default.o] Error 1
gmake[4]: *** [/tmp/FreeBSD11.2_K11.2_Clang6.0.0/x86_64-native-bsdapp-clang/17a519c90c8b4b879a147f2de71c86c4/dpdk/mk/rte.subdir.mk:35: librte_mempool] Error 2
gmake[4]: *** Waiting for unfinished jobs....
  AR librte_hash.a
  INSTALL-LIB librte_hash.a

*Failed Build #12:
OS: FreeBSD12.0
Target: x86_64-native-bsdapp-gcc
  AR librte_ring.a
  INSTALL-LIB librte_ring.a
  SYMLINK-FILE include/cmdline_cirbuf.h
  INSTALL-LIB librte_metrics.a
  INSTALL-LIB librte_pci.a
gmake[5]: warning:  Clock skew detected.  Your build may be incomplete.
  SYMLINK-FILE include/cmdline_parse_portlist.h
  CC cmdline.o
  CC cmdline_cirbuf.o
  CC acl_run_scalar.o
== Build lib/librte_hash
--
  CC rte_fbk_hash.o
In file included from /tmp/FreeBSD12.0_K19.02_GCC7.3.0/x86_64-native-bsdapp-gcc/17a519c90c8b4b879a147f2de71c86c4/dpdk/x86_64-native-bsdapp-gcc/include/rte_ring.h:436:0,
                 from /tmp/FreeBSD12.0_K19.02_GCC7.3.0/x86_64-native-bsdapp-gcc/17a519c90c8b4b879a147f2de71c86c4/dpdk/lib/librte_mempool/rte_mempool.h:50,
                 from /tmp/FreeBSD12.0_K19.02_GCC7.3.0/x86_64-native-bsdapp-gcc/17a519c90c8b4b879a147f2de71c86c4/dpdk/lib/librte_mempool/rte_mempool_ops.c:9:
/tmp/FreeBSD12.0_K19.02_GCC7.3.0/x86_64-native-bsdapp-gcc/17a519c90c8b4b879a147f2de71c86c4/dpdk/x86_64-native-bsdapp-gcc/include/rte_ring_generic.h: In function '__rte_ring_do_lf_enqueue_mp':
/tmp/FreeBSD12.0_K19.02_GCC7.3.0/x86_64-native-bsdapp-gcc/17a519c90c8b4b879a147f2de71c86c4/dpdk/x86_64-native-bsdapp-gcc/include/rte_ring_generic.h:511:14: warning: implicit declaration of function 'rte_atomic128_cmp_exchange'; did you mean 'rte_atomic32_exchange'? [-Wimplicit-function-declaration]
    success = rte_atomic128_cmp_exchange(
              ^~~~~~~~~~~~~~~~~~~~~~~~~~
              rte_atomic32_exchange
/tmp/FreeBSD12.0_K19.02_GCC7.3.0/x86_64-native-bsdapp-gcc/17a519c90c8b4b879a147f2de71c86c4/dpdk/x86_64-native-bsdapp-gcc/include/rte_ring_generic.h:511:14: warning: nested extern declaration of 'rte_atomic128_cmp_exchange' [-Wnested-externs]
/tmp/FreeBSD12.0_K19.02_GCC7.3.0/x86_64-native-bsdapp-gcc/17a519c90c8b4b879a147f2de71c86c4/dpdk/x86_64-native-bsdapp-gcc/include/rte_ring_generic.h:512:7: error: 'rte_int128_t' undeclared (first use in this function); did you mean '__int128_t'?
      (rte_int128_t *)ring_ptr,
       ^~~~~~~~~~~~
       __int128_t
/tmp/FreeBSD12.0_K19.02_GCC7.3.0/x86_64-native-bsdapp-gcc/17a519c90c8b4b879a147f2de71c86c4/dpdk/x86_64-native-bsdapp-gcc/include/rte_ring_generic.h:512:7: note: each undeclared identifier is reported only once for each function it appears in
/tmp/FreeBSD12.0_K19.02_GCC7.3.0/x86_64-native-bsdapp-gcc/17a519c90c8b4b879a147f2de71c86c4/dpdk/x86_64-native-bsdapp-gcc/include/rte_ring_generic.h:512:21: error: expected expression before ')' token
      (rte_int128_t *)ring_ptr,
                     ^
/tmp/FreeBSD12.0_K19.02_GCC7.3.0/x86_64-native-bsdapp-gcc/17a519c90c8b4b879a147f2de71c86c4/dpdk/x86_64-native-bsdapp-gcc/include/rte_ring_generic.h:473:40: warning: variable 'new_value' set but not used [-Wunused-but-set-variable]
    struct rte_ring_lf_entry old_value, new_value;
                                        ^~~~~~~~~
In file included from /tmp/FreeBSD12.0_K19.02_GCC7.3.0/x86_64-native-bsdapp-gcc/17a519c90c8b4b879a147f2de71c86c4/dpdk/x86_64-native-bsdapp-gcc/include/rte_ring.h:436:0,
                 from /tmp/FreeBSD12.0_K19.02_GCC7.3.0/x86_64-native-bsdapp-gcc/17a519c90c8b4b879a147f2de71c86c4/dpdk/lib/librte_mempool/rte_mempool.h:50,
                 from /tmp/FreeBSD12.0_K19.02_GCC7.3.0/x86_64-native-bsdapp-gcc/17a519c90c8b4b879a147f2de71c86c4/dpdk/lib/librte_mempool/rte_mempool.c:34:
/tmp/FreeBSD12.0_K19.02_GCC7.3.0/x86_64-native-bsdapp-gcc/17a519c90c8b4b879a147f2de71c86c4/dpdk/x86_64-native-bsdapp-gcc/include/rte_ring_generic.h: In function '__rte_ring_do_lf_enqueue_mp':
/tmp/FreeBSD12.0_K19.02_GCC7.3.0/x86_64-native-bsdapp-gcc/17a519c90c8b4b879a147f2de71c86c4/dpdk/x86_64-native-bsdapp-gcc/include/rte_ring_generic.h:511:14: warning: implicit declaration of function 'rte_atomic128_cmp_exchange'; did you mean 'rte_atomic32_exchange'? [-Wimplicit-function-declaration]
    success = rte_atomic128_cmp_exchange(
              ^~~~~~~~~~~~~~~~~~~~~~~~~~
              rte_atomic32_exchange
/tmp/FreeBSD12.0_K19.02_GCC7.3.0/x86_64-native-bsdapp-gcc/17a519c90c8b4b879a147f2de71c86c4/dpdk/x86_64-native-bsdapp-gcc/include/rte_ring_generic.h:511:14: warning: nested extern declaration of 'rte_atomic128_cmp_exchange' [-Wnested-externs]
/tmp/FreeBSD12.0_K19.02_GCC7.3.0/x86_64-native-bsdapp-gcc/17a519c90c8b4b879a147f2de71c86c4/dpdk/x86_64-native-bsdapp-gcc/include/rte_ring_generic.h:512:7: error: 'rte_int128_t' undeclared (first use in this function); did you mean '__int128_t'?
      (rte_int128_t *)ring_ptr,
       ^~~~~~~~~~~~
       __int128_t
/tmp/FreeBSD12.0_K19.02_GCC7.3.0/x86_64-native-bsdapp-gcc/17a519c90c8b4b879a147f2de71c86c4/dpdk/x86_64-native-bsdapp-gcc/include/rte_ring_generic.h:512:7: note: each undeclared identifier is reported only once for each function it appears in
/tmp/FreeBSD12.0_K19.02_GCC7.3.0/x86_64-native-bsdapp-gcc/17a519c90c8b4b879a147f2de71c86c4/dpdk/x86_64-native-bsdapp-gcc/include/rte_ring_generic.h:512:21: error: expected expression before ')' token
      (rte_int128_t *)ring_ptr,
                     ^
/tmp/FreeBSD12.0_K19.02_GCC7.3.0/x86_64-native-bsdapp-gcc/17a519c90c8b4b879a147f2de71c86c4/dpdk/x86_64-native-bsdapp-gcc/include/rte_ring_generic.h:473:40: warning: variable 'new_value' set but not used [-Wunused-but-set-variable]
    struct rte_ring_lf_entry old_value, new_value;
                                        ^~~~~~~~~
gmake[5]: *** [/tmp/FreeBSD12.0_K19.02_GCC7.3.0/x86_64-native-bsdapp-gcc/17a519c90c8b4b879a147f2de71c86c4/dpdk/mk/internal/rte.compile-pre.mk:114: rte_mempool_ops.o] Error 1
gmake[5]: *** Waiting for unfinished jobs....
gmake[5]: *** [/tmp/FreeBSD12.0_K19.02_GCC7.3.0/x86_64-native-bsdapp-gcc/17a519c90c8b4b879a147f2de71c86c4/dpdk/mk/internal/rte.compile-pre.mk:114: rte_mempool.o] Error 1

*Failed Build #13:
OS: FreeBSD12.0
Target: x86_64-native-bsdapp-clang
  CC cmdline_parse_ipaddr.o
  CC cmdline_parse_num.o
  AR librte_ring.a
  INSTALL-LIB librte_ring.a
  CC cmdline_parse_string.o
gmake[5]: warning:  Clock skew detected.  Your build may be incomplete.
  CC cmdline_rdline.o
  CC cmdline_vt100.o
== Build lib/librte_mempool
  CC cmdline_socket.o
== Build lib/librte_hash
--
  CC rte_fbk_hash.o
  CC rte_mempool_ops_default.o
In file included from /tmp/FreeBSD12.0_K19.02_Clang6.0.1/x86_64-native-bsdapp-clang/17a519c90c8b4b879a147f2de71c86c4/dpdk/lib/librte_mempool/rte_mempool_ops.c:9:
In file included from /tmp/FreeBSD12.0_K19.02_Clang6.0.1/x86_64-native-bsdapp-clang/17a519c90c8b4b879a147f2de71c86c4/dpdk/x86_64-native-bsdapp-clang/include/rte_mempool.h:50:
In file included from /tmp/FreeBSD12.0_K19.02_Clang6.0.1/x86_64-native-bsdapp-clang/17a519c90c8b4b879a147f2de71c86c4/dpdk/x86_64-native-bsdapp-clang/include/rte_ring.h:436:
/tmp/FreeBSD12.0_K19.02_Clang6.0.1/x86_64-native-bsdapp-clang/17a519c90c8b4b879a147f2de71c86c4/dpdk/x86_64-native-bsdapp-clang/include/rte_ring_generic.h:511:14: warning: implicit declaration of function 'rte_atomic128_cmp_exchange' is invalid in C99 [-Wimplicit-function-declaration]
                        success = rte_atomic128_cmp_exchange(
                                  ^
/tmp/FreeBSD12.0_K19.02_Clang6.0.1/x86_64-native-bsdapp-clang/17a519c90c8b4b879a147f2de71c86c4/dpdk/x86_64-native-bsdapp-clang/include/rte_ring_generic.h:511:14: warning: this function declaration is not a prototype [-Wstrict-prototypes]
In file included from /tmp/FreeBSD12.0_K19.02_Clang6.0.1/x86_64-native-bsdapp-clang/17a519c90c8b4b879a147f2de71c86c4/dpdk/lib/librte_mempool/rte_mempool_ops_default.c:7:
In file included from /tmp/FreeBSD12.0_K19.02_Clang6.0.1/x86_64-native-bsdapp-clang/17a519c90c8b4b879a147f2de71c86c4/dpdk/x86_64-native-bsdapp-clang/include/rte_mempool.h:50:
In file included from /tmp/FreeBSD12.0_K19.02_Clang6.0.1/x86_64-native-bsdapp-clang/17a519c90c8b4b879a147f2de71c86c4/dpdk/x86_64-native-bsdapp-clang/include/rte_ring.h:436:
/tmp/FreeBSD12.0_K19.02_Clang6.0.1/x86_64-native-bsdapp-clang/17a519c90c8b4b879a147f2de71c86c4/dpdk/x86_64-native-bsdapp-clang/include/rte_ring_generic.h:511:14: warning: implicit declaration of function 'rte_atomic128_cmp_exchange' is invalid in C99 [-Wimplicit-function-declaration]
                        success = rte_atomic128_cmp_exchange(
                                  ^
/tmp/FreeBSD12.0_K19.02_Clang6.0.1/x86_64-native-bsdapp-clang/17a519c90c8b4b879a147f2de71c86c4/dpdk/x86_64-native-bsdapp-clang/include/rte_ring_generic.h:511:14: warning: this function declaration is not a prototype [-Wstrict-prototypes]
/tmp/FreeBSD12.0_K19.02_Clang6.0.1/x86_64-native-bsdapp-clang/17a519c90c8b4b879a147f2de71c86c4/dpdk/x86_64-native-bsdapp-clang/include/rte_ring_generic.h:512:21: error: expected expression
                                        (rte_int128_t *)ring_ptr,
                                                       ^
/tmp/FreeBSD12.0_K19.02_Clang6.0.1/x86_64-native-bsdapp-clang/17a519c90c8b4b879a147f2de71c86c4/dpdk/x86_64-native-bsdapp-clang/include/rte_ring_generic.h:512:21: error: expected expression
                                        (rte_int128_t *)ring_ptr,
                                                       ^
In file included from /tmp/FreeBSD12.0_K19.02_Clang6.0.1/x86_64-native-bsdapp-clang/17a519c90c8b4b879a147f2de71c86c4/dpdk/lib/librte_mempool/rte_mempool.c:34:
In file included from /tmp/FreeBSD12.0_K19.02_Clang6.0.1/x86_64-native-bsdapp-clang/17a519c90c8b4b879a147f2de71c86c4/dpdk/lib/librte_mempool/rte_mempool.h:50:
In file included from /tmp/FreeBSD12.0_K19.02_Clang6.0.1/x86_64-native-bsdapp-clang/17a519c90c8b4b879a147f2de71c86c4/dpdk/x86_64-native-bsdapp-clang/include/rte_ring.h:436:
/tmp/FreeBSD12.0_K19.02_Clang6.0.1/x86_64-native-bsdapp-clang/17a519c90c8b4b879a147f2de71c86c4/dpdk/x86_64-native-bsdapp-clang/include/rte_ring_generic.h:511:14: warning: implicit declaration of function 'rte_atomic128_cmp_exchange' is invalid in C99 [-Wimplicit-function-declaration]
                        success = rte_atomic128_cmp_exchange(
                                  ^
/tmp/FreeBSD12.0_K19.02_Clang6.0.1/x86_64-native-bsdapp-clang/17a519c90c8b4b879a147f2de71c86c4/dpdk/x86_64-native-bsdapp-clang/include/rte_ring_generic.h:511:14: warning: this function declaration is not a prototype [-Wstrict-prototypes]
/tmp/FreeBSD12.0_K19.02_Clang6.0.1/x86_64-native-bsdapp-clang/17a519c90c8b4b879a147f2de71c86c4/dpdk/x86_64-native-bsdapp-clang/include/rte_ring_generic.h:512:21: error: expected expression
                                        (rte_int128_t *)ring_ptr,
                                                       ^
/tmp/FreeBSD12.0_K19.02_Clang6.0.1/x86_64-native-bsdapp-clang/17a519c90c8b4b879a147f2de71c86c4/dpdk/x86_64-native-bsdapp-clang/include/rte_ring_generic.h/tmp/FreeBSD12.0_K19.02_Clang6.0.1/x86_64-native-bsdapp-clang/17a519c90c8b4b879a147f2de71c86c4/dpdk/x86_64-native-bsdapp-clang/include/rte_ring_generic.h/tmp/FreeBSD12.0_K19.02_Clang6.0.1/x86_64-native-bsdapp-clang/17a519c90c8b4b879a147f2de71c86c4/dpdk/x86_64-native-bsdapp-clang/include/rte_ring_generic.h:512:7: error: use of undeclared identifier 'rte_int128_t'
                                        (rte_int128_t *)ring_ptr,
:512:7                                         ^
: error: use of undeclared identifier 'rte_int128_t'
                                        (rte_int128_t *)ring_ptr,
                                         ^
/tmp/FreeBSD12.0_K19.02_Clang6.0.1/x86_64-native-bsdapp-clang/17a519c90c8b4b879a147f2de71c86c4/dpdk/x86_64-native-bsdapp-clang/include/rte_ring_generic.h:513:21: error: expected expression
                                        (rte_int128_t *)&old_value,
                                                       ^
/tmp/FreeBSD12.0_K19.02_Clang6.0.1/x86_64-native-bsdapp-clang/17a519c90c8b4b879a147f2de71c86c4/dpdk/x86_64-native-bsdapp-clang/include/rte_ring_generic.h:513:7: /tmp/FreeBSD12.0_K19.02_Clang6.0.1/x86_64-native-bsdapp-clang/17a519c90c8b4b879a147f2de71c86c4/dpdk/x86_64-native-bsdapp-clang/include/rte_ring_generic.h:512:7: error: use of undeclared identifier 'rte_int128_t'
                                        (rte_int128_t *)ring_ptr,
                                         ^
:513:21: error: expected expression
                                        (rte_int128_t *)&old_value,
                                                       ^
/tmp/FreeBSD12.0_K19.02_Clang6.0.1/x86_64-native-bsdapp-clang/17a519c90c8b4b879a147f2de71c86c4/dpdk/x86_64-native-bsdapp-clang/include/rte_ring_generic.h:513:7: error: use of undeclared identifier 'rte_int128_t'
                                        (rte_int128_t *)&old_value,
                                         ^
/tmp/FreeBSD12.0_K19.02_Clang6.0.1/x86_64-native-bsdapp-clang/17a519c90c8b4b879a147f2de71c86c4/dpdk/x86_64-native-bsdapp-clang/include/rte_ring_generic.h:513:21: error: expected expression
                                        (rte_int128_t *)&old_value,
                                                       ^
/tmp/FreeBSD12.0_K19.02_Clang6.0.1/x86_64-native-bsdapp-clang/17a519c90c8b4b879a147f2de71c86c4/dpdk/x86_64-native-bsdapp-clang/include/rte_ring_generic.h:513:7: error: use of undeclared identifier 'rte_int128_t'
                                        (rte_int128_t *)&old_value,
                                         ^
/tmp/FreeBSD12.0_K19.02_Clang6.0.1/x86_64-native-bsdapp-clang/17a519c90c8b4b879a147f2de71c86c4/dpdk/x86_64-native-bsdapp-clang/include/rte_ring_generic.h:514:21: error: expected expression
                                        (rte_int128_t *)&new_value,
                                                       ^
/tmp/FreeBSD12.0_K19.02_Clang6.0.1/x86_64-native-bsdapp-clang/17a519c90c8b4b879a147f2de71c86c4/dpdk/x86_64-native-bsdapp-clang/include/rte_ring_generic.h:514:7: error: use of undeclared identifier 'rte_int128_t'
                                        (rte_int128_t *)&new_value,
                                         ^
/tmp/FreeBSD12.0_K19.02_Clang6.0.1/x86_64-native-bsdapp-clang/17a519c90c8b4b879a147f2de71c86c4/dpdk/x86_64-native-bsdapp-clang/include/rte_ring_generic.h:514:21: error: expected expression
                                        (rte_int128_t *)&new_value,
                                                       ^
/tmp/FreeBSD12.0_K19.02_Clang6.0.1/x86_64-native-bsdapp-clang/17a519c90c8b4b879a147f2de71c86c4/dpdk/x86_64-native-bsdapp-clang/include/rte_ring_generic.h:514:7: error: use of undeclared identifier 'rte_int128_t'
                                        (rte_int128_t *)&new_value,
                                         ^
error: use of undeclared identifier 'rte_int128_t'
                                        (rte_int128_t *)&old_value,
                                         ^
/tmp/FreeBSD12.0_K19.02_Clang6.0.1/x86_64-native-bsdapp-clang/17a519c90c8b4b879a147f2de71c86c4/dpdk/x86_64-native-bsdapp-clang/include/rte_ring_generic.h:514:21: error: expected expression
                                        (rte_int128_t *)&new_value,
                                                       ^
/tmp/FreeBSD12.0_K19.02_Clang6.0.1/x86_64-native-bsdapp-clang/17a519c90c8b4b879a147f2de71c86c4/dpdk/x86_64-native-bsdapp-clang/include/rte_ring_generic.h:514:7: error: use of undeclared identifier 'rte_int128_t'
                                        (rte_int128_t *)&new_value,
                                         ^
2 warnings and 6 errors generated.
gmake[5]: *** [/tmp/FreeBSD12.0_K19.02_Clang6.0.1/x86_64-native-bsdapp-clang/17a519c90c8b4b879a147f2de71c86c4/dpdk/mk/internal/rte.compile-pre.mk:116: rte_mempool_ops_default.o] Error 1
gmake[5]: *** Waiting for unfinished jobs....
2 warnings and 6 errors generated.
gmake[5]: *** [/tmp/FreeBSD12.0_K19.02_Clang6.0.1/x86_64-native-bsdapp-clang/17a519c90c8b4b879a147f2de71c86c4/dpdk/mk/internal/rte.compile-pre.mk:116: rte_mempool.o] Error 1
2 warnings and 6 errors generated.
gmake[5]: *** [/tmp/FreeBSD12.0_K19.02_Clang6.0.1/x86_64-native-bsdapp-clang/17a519c90c8b4b879a147f2de71c86c4/dpdk/mk/internal/rte.compile-pre.mk:116: rte_mempool_ops.o] Error 1
gmake[4]: *** [/tmp/FreeBSD12.0_K19.02_Clang6.0.1/x86_64-native-bsdapp-clang/17a519c90c8b4b879a147f2de71c86c4/dpdk/mk/rte.subdir.mk:35: librte_mempool] Error 2
gmake[4]: *** Waiting for unfinished jobs....
  AR librte_hash.a
  INSTALL-LIB librte_hash.a

*Failed Build #14:
OS: FreeBSD11.2
Target: x86_64-native-bsdapp-gcc
  INSTALL-LIB librte_ring.a
  CC acl_run_scalar.o
  AR librte_jobstats.a
  INSTALL-LIB librte_jobstats.a
  AR librte_timer.a
gmake[5]: warning:  Clock skew detected.  Your build may be incomplete.
  SYMLINK-FILE include/cmdline_parse_string.h
  INSTALL-LIB librte_timer.a
  CC acl_run_sse.o
== Build lib/librte_mempool
  AR librte_meter.a
--
  CC rte_mempool_ops_default.o
In file included from /tmp/FreeBSD11.2_K11.2_GCC6.4.0/x86_64-native-bsdapp-gcc/17a519c90c8b4b879a147f2de71c86c4/dpdk/x86_64-native-bsdapp-gcc/include/rte_ring.h:436:0,
                 from /tmp/FreeBSD11.2_K11.2_GCC6.4.0/x86_64-native-bsdapp-gcc/17a519c90c8b4b879a147f2de71c86c4/dpdk/lib/librte_mempool/rte_mempool.h:50,
                 from /tmp/FreeBSD11.2_K11.2_GCC6.4.0/x86_64-native-bsdapp-gcc/17a519c90c8b4b879a147f2de71c86c4/dpdk/lib/librte_mempool/rte_mempool_ops.c:9:
/tmp/FreeBSD11.2_K11.2_GCC6.4.0/x86_64-native-bsdapp-gcc/17a519c90c8b4b879a147f2de71c86c4/dpdk/x86_64-native-bsdapp-gcc/include/rte_ring_generic.h: In function '__rte_ring_do_lf_enqueue_mp':
/tmp/FreeBSD11.2_K11.2_GCC6.4.0/x86_64-native-bsdapp-gcc/17a519c90c8b4b879a147f2de71c86c4/dpdk/x86_64-native-bsdapp-gcc/include/rte_ring_generic.h:511:14: warning: implicit declaration of function 'rte_atomic128_cmp_exchange' [-Wimplicit-function-declaration]
    success = rte_atomic128_cmp_exchange(
              ^~~~~~~~~~~~~~~~~~~~~~~~~~
/tmp/FreeBSD11.2_K11.2_GCC6.4.0/x86_64-native-bsdapp-gcc/17a519c90c8b4b879a147f2de71c86c4/dpdk/x86_64-native-bsdapp-gcc/include/rte_ring_generic.h:511:4: warning: nested extern declaration of 'rte_atomic128_cmp_exchange' [-Wnested-externs]
    success = rte_atomic128_cmp_exchange(
    ^~~~~~~
/tmp/FreeBSD11.2_K11.2_GCC6.4.0/x86_64-native-bsdapp-gcc/17a519c90c8b4b879a147f2de71c86c4/dpdk/x86_64-native-bsdapp-gcc/include/rte_ring_generic.h:512:7: error: 'rte_int128_t' undeclared (first use in this function)
      (rte_int128_t *)ring_ptr,
       ^~~~~~~~~~~~
/tmp/FreeBSD11.2_K11.2_GCC6.4.0/x86_64-native-bsdapp-gcc/17a519c90c8b4b879a147f2de71c86c4/dpdk/x86_64-native-bsdapp-gcc/include/rte_ring_generic.h:512:7: note: each undeclared identifier is reported only once for each function it appears in
/tmp/FreeBSD11.2_K11.2_GCC6.4.0/x86_64-native-bsdapp-gcc/17a519c90c8b4b879a147f2de71c86c4/dpdk/x86_64-native-bsdapp-gcc/include/rte_ring_generic.h:512:21: error: expected expression before ')' token
      (rte_int128_t *)ring_ptr,
                     ^
/tmp/FreeBSD11.2_K11.2_GCC6.4.0/x86_64-native-bsdapp-gcc/17a519c90c8b4b879a147f2de71c86c4/dpdk/x86_64-native-bsdapp-gcc/include/rte_ring_generic.h:473:40: warning: variable 'new_value' set but not used [-Wunused-but-set-variable]
    struct rte_ring_lf_entry old_value, new_value;
                                        ^~~~~~~~~
In file included from /tmp/FreeBSD11.2_K11.2_GCC6.4.0/x86_64-native-bsdapp-gcc/17a519c90c8b4b879a147f2de71c86c4/dpdk/x86_64-native-bsdapp-gcc/include/rte_ring.h:436:0,
                 from /tmp/FreeBSD11.2_K11.2_GCC6.4.0/x86_64-native-bsdapp-gcc/17a519c90c8b4b879a147f2de71c86c4/dpdk/lib/librte_mempool/rte_mempool.h:50,
                 from /tmp/FreeBSD11.2_K11.2_GCC6.4.0/x86_64-native-bsdapp-gcc/17a519c90c8b4b879a147f2de71c86c4/dpdk/lib/librte_mempool/rte_mempool.c:34:
/tmp/FreeBSD11.2_K11.2_GCC6.4.0/x86_64-native-bsdapp-gcc/17a519c90c8b4b879a147f2de71c86c4/dpdk/x86_64-native-bsdapp-gcc/include/rte_ring_generic.h: In function '__rte_ring_do_lf_enqueue_mp':
/tmp/FreeBSD11.2_K11.2_GCC6.4.0/x86_64-native-bsdapp-gcc/17a519c90c8b4b879a147f2de71c86c4/dpdk/x86_64-native-bsdapp-gcc/include/rte_ring_generic.h:511:14: warning: implicit declaration of function 'rte_atomic128_cmp_exchange' [-Wimplicit-function-declaration]
    success = rte_atomic128_cmp_exchange(
              ^~~~~~~~~~~~~~~~~~~~~~~~~~
/tmp/FreeBSD11.2_K11.2_GCC6.4.0/x86_64-native-bsdapp-gcc/17a519c90c8b4b879a147f2de71c86c4/dpdk/x86_64-native-bsdapp-gcc/include/rte_ring_generic.h:511:4: warning: nested extern declaration of 'rte_atomic128_cmp_exchange' [-Wnested-externs]
    success = rte_atomic128_cmp_exchange(
    ^~~~~~~
/tmp/FreeBSD11.2_K11.2_GCC6.4.0/x86_64-native-bsdapp-gcc/17a519c90c8b4b879a147f2de71c86c4/dpdk/x86_64-native-bsdapp-gcc/include/rte_ring_generic.h:512:7: error: 'rte_int128_t' undeclared (first use in this function)
      (rte_int128_t *)ring_ptr,
       ^~~~~~~~~~~~
/tmp/FreeBSD11.2_K11.2_GCC6.4.0/x86_64-native-bsdapp-gcc/17a519c90c8b4b879a147f2de71c86c4/dpdk/x86_64-native-bsdapp-gcc/include/rte_ring_generic.h:512:7: note: each undeclared identifier is reported only once for each function it appears in
/tmp/FreeBSD11.2_K11.2_GCC6.4.0/x86_64-native-bsdapp-gcc/17a519c90c8b4b879a147f2de71c86c4/dpdk/x86_64-native-bsdapp-gcc/include/rte_ring_generic.h:512:21: error: expected expression before ')' token
      (rte_int128_t *)ring_ptr,
                     ^
/tmp/FreeBSD11.2_K11.2_GCC6.4.0/x86_64-native-bsdapp-gcc/17a519c90c8b4b879a147f2de71c86c4/dpdk/x86_64-native-bsdapp-gcc/include/rte_ring_generic.h:473:40: warning: variable 'new_value' set but not used [-Wunused-but-set-variable]
    struct rte_ring_lf_entry old_value, new_value;
                                        ^~~~~~~~~
In file included from /tmp/FreeBSD11.2_K11.2_GCC6.4.0/x86_64-native-bsdapp-gcc/17a519c90c8b4b879a147f2de71c86c4/dpdk/x86_64-native-bsdapp-gcc/include/rte_ring.h:436:0,
                 from /tmp/FreeBSD11.2_K11.2_GCC6.4.0/x86_64-native-bsdapp-gcc/17a519c90c8b4b879a147f2de71c86c4/dpdk/lib/librte_mempool/rte_mempool.h:50,
                 from /tmp/FreeBSD11.2_K11.2_GCC6.4.0/x86_64-native-bsdapp-gcc/17a519c90c8b4b879a147f2de71c86c4/dpdk/lib/librte_mempool/rte_mempool_ops_default.c:7:
/tmp/FreeBSD11.2_K11.2_GCC6.4.0/x86_64-native-bsdapp-gcc/17a519c90c8b4b879a147f2de71c86c4/dpdk/x86_64-native-bsdapp-gcc/include/rte_ring_generic.h: In function '__rte_ring_do_lf_enqueue_mp':
/tmp/FreeBSD11.2_K11.2_GCC6.4.0/x86_64-native-bsdapp-gcc/17a519c90c8b4b879a147f2de71c86c4/dpdk/x86_64-native-bsdapp-gcc/include/rte_ring_generic.h:511:14: warning: implicit declaration of function 'rte_atomic128_cmp_exchange' [-Wimplicit-function-declaration]
    success = rte_atomic128_cmp_exchange(
              ^~~~~~~~~~~~~~~~~~~~~~~~~~
/tmp/FreeBSD11.2_K11.2_GCC6.4.0/x86_64-native-bsdapp-gcc/17a519c90c8b4b879a147f2de71c86c4/dpdk/x86_64-native-bsdapp-gcc/include/rte_ring_generic.h:511:4: warning: nested extern declaration of 'rte_atomic128_cmp_exchange' [-Wnested-externs]
    success = rte_atomic128_cmp_exchange(
    ^~~~~~~
/tmp/FreeBSD11.2_K11.2_GCC6.4.0/x86_64-native-bsdapp-gcc/17a519c90c8b4b879a147f2de71c86c4/dpdk/x86_64-native-bsdapp-gcc/include/rte_ring_generic.h:512:7: error: 'rte_int128_t' undeclared (first use in this function)
      (rte_int128_t *)ring_ptr,
       ^~~~~~~~~~~~
/tmp/FreeBSD11.2_K11.2_GCC6.4.0/x86_64-native-bsdapp-gcc/17a519c90c8b4b879a147f2de71c86c4/dpdk/x86_64-native-bsdapp-gcc/include/rte_ring_generic.h:512:7: note: each undeclared identifier is reported only once for each function it appears in
/tmp/FreeBSD11.2_K11.2_GCC6.4.0/x86_64-native-bsdapp-gcc/17a519c90c8b4b879a147f2de71c86c4/dpdk/x86_64-native-bsdapp-gcc/include/rte_ring_generic.h:512:21: error: expected expression before ')' token
      (rte_int128_t *)ring_ptr,
                     ^
/tmp/FreeBSD11.2_K11.2_GCC6.4.0/x86_64-native-bsdapp-gcc/17a519c90c8b4b879a147f2de71c86c4/dpdk/x86_64-native-bsdapp-gcc/include/rte_ring_generic.h:473:40: warning: variable 'new_value' set but not used [-Wunused-but-set-variable]
    struct rte_ring_lf_entry old_value, new_value;
                                        ^~~~~~~~~
gmake[5]: *** [/tmp/FreeBSD11.2_K11.2_GCC6.4.0/x86_64-native-bsdapp-gcc/17a519c90c8b4b879a147f2de71c86c4/dpdk/mk/internal/rte.compile-pre.mk:116: rte_mempool_ops.o] Error 1
gmake[5]: *** Waiting for unfinished jobs....
gmake[5]: *** [/tmp/FreeBSD11.2_K11.2_GCC6.4.0/x86_64-native-bsdapp-gcc/17a519c90c8b4b879a147f2de71c86c4/dpdk/mk/internal/rte.compile-pre.mk:116: rte_mempool.o] Error 1

*Failed Build #15:
OS: RHEL76
Target: x86_64-native-linuxapp-gcc
  CC rte_fbk_hash.o
In file included from /tmp/RHEL76_K3.10.0_GCC4.8.5/x86_64-native-linuxapp-gcc/17a519c90c8b4b879a147f2de71c86c4/dpdk/x86_64-native-linuxapp-gcc/include/rte_ring.h:436:0,
                 from /tmp/RHEL76_K3.10.0_GCC4.8.5/x86_64-native-linuxapp-gcc/17a519c90c8b4b879a147f2de71c86c4/dpdk/lib/librte_mempool/rte_mempool.h:50,
                 from /tmp/RHEL76_K3.10.0_GCC4.8.5/x86_64-native-linuxapp-gcc/17a519c90c8b4b879a147f2de71c86c4/dpdk/lib/librte_mempool/rte_mempool.c:34:
/tmp/RHEL76_K3.10.0_GCC4.8.5/x86_64-native-linuxapp-gcc/17a519c90c8b4b879a147f2de71c86c4/dpdk/x86_64-native-linuxapp-gcc/include/rte_ring_generic.h: In function ‘__rte_ring_do_lf_enqueue_mp’:
/tmp/RHEL76_K3.10.0_GCC4.8.5/x86_64-native-linuxapp-gcc/17a519c90c8b4b879a147f2de71c86c4/dpdk/x86_64-native-linuxapp-gcc/include/rte_ring_generic.h:511:4: warning: implicit declaration of function ‘rte_atomic128_cmp_exchange’ [-Wimplicit-function-declaration]
    success = rte_atomic128_cmp_exchange(
    ^
/tmp/RHEL76_K3.10.0_GCC4.8.5/x86_64-native-linuxapp-gcc/17a519c90c8b4b879a147f2de71c86c4/dpdk/x86_64-native-linuxapp-gcc/include/rte_ring_generic.h:511:4: warning: nested extern declaration of ‘rte_atomic128_cmp_exchange’ [-Wnested-externs]
/tmp/RHEL76_K3.10.0_GCC4.8.5/x86_64-native-linuxapp-gcc/17a519c90c8b4b879a147f2de71c86c4/dpdk/x86_64-native-linuxapp-gcc/include/rte_ring_generic.h:512:7: error: ‘rte_int128_t’ undeclared (first use in this function)
      (rte_int128_t *)ring_ptr,
       ^
/tmp/RHEL76_K3.10.0_GCC4.8.5/x86_64-native-linuxapp-gcc/17a519c90c8b4b879a147f2de71c86c4/dpdk/x86_64-native-linuxapp-gcc/include/rte_ring_generic.h:512:7: note: each undeclared identifier is reported only once for each function it appears in
/tmp/RHEL76_K3.10.0_GCC4.8.5/x86_64-native-linuxapp-gcc/17a519c90c8b4b879a147f2de71c86c4/dpdk/x86_64-native-linuxapp-gcc/include/rte_ring_generic.h:512:21: error: expected expression before ‘)’ token
      (rte_int128_t *)ring_ptr,
                     ^
/tmp/RHEL76_K3.10.0_GCC4.8.5/x86_64-native-linuxapp-gcc/17a519c90c8b4b879a147f2de71c86c4/dpdk/x86_64-native-linuxapp-gcc/include/rte_ring_generic.h:473:40: warning: variable ‘new_value’ set but not used [-Wunused-but-set-variable]
    struct rte_ring_lf_entry old_value, new_value;
                                        ^
  CC rte_mempool_ops_default.o
In file included from /tmp/RHEL76_K3.10.0_GCC4.8.5/x86_64-native-linuxapp-gcc/17a519c90c8b4b879a147f2de71c86c4/dpdk/x86_64-native-linuxapp-gcc/include/rte_ring.h:436:0,
                 from /tmp/RHEL76_K3.10.0_GCC4.8.5/x86_64-native-linuxapp-gcc/17a519c90c8b4b879a147f2de71c86c4/dpdk/x86_64-native-linuxapp-gcc/include/rte_mempool.h:50,
                 from /tmp/RHEL76_K3.10.0_GCC4.8.5/x86_64-native-linuxapp-gcc/17a519c90c8b4b879a147f2de71c86c4/dpdk/lib/librte_mempool/rte_mempool_ops.c:9:
/tmp/RHEL76_K3.10.0_GCC4.8.5/x86_64-native-linuxapp-gcc/17a519c90c8b4b879a147f2de71c86c4/dpdk/x86_64-native-linuxapp-gcc/include/rte_ring_generic.h: In function ‘__rte_ring_do_lf_enqueue_mp’:
/tmp/RHEL76_K3.10.0_GCC4.8.5/x86_64-native-linuxapp-gcc/17a519c90c8b4b879a147f2de71c86c4/dpdk/x86_64-native-linuxapp-gcc/include/rte_ring_generic.h:511:4: warning: implicit declaration of function ‘rte_atomic128_cmp_exchange’ [-Wimplicit-function-declaration]
    success = rte_atomic128_cmp_exchange(
    ^
/tmp/RHEL76_K3.10.0_GCC4.8.5/x86_64-native-linuxapp-gcc/17a519c90c8b4b879a147f2de71c86c4/dpdk/x86_64-native-linuxapp-gcc/include/rte_ring_generic.h:511:4: warning: nested extern declaration of ‘rte_atomic128_cmp_exchange’ [-Wnested-externs]
/tmp/RHEL76_K3.10.0_GCC4.8.5/x86_64-native-linuxapp-gcc/17a519c90c8b4b879a147f2de71c86c4/dpdk/x86_64-native-linuxapp-gcc/include/rte_ring_generic.h:512:7: error: ‘rte_int128_t’ undeclared (first use in this function)
      (rte_int128_t *)ring_ptr,
       ^
/tmp/RHEL76_K3.10.0_GCC4.8.5/x86_64-native-linuxapp-gcc/17a519c90c8b4b879a147f2de71c86c4/dpdk/x86_64-native-linuxapp-gcc/include/rte_ring_generic.h:512:7: note: each undeclared identifier is reported only once for each function it appears in
/tmp/RHEL76_K3.10.0_GCC4.8.5/x86_64-native-linuxapp-gcc/17a519c90c8b4b879a147f2de71c86c4/dpdk/x86_64-native-linuxapp-gcc/include/rte_ring_generic.h:512:21: error: expected expression before ‘)’ token
      (rte_int128_t *)ring_ptr,
                     ^
/tmp/RHEL76_K3.10.0_GCC4.8.5/x86_64-native-linuxapp-gcc/17a519c90c8b4b879a147f2de71c86c4/dpdk/x86_64-native-linuxapp-gcc/include/rte_ring_generic.h:473:40: warning: variable ‘new_value’ set but not used [-Wunused-but-set-variable]
    struct rte_ring_lf_entry old_value, new_value;
                                        ^
make[5]: *** [rte_mempool.o] Error 1
make[5]: *** Waiting for unfinished jobs....
make[5]: *** [rte_mempool_ops.o] Error 1
--
  INSTALL-LIB librte_acl.a
In file included from /tmp/RHEL76_K3.10.0_GCC4.8.5/x86_64-native-linuxapp-gcc/17a519c90c8b4b879a147f2de71c86c4/dpdk/x86_64-native-linuxapp-gcc/include/rte_ring.h:436:0,
                 from /tmp/RHEL76_K3.10.0_GCC4.8.5/x86_64-native-linuxapp-gcc/17a519c90c8b4b879a147f2de71c86c4/dpdk/x86_64-native-linuxapp-gcc/include/rte_mempool.h:50,
                 from /tmp/RHEL76_K3.10.0_GCC4.8.5/x86_64-native-linuxapp-gcc/17a519c90c8b4b879a147f2de71c86c4/dpdk/lib/librte_mempool/rte_mempool_ops_default.c:7:
/tmp/RHEL76_K3.10.0_GCC4.8.5/x86_64-native-linuxapp-gcc/17a519c90c8b4b879a147f2de71c86c4/dpdk/x86_64-native-linuxapp-gcc/include/rte_ring_generic.h: In function ‘__rte_ring_do_lf_enqueue_mp’:
/tmp/RHEL76_K3.10.0_GCC4.8.5/x86_64-native-linuxapp-gcc/17a519c90c8b4b879a147f2de71c86c4/dpdk/x86_64-native-linuxapp-gcc/include/rte_ring_generic.h:511:4: warning: implicit declaration of function ‘rte_atomic128_cmp_exchange’ [-Wimplicit-function-declaration]
    success = rte_atomic128_cmp_exchange(
    ^
/tmp/RHEL76_K3.10.0_GCC4.8.5/x86_64-native-linuxapp-gcc/17a519c90c8b4b879a147f2de71c86c4/dpdk/x86_64-native-linuxapp-gcc/include/rte_ring_generic.h:511:4: warning: nested extern declaration of ‘rte_atomic128_cmp_exchange’ [-Wnested-externs]
/tmp/RHEL76_K3.10.0_GCC4.8.5/x86_64-native-linuxapp-gcc/17a519c90c8b4b879a147f2de71c86c4/dpdk/x86_64-native-linuxapp-gcc/include/rte_ring_generic.h:512:7: error: ‘rte_int128_t’ undeclared (first use in this function)
      (rte_int128_t *)ring_ptr,
       ^
/tmp/RHEL76_K3.10.0_GCC4.8.5/x86_64-native-linuxapp-gcc/17a519c90c8b4b879a147f2de71c86c4/dpdk/x86_64-native-linuxapp-gcc/include/rte_ring_generic.h:512:7: note: each undeclared identifier is reported only once for each function it appears in
/tmp/RHEL76_K3.10.0_GCC4.8.5/x86_64-native-linuxapp-gcc/17a519c90c8b4b879a147f2de71c86c4/dpdk/x86_64-native-linuxapp-gcc/include/rte_ring_generic.h:512:21: error: expected expression before ‘)’ token
      (rte_int128_t *)ring_ptr,
                     ^
/tmp/RHEL76_K3.10.0_GCC4.8.5/x86_64-native-linuxapp-gcc/17a519c90c8b4b879a147f2de71c86c4/dpdk/x86_64-native-linuxapp-gcc/include/rte_ring_generic.h:473:40: warning: variable ‘new_value’ set but not used [-Wunused-but-set-variable]
    struct rte_ring_lf_entry old_value, new_value;
                                        ^
  SYMLINK-FILE include/rte_power.h
  SYMLINK-FILE include/rte_power_empty_poll.h
make[5]: *** [rte_mempool_ops_default.o] Error 1

*Failed Build #16:
OS: FC29
Target: x86_64-native-linuxapp-gcc
  SYMLINK-FILE include/rte_power.h
In file included from /tmp/FC29_K4.20_GCC8.0.1/x86_64-native-linuxapp-gcc/17a519c90c8b4b879a147f2de71c86c4/dpdk/x86_64-native-linuxapp-gcc/include/rte_ring.h:436,
                 from /tmp/FC29_K4.20_GCC8.0.1/x86_64-native-linuxapp-gcc/17a519c90c8b4b879a147f2de71c86c4/dpdk/lib/librte_mempool/rte_mempool.h:50,
                 from /tmp/FC29_K4.20_GCC8.0.1/x86_64-native-linuxapp-gcc/17a519c90c8b4b879a147f2de71c86c4/dpdk/lib/librte_mempool/rte_mempool.c:34:
/tmp/FC29_K4.20_GCC8.0.1/x86_64-native-linuxapp-gcc/17a519c90c8b4b879a147f2de71c86c4/dpdk/x86_64-native-linuxapp-gcc/include/rte_ring_generic.h: In function ‘__rte_ring_do_lf_enqueue_mp’:
/tmp/FC29_K4.20_GCC8.0.1/x86_64-native-linuxapp-gcc/17a519c90c8b4b879a147f2de71c86c4/dpdk/x86_64-native-linuxapp-gcc/include/rte_ring_generic.h:511:14: warning: implicit declaration of function ‘rte_atomic128_cmp_exchange’; did you mean ‘rte_atomic32_exchange’? [-Wimplicit-function-declaration]
    success = rte_atomic128_cmp_exchange(
              ^~~~~~~~~~~~~~~~~~~~~~~~~~
              rte_atomic32_exchange
/tmp/FC29_K4.20_GCC8.0.1/x86_64-native-linuxapp-gcc/17a519c90c8b4b879a147f2de71c86c4/dpdk/x86_64-native-linuxapp-gcc/include/rte_ring_generic.h:511:14: warning: nested extern declaration of ‘rte_atomic128_cmp_exchange’ [-Wnested-externs]
/tmp/FC29_K4.20_GCC8.0.1/x86_64-native-linuxapp-gcc/17a519c90c8b4b879a147f2de71c86c4/dpdk/x86_64-native-linuxapp-gcc/include/rte_ring_generic.h:512:7: error: ‘rte_int128_t’ undeclared (first use in this function); did you mean ‘rte_iova_t’?
      (rte_int128_t *)ring_ptr,
       ^~~~~~~~~~~~
       rte_iova_t
/tmp/FC29_K4.20_GCC8.0.1/x86_64-native-linuxapp-gcc/17a519c90c8b4b879a147f2de71c86c4/dpdk/x86_64-native-linuxapp-gcc/include/rte_ring_generic.h:512:7: note: each undeclared identifier is reported only once for each function it appears in
/tmp/FC29_K4.20_GCC8.0.1/x86_64-native-linuxapp-gcc/17a519c90c8b4b879a147f2de71c86c4/dpdk/x86_64-native-linuxapp-gcc/include/rte_ring_generic.h:512:21: error: expected expression before ‘)’ token
      (rte_int128_t *)ring_ptr,
                     ^
/tmp/FC29_K4.20_GCC8.0.1/x86_64-native-linuxapp-gcc/17a519c90c8b4b879a147f2de71c86c4/dpdk/x86_64-native-linuxapp-gcc/include/rte_ring_generic.h:473:40: warning: variable ‘new_value’ set but not used [-Wunused-but-set-variable]
    struct rte_ring_lf_entry old_value, new_value;
                                        ^~~~~~~~~
  SYMLINK-FILE include/rte_power_empty_poll.h
  CC rte_power.o
In file included from /tmp/FC29_K4.20_GCC8.0.1/x86_64-native-linuxapp-gcc/17a519c90c8b4b879a147f2de71c86c4/dpdk/x86_64-native-linuxapp-gcc/include/rte_ring.h:436,
                 from /tmp/FC29_K4.20_GCC8.0.1/x86_64-native-linuxapp-gcc/17a519c90c8b4b879a147f2de71c86c4/dpdk/lib/librte_mempool/rte_mempool.h:50,
                 from /tmp/FC29_K4.20_GCC8.0.1/x86_64-native-linuxapp-gcc/17a519c90c8b4b879a147f2de71c86c4/dpdk/lib/librte_mempool/rte_mempool_ops.c:9:
/tmp/FC29_K4.20_GCC8.0.1/x86_64-native-linuxapp-gcc/17a519c90c8b4b879a147f2de71c86c4/dpdk/x86_64-native-linuxapp-gcc/include/rte_ring_generic.h: In function ‘__rte_ring_do_lf_enqueue_mp’:
/tmp/FC29_K4.20_GCC8.0.1/x86_64-native-linuxapp-gcc/17a519c90c8b4b879a147f2de71c86c4/dpdk/x86_64-native-linuxapp-gcc/include/rte_ring_generic.h:511:14: warning: implicit declaration of function ‘rte_atomic128_cmp_exchange’; did you mean ‘rte_atomic32_exchange’? [-Wimplicit-function-declaration]
    success = rte_atomic128_cmp_exchange(
              ^~~~~~~~~~~~~~~~~~~~~~~~~~
              rte_atomic32_exchange
/tmp/FC29_K4.20_GCC8.0.1/x86_64-native-linuxapp-gcc/17a519c90c8b4b879a147f2de71c86c4/dpdk/x86_64-native-linuxapp-gcc/include/rte_ring_generic.h:511:14: warning: nested extern declaration of ‘rte_atomic128_cmp_exchange’ [-Wnested-externs]
  CC power_acpi_cpufreq.o
/tmp/FC29_K4.20_GCC8.0.1/x86_64-native-linuxapp-gcc/17a519c90c8b4b879a147f2de71c86c4/dpdk/x86_64-native-linuxapp-gcc/include/rte_ring_generic.h:512:7: error: ‘rte_int128_t’ undeclared (first use in this function); did you mean ‘rte_iova_t’?
      (rte_int128_t *)ring_ptr,
       ^~~~~~~~~~~~
       rte_iova_t
/tmp/FC29_K4.20_GCC8.0.1/x86_64-native-linuxapp-gcc/17a519c90c8b4b879a147f2de71c86c4/dpdk/x86_64-native-linuxapp-gcc/include/rte_ring_generic.h:512:7: note: each undeclared identifier is reported only once for each function it appears in
/tmp/FC29_K4.20_GCC8.0.1/x86_64-native-linuxapp-gcc/17a519c90c8b4b879a147f2de71c86c4/dpdk/x86_64-native-linuxapp-gcc/include/rte_ring_generic.h:512:21: error: expected expression before ‘)’ token
      (rte_int128_t *)ring_ptr,
                     ^
/tmp/FC29_K4.20_GCC8.0.1/x86_64-native-linuxapp-gcc/17a519c90c8b4b879a147f2de71c86c4/dpdk/x86_64-native-linuxapp-gcc/include/rte_ring_generic.h:473:40: warning: variable ‘new_value’ set but not used [-Wunused-but-set-variable]
    struct rte_ring_lf_entry old_value, new_value;
                                        ^~~~~~~~~
In file included from /tmp/FC29_K4.20_GCC8.0.1/x86_64-native-linuxapp-gcc/17a519c90c8b4b879a147f2de71c86c4/dpdk/x86_64-native-linuxapp-gcc/include/rte_ring.h:436,
                 from /tmp/FC29_K4.20_GCC8.0.1/x86_64-native-linuxapp-gcc/17a519c90c8b4b879a147f2de71c86c4/dpdk/lib/librte_mempool/rte_mempool.h:50,
                 from /tmp/FC29_K4.20_GCC8.0.1/x86_64-native-linuxapp-gcc/17a519c90c8b4b879a147f2de71c86c4/dpdk/lib/librte_mempool/rte_mempool_ops_default.c:7:
/tmp/FC29_K4.20_GCC8.0.1/x86_64-native-linuxapp-gcc/17a519c90c8b4b879a147f2de71c86c4/dpdk/x86_64-native-linuxapp-gcc/include/rte_ring_generic.h: In function ‘__rte_ring_do_lf_enqueue_mp’:
/tmp/FC29_K4.20_GCC8.0.1/x86_64-native-linuxapp-gcc/17a519c90c8b4b879a147f2de71c86c4/dpdk/x86_64-native-linuxapp-gcc/include/rte_ring_generic.h:511:14: warning: implicit declaration of function ‘rte_atomic128_cmp_exchange’; did you mean ‘rte_atomic32_exchange’? [-Wimplicit-function-declaration]
    success = rte_atomic128_cmp_exchange(
              ^~~~~~~~~~~~~~~~~~~~~~~~~~
              rte_atomic32_exchange
/tmp/FC29_K4.20_GCC8.0.1/x86_64-native-linuxapp-gcc/17a519c90c8b4b879a147f2de71c86c4/dpdk/x86_64-native-linuxapp-gcc/include/rte_ring_generic.h:511:14: warning: nested extern declaration of ‘rte_atomic128_cmp_exchange’ [-Wnested-externs]
/tmp/FC29_K4.20_GCC8.0.1/x86_64-native-linuxapp-gcc/17a519c90c8b4b879a147f2de71c86c4/dpdk/x86_64-native-linuxapp-gcc/include/rte_ring_generic.h:512:7: error: ‘rte_int128_t’ undeclared (first use in this function); did you mean ‘rte_iova_t’?
      (rte_int128_t *)ring_ptr,
       ^~~~~~~~~~~~
       rte_iova_t
/tmp/FC29_K4.20_GCC8.0.1/x86_64-native-linuxapp-gcc/17a519c90c8b4b879a147f2de71c86c4/dpdk/x86_64-native-linuxapp-gcc/include/rte_ring_generic.h:512:7: note: each undeclared identifier is reported only once for each function it appears in
/tmp/FC29_K4.20_GCC8.0.1/x86_64-native-linuxapp-gcc/17a519c90c8b4b879a147f2de71c86c4/dpdk/x86_64-native-linuxapp-gcc/include/rte_ring_generic.h:512:21: error: expected expression before ‘)’ token
      (rte_int128_t *)ring_ptr,
                     ^
/tmp/FC29_K4.20_GCC8.0.1/x86_64-native-linuxapp-gcc/17a519c90c8b4b879a147f2de71c86c4/dpdk/x86_64-native-linuxapp-gcc/include/rte_ring_generic.h:473:40: warning: variable ‘new_value’ set but not used [-Wunused-but-set-variable]
    struct rte_ring_lf_entry old_value, new_value;
                                        ^~~~~~~~~
  CC power_kvm_vm.o
  SYMLINK-FILE include/rte_hash.h
  CC guest_channel.o

*Failed Build #17:
OS: FC29
Target: x86_64-native-linuxapp-clang
  SYMLINK-FILE include/rte_jhash.h
  SYMLINK-FILE include/rte_thash.h
In file included from /tmp/FC29_K4.20_Clang6.0.1/x86_64-native-linuxapp-clang/17a519c90c8b4b879a147f2de71c86c4/dpdk/lib/librte_mempool/rte_mempool.c:34:
In file included from /tmp/FC29_K4.20_Clang6.0.1/x86_64-native-linuxapp-clang/17a519c90c8b4b879a147f2de71c86c4/dpdk/lib/librte_mempool/rte_mempool.h:50:
In file included from /tmp/FC29_K4.20_Clang6.0.1/x86_64-native-linuxapp-clang/17a519c90c8b4b879a147f2de71c86c4/dpdk/x86_64-native-linuxapp-clang/include/rte_ring.h:436:
/tmp/FC29_K4.20_Clang6.0.1/x86_64-native-linuxapp-clang/17a519c90c8b4b879a147f2de71c86c4/dpdk/x86_64-native-linuxapp-clang/include/rte_ring_generic.h:511:14: warning: implicit declaration of function 'rte_atomic128_cmp_exchange' is invalid in C99 [-Wimplicit-function-declaration]
                        success = rte_atomic128_cmp_exchange(
                                  ^
/tmp/FC29_K4.20_Clang6.0.1/x86_64-native-linuxapp-clang/17a519c90c8b4b879a147f2de71c86c4/dpdk/x86_64-native-linuxapp-clang/include/rte_ring_generic.h:511:14: warning: this function declaration is not a prototype [-Wstrict-prototypes]
/tmp/FC29_K4.20_Clang6.0.1/x86_64-native-linuxapp-clang/17a519c90c8b4b879a147f2de71c86c4/dpdk/x86_64-native-linuxapp-clang/include/rte_ring_generic.h:512:21: error: expected expression
                                        (rte_int128_t *)ring_ptr,
                                                       ^
/tmp/FC29_K4.20_Clang6.0.1/x86_64-native-linuxapp-clang/17a519c90c8b4b879a147f2de71c86c4/dpdk/x86_64-native-linuxapp-clang/include/rte_ring_generic.h:512:7: error: use of undeclared identifier 'rte_int128_t'
                                        (rte_int128_t *)ring_ptr,
                                         ^
/tmp/FC29_K4.20_Clang6.0.1/x86_64-native-linuxapp-clang/17a519c90c8b4b879a147f2de71c86c4/dpdk/x86_64-native-linuxapp-clang/include/rte_ring_generic.h:513:21: error: expected expression
                                        (rte_int128_t *)&old_value,
                                                       ^
/tmp/FC29_K4.20_Clang6.0.1/x86_64-native-linuxapp-clang/17a519c90c8b4b879a147f2de71c86c4/dpdk/x86_64-native-linuxapp-clang/include/rte_ring_generic.h:513:7: error: use of undeclared identifier 'rte_int128_t'
                                        (rte_int128_t *)&old_value,
                                         ^
/tmp/FC29_K4.20_Clang6.0.1/x86_64-native-linuxapp-clang/17a519c90c8b4b879a147f2de71c86c4/dpdk/x86_64-native-linuxapp-clang/include/rte_ring_generic.h:514:21: error: expected expression
                                        (rte_int128_t *)&new_value,
                                                       ^
/tmp/FC29_K4.20_Clang6.0.1/x86_64-native-linuxapp-clang/17a519c90c8b4b879a147f2de71c86c4/dpdk/x86_64-native-linuxapp-clang/include/rte_ring_generic.h:514:7: error: use of undeclared identifier 'rte_int128_t'
                                        (rte_int128_t *)&new_value,
                                         ^
  SYMLINK-FILE include/rte_fbk_hash.h
  CC rte_cuckoo_hash.o
  CC cmdline_parse_etheraddr.o
  CC rte_fbk_hash.o
  CC cmdline_parse_ipaddr.o
  CC cmdline_parse_num.o
2 warnings and 6 errors generated.
make[5]: *** [/tmp/FC29_K4.20_Clang6.0.1/x86_64-native-linuxapp-clang/17a519c90c8b4b879a147f2de71c86c4/dpdk/mk/internal/rte.compile-pre.mk:116: rte_mempool.o] Error 1
make[5]: *** Waiting for unfinished jobs....
  CC rte_mempool_ops.o
  CC cmdline_parse_string.o
  CC cmdline_rdline.o
--
  CC cmdline_vt100.o
  CC rte_power_empty_poll.o
In file included from /tmp/FC29_K4.20_Clang6.0.1/x86_64-native-linuxapp-clang/17a519c90c8b4b879a147f2de71c86c4/dpdk/lib/librte_mempool/rte_mempool_ops.c:9:
In file included from /tmp/FC29_K4.20_Clang6.0.1/x86_64-native-linuxapp-clang/17a519c90c8b4b879a147f2de71c86c4/dpdk/x86_64-native-linuxapp-clang/include/rte_mempool.h:50:
In file included from /tmp/FC29_K4.20_Clang6.0.1/x86_64-native-linuxapp-clang/17a519c90c8b4b879a147f2de71c86c4/dpdk/x86_64-native-linuxapp-clang/include/rte_ring.h:436:
/tmp/FC29_K4.20_Clang6.0.1/x86_64-native-linuxapp-clang/17a519c90c8b4b879a147f2de71c86c4/dpdk/x86_64-native-linuxapp-clang/include/rte_ring_generic.h:511:14: warning: implicit declaration of function 'rte_atomic128_cmp_exchange' is invalid in C99 [-Wimplicit-function-declaration]
                        success = rte_atomic128_cmp_exchange(
                                  ^
/tmp/FC29_K4.20_Clang6.0.1/x86_64-native-linuxapp-clang/17a519c90c8b4b879a147f2de71c86c4/dpdk/x86_64-native-linuxapp-clang/include/rte_ring_generic.h:511:14: warning: this function declaration is not a prototype [-Wstrict-prototypes]
/tmp/FC29_K4.20_Clang6.0.1/x86_64-native-linuxapp-clang/17a519c90c8b4b879a147f2de71c86c4/dpdk/x86_64-native-linuxapp-clang/include/rte_ring_generic.h:512:21: error: expected expression
                                        (rte_int128_t *)ring_ptr,
                                                       ^
/tmp/FC29_K4.20_Clang6.0.1/x86_64-native-linuxapp-clang/17a519c90c8b4b879a147f2de71c86c4/dpdk/x86_64-native-linuxapp-clang/include/rte_ring_generic.h:512:7: error: use of undeclared identifier 'rte_int128_t'
                                        (rte_int128_t *)ring_ptr,
                                         ^
/tmp/FC29_K4.20_Clang6.0.1/x86_64-native-linuxapp-clang/17a519c90c8b4b879a147f2de71c86c4/dpdk/x86_64-native-linuxapp-clang/include/rte_ring_generic.h:513:21: error: expected expression
                                        (rte_int128_t *)&old_value,
                                                       ^
/tmp/FC29_K4.20_Clang6.0.1/x86_64-native-linuxapp-clang/17a519c90c8b4b879a147f2de71c86c4/dpdk/x86_64-native-linuxapp-clang/include/rte_ring_generic.h:513:7: error: use of undeclared identifier 'rte_int128_t'
                                        (rte_int128_t *)&old_value,
                                         ^
/tmp/FC29_K4.20_Clang6.0.1/x86_64-native-linuxapp-clang/17a519c90c8b4b879a147f2de71c86c4/dpdk/x86_64-native-linuxapp-clang/include/rte_ring_generic.h:514:21: error: expected expression
                                        (rte_int128_t *)&new_value,
                                                       ^
/tmp/FC29_K4.20_Clang6.0.1/x86_64-native-linuxapp-clang/17a519c90c8b4b879a147f2de71c86c4/dpdk/x86_64-native-linuxapp-clang/include/rte_ring_generic.h:514:7: error: use of undeclared identifier 'rte_int128_t'
                                        (rte_int128_t *)&new_value,
                                         ^
  AR librte_acl.a
  INSTALL-LIB librte_acl.a
  CC cmdline_socket.o
  CC power_pstate_cpufreq.o
  CC cmdline_parse_portlist.o
2 warnings and 6 errors generated.
make[5]: *** [/tmp/FC29_K4.20_Clang6.0.1/x86_64-native-linuxapp-clang/17a519c90c8b4b879a147f2de71c86c4/dpdk/mk/internal/rte.compile-pre.mk:116: rte_mempool_ops.o] Error 1
make[4]: *** [/tmp/FC29_K4.20_Clang6.0.1/x86_64-native-linuxapp-clang/17a519c90c8b4b879a147f2de71c86c4/dpdk/mk/rte.subdir.mk:35: librte_mempool] Error 2
make[4]: *** Waiting for unfinished jobs....
  AR librte_cmdline.a
  INSTALL-LIB librte_cmdline.a

*Failed Build #18:
OS: FC29
Target: x86_64-native-linuxapp-icc
  CC power_pstate_cpufreq.o
  SYMLINK-FILE include/rte_hash.h
In file included from /tmp/FC29_K4.20_ICC19.0.0/x86_64-native-linuxapp-icc/17a519c90c8b4b879a147f2de71c86c4/dpdk/x86_64-native-linuxapp-icc/include/rte_ring.h(436),
                 from /tmp/FC29_K4.20_ICC19.0.0/x86_64-native-linuxapp-icc/17a519c90c8b4b879a147f2de71c86c4/dpdk/lib/librte_mempool/rte_mempool.h(50),
                 from /tmp/FC29_K4.20_ICC19.0.0/x86_64-native-linuxapp-icc/17a519c90c8b4b879a147f2de71c86c4/dpdk/lib/librte_mempool/rte_mempool.c(34):
/tmp/FC29_K4.20_ICC19.0.0/x86_64-native-linuxapp-icc/17a519c90c8b4b879a147f2de71c86c4/dpdk/x86_64-native-linuxapp-icc/include/rte_ring_generic.h(511): warning #266: function "rte_atomic128_cmp_exchange" declared implicitly
  			success = rte_atomic128_cmp_exchange(
  			          ^

In file included from /tmp/FC29_K4.20_ICC19.0.0/x86_64-native-linuxapp-icc/17a519c90c8b4b879a147f2de71c86c4/dpdk/x86_64-native-linuxapp-icc/include/rte_ring.h(436),
                 from /tmp/FC29_K4.20_ICC19.0.0/x86_64-native-linuxapp-icc/17a519c90c8b4b879a147f2de71c86c4/dpdk/lib/librte_mempool/rte_mempool.h(50),
                 from /tmp/FC29_K4.20_ICC19.0.0/x86_64-native-linuxapp-icc/17a519c90c8b4b879a147f2de71c86c4/dpdk/lib/librte_mempool/rte_mempool.c(34):
/tmp/FC29_K4.20_ICC19.0.0/x86_64-native-linuxapp-icc/17a519c90c8b4b879a147f2de71c86c4/dpdk/x86_64-native-linuxapp-icc/include/rte_ring_generic.h(512): error: identifier "rte_int128_t" is undefined
  					(rte_int128_t *)ring_ptr,
  					 ^

In file included from /tmp/FC29_K4.20_ICC19.0.0/x86_64-native-linuxapp-icc/17a519c90c8b4b879a147f2de71c86c4/dpdk/x86_64-native-linuxapp-icc/include/rte_ring.h(436),
                 from /tmp/FC29_K4.20_ICC19.0.0/x86_64-native-linuxapp-icc/17a519c90c8b4b879a147f2de71c86c4/dpdk/lib/librte_mempool/rte_mempool.h(50),
                 from /tmp/FC29_K4.20_ICC19.0.0/x86_64-native-linuxapp-icc/17a519c90c8b4b879a147f2de71c86c4/dpdk/lib/librte_mempool/rte_mempool.c(34):
/tmp/FC29_K4.20_ICC19.0.0/x86_64-native-linuxapp-icc/17a519c90c8b4b879a147f2de71c86c4/dpdk/x86_64-native-linuxapp-icc/include/rte_ring_generic.h(512): error: expected an expression
  					(rte_int128_t *)ring_ptr,
  					               ^

In file included from /tmp/FC29_K4.20_ICC19.0.0/x86_64-native-linuxapp-icc/17a519c90c8b4b879a147f2de71c86c4/dpdk/x86_64-native-linuxapp-icc/include/rte_ring.h(436),
                 from /tmp/FC29_K4.20_ICC19.0.0/x86_64-native-linuxapp-icc/17a519c90c8b4b879a147f2de71c86c4/dpdk/lib/librte_mempool/rte_mempool.h(50),
                 from /tmp/FC29_K4.20_ICC19.0.0/x86_64-native-linuxapp-icc/17a519c90c8b4b879a147f2de71c86c4/dpdk/lib/librte_mempool/rte_mempool.c(34):
/tmp/FC29_K4.20_ICC19.0.0/x86_64-native-linuxapp-icc/17a519c90c8b4b879a147f2de71c86c4/dpdk/x86_64-native-linuxapp-icc/include/rte_ring_generic.h(512): error: expected a ")"
  					(rte_int128_t *)ring_ptr,
  					                ^

In file included from /tmp/FC29_K4.20_ICC19.0.0/x86_64-native-linuxapp-icc/17a519c90c8b4b879a147f2de71c86c4/dpdk/x86_64-native-linuxapp-icc/include/rte_ring.h(436),
                 from /tmp/FC29_K4.20_ICC19.0.0/x86_64-native-linuxapp-icc/17a519c90c8b4b879a147f2de71c86c4/dpdk/lib/librte_mempool/rte_mempool.h(50),
                 from /tmp/FC29_K4.20_ICC19.0.0/x86_64-native-linuxapp-icc/17a519c90c8b4b879a147f2de71c86c4/dpdk/lib/librte_mempool/rte_mempool.c(34):
/tmp/FC29_K4.20_ICC19.0.0/x86_64-native-linuxapp-icc/17a519c90c8b4b879a147f2de71c86c4/dpdk/x86_64-native-linuxapp-icc/include/rte_ring_generic.h(516): warning #12: parsing restarts here after previous syntax error
  					__ATOMIC_RELAXED);
  					                ^

compilation aborted for /tmp/FC29_K4.20_ICC19.0.0/x86_64-native-linuxapp-icc/17a519c90c8b4b879a147f2de71c86c4/dpdk/lib/librte_mempool/rte_mempool.c (code 2)
make[5]: *** [/tmp/FC29_K4.20_ICC19.0.0/x86_64-native-linuxapp-icc/17a519c90c8b4b879a147f2de71c86c4/dpdk/mk/internal/rte.compile-pre.mk:116: rte_mempool.o] Error 2
--
  SYMLINK-FILE include/rte_hash_crc.h
  SYMLINK-FILE include/rte_jhash.h
In file included from /tmp/FC29_K4.20_ICC19.0.0/x86_64-native-linuxapp-icc/17a519c90c8b4b879a147f2de71c86c4/dpdk/x86_64-native-linuxapp-icc/include/rte_ring.h(436),
                 from /tmp/FC29_K4.20_ICC19.0.0/x86_64-native-linuxapp-icc/17a519c90c8b4b879a147f2de71c86c4/dpdk/x86_64-native-linuxapp-icc/include/rte_mempool.h(50),
                 from /tmp/FC29_K4.20_ICC19.0.0/x86_64-native-linuxapp-icc/17a519c90c8b4b879a147f2de71c86c4/dpdk/lib/librte_mempool/rte_mempool_ops.c(9):
/tmp/FC29_K4.20_ICC19.0.0/x86_64-native-linuxapp-icc/17a519c90c8b4b879a147f2de71c86c4/dpdk/x86_64-native-linuxapp-icc/include/rte_ring_generic.h(511): warning #266: function "rte_atomic128_cmp_exchange" declared implicitly
  			success = rte_atomic128_cmp_exchange(
  			          ^

In file included from /tmp/FC29_K4.20_ICC19.0.0/x86_64-native-linuxapp-icc/17a519c90c8b4b879a147f2de71c86c4/dpdk/x86_64-native-linuxapp-icc/include/rte_ring.h(436),
                 from /tmp/FC29_K4.20_ICC19.0.0/x86_64-native-linuxapp-icc/17a519c90c8b4b879a147f2de71c86c4/dpdk/x86_64-native-linuxapp-icc/include/rte_mempool.h(50),
                 from /tmp/FC29_K4.20_ICC19.0.0/x86_64-native-linuxapp-icc/17a519c90c8b4b879a147f2de71c86c4/dpdk/lib/librte_mempool/rte_mempool_ops.c(9):
/tmp/FC29_K4.20_ICC19.0.0/x86_64-native-linuxapp-icc/17a519c90c8b4b879a147f2de71c86c4/dpdk/x86_64-native-linuxapp-icc/include/rte_ring_generic.h(512): error: identifier "rte_int128_t" is undefined
  					(rte_int128_t *)ring_ptr,
  					 ^

In file included from /tmp/FC29_K4.20_ICC19.0.0/x86_64-native-linuxapp-icc/17a519c90c8b4b879a147f2de71c86c4/dpdk/x86_64-native-linuxapp-icc/include/rte_ring.h(436),
                 from /tmp/FC29_K4.20_ICC19.0.0/x86_64-native-linuxapp-icc/17a519c90c8b4b879a147f2de71c86c4/dpdk/x86_64-native-linuxapp-icc/include/rte_mempool.h(50),
                 from /tmp/FC29_K4.20_ICC19.0.0/x86_64-native-linuxapp-icc/17a519c90c8b4b879a147f2de71c86c4/dpdk/lib/librte_mempool/rte_mempool_ops.c(9):
/tmp/FC29_K4.20_ICC19.0.0/x86_64-native-linuxapp-icc/17a519c90c8b4b879a147f2de71c86c4/dpdk/x86_64-native-linuxapp-icc/include/rte_ring_generic.h(512): error: expected an expression
  					(rte_int128_t *)ring_ptr,
  					               ^

In file included from /tmp/FC29_K4.20_ICC19.0.0/x86_64-native-linuxapp-icc/17a519c90c8b4b879a147f2de71c86c4/dpdk/x86_64-native-linuxapp-icc/include/rte_ring.h(436),
                 from /tmp/FC29_K4.20_ICC19.0.0/x86_64-native-linuxapp-icc/17a519c90c8b4b879a147f2de71c86c4/dpdk/x86_64-native-linuxapp-icc/include/rte_mempool.h(50),
                 from /tmp/FC29_K4.20_ICC19.0.0/x86_64-native-linuxapp-icc/17a519c90c8b4b879a147f2de71c86c4/dpdk/lib/librte_mempool/rte_mempool_ops.c(9):
/tmp/FC29_K4.20_ICC19.0.0/x86_64-native-linuxapp-icc/17a519c90c8b4b879a147f2de71c86c4/dpdk/x86_64-native-linuxapp-icc/include/rte_ring_generic.h(512): error: expected a ")"
  					(rte_int128_t *)ring_ptr,
  					                ^

In file included from /tmp/FC29_K4.20_ICC19.0.0/x86_64-native-linuxapp-icc/17a519c90c8b4b879a147f2de71c86c4/dpdk/x86_64-native-linuxapp-icc/include/rte_ring.h(436),
                 from /tmp/FC29_K4.20_ICC19.0.0/x86_64-native-linuxapp-icc/17a519c90c8b4b879a147f2de71c86c4/dpdk/x86_64-native-linuxapp-icc/include/rte_mempool.h(50),
                 from /tmp/FC29_K4.20_ICC19.0.0/x86_64-native-linuxapp-icc/17a519c90c8b4b879a147f2de71c86c4/dpdk/lib/librte_mempool/rte_mempool_ops.c(9):
/tmp/FC29_K4.20_ICC19.0.0/x86_64-native-linuxapp-icc/17a519c90c8b4b879a147f2de71c86c4/dpdk/x86_64-native-linuxapp-icc/include/rte_ring_generic.h(516): warning #12: parsing restarts here after previous syntax error
  					__ATOMIC_RELAXED);
  					                ^

compilation aborted for /tmp/FC29_K4.20_ICC19.0.0/x86_64-native-linuxapp-icc/17a519c90c8b4b879a147f2de71c86c4/dpdk/lib/librte_mempool/rte_mempool_ops.c (code 2)
make[5]: *** [/tmp/FC29_K4.20_ICC19.0.0/x86_64-native-linuxapp-icc/17a519c90c8b4b879a147f2de71c86c4/dpdk/mk/internal/rte.compile-pre.mk:116: rte_mempool_ops.o] Error 2

*Failed Build #19:
OS: CENTOS74
Target: x86_64-native-linuxapp-gcc
  CC power_acpi_cpufreq.o
In file included from /tmp/CENTOS74_K3.10.0_GCC4.8.5/x86_64-native-linuxapp-gcc/17a519c90c8b4b879a147f2de71c86c4/dpdk/x86_64-native-linuxapp-gcc/include/rte_ring.h:436:0,
                 from /tmp/CENTOS74_K3.10.0_GCC4.8.5/x86_64-native-linuxapp-gcc/17a519c90c8b4b879a147f2de71c86c4/dpdk/lib/librte_mempool/rte_mempool.h:50,
                 from /tmp/CENTOS74_K3.10.0_GCC4.8.5/x86_64-native-linuxapp-gcc/17a519c90c8b4b879a147f2de71c86c4/dpdk/lib/librte_mempool/rte_mempool.c:34:
/tmp/CENTOS74_K3.10.0_GCC4.8.5/x86_64-native-linuxapp-gcc/17a519c90c8b4b879a147f2de71c86c4/dpdk/x86_64-native-linuxapp-gcc/include/rte_ring_generic.h: In function ‘__rte_ring_do_lf_enqueue_mp’:
/tmp/CENTOS74_K3.10.0_GCC4.8.5/x86_64-native-linuxapp-gcc/17a519c90c8b4b879a147f2de71c86c4/dpdk/x86_64-native-linuxapp-gcc/include/rte_ring_generic.h:511:4: warning: implicit declaration of function ‘rte_atomic128_cmp_exchange’ [-Wimplicit-function-declaration]
    success = rte_atomic128_cmp_exchange(
    ^
/tmp/CENTOS74_K3.10.0_GCC4.8.5/x86_64-native-linuxapp-gcc/17a519c90c8b4b879a147f2de71c86c4/dpdk/x86_64-native-linuxapp-gcc/include/rte_ring_generic.h:511:4: warning: nested extern declaration of ‘rte_atomic128_cmp_exchange’ [-Wnested-externs]
/tmp/CENTOS74_K3.10.0_GCC4.8.5/x86_64-native-linuxapp-gcc/17a519c90c8b4b879a147f2de71c86c4/dpdk/x86_64-native-linuxapp-gcc/include/rte_ring_generic.h:512:7: error: ‘rte_int128_t’ undeclared (first use in this function)
      (rte_int128_t *)ring_ptr,
       ^
/tmp/CENTOS74_K3.10.0_GCC4.8.5/x86_64-native-linuxapp-gcc/17a519c90c8b4b879a147f2de71c86c4/dpdk/x86_64-native-linuxapp-gcc/include/rte_ring_generic.h:512:7: note: each undeclared identifier is reported only once for each function it appears in
/tmp/CENTOS74_K3.10.0_GCC4.8.5/x86_64-native-linuxapp-gcc/17a519c90c8b4b879a147f2de71c86c4/dpdk/x86_64-native-linuxapp-gcc/include/rte_ring_generic.h:512:21: error: expected expression before ‘)’ token
      (rte_int128_t *)ring_ptr,
                     ^
/tmp/CENTOS74_K3.10.0_GCC4.8.5/x86_64-native-linuxapp-gcc/17a519c90c8b4b879a147f2de71c86c4/dpdk/x86_64-native-linuxapp-gcc/include/rte_ring_generic.h:473:40: warning: variable ‘new_value’ set but not used [-Wunused-but-set-variable]
    struct rte_ring_lf_entry old_value, new_value;
                                        ^
make[5]: *** [rte_mempool.o] Error 1
make[4]: *** [librte_mempool] Error 2
make[4]: *** Waiting for unfinished jobs....

*Failed Build #20:
OS: RHEL74
Target: x86_64-native-linuxapp-gcc
  CC power_acpi_cpufreq.o
In file included from /tmp/RHEL74_K3.10.0_GCC4.8.5/x86_64-native-linuxapp-gcc/17a519c90c8b4b879a147f2de71c86c4/dpdk/x86_64-native-linuxapp-gcc/include/rte_ring.h:436:0,
                 from /tmp/RHEL74_K3.10.0_GCC4.8.5/x86_64-native-linuxapp-gcc/17a519c90c8b4b879a147f2de71c86c4/dpdk/x86_64-native-linuxapp-gcc/include/rte_mempool.h:50,
                 from /tmp/RHEL74_K3.10.0_GCC4.8.5/x86_64-native-linuxapp-gcc/17a519c90c8b4b879a147f2de71c86c4/dpdk/lib/librte_mempool/rte_mempool_ops.c:9:
/tmp/RHEL74_K3.10.0_GCC4.8.5/x86_64-native-linuxapp-gcc/17a519c90c8b4b879a147f2de71c86c4/dpdk/x86_64-native-linuxapp-gcc/include/rte_ring_generic.h: In function ‘__rte_ring_do_lf_enqueue_mp’:
/tmp/RHEL74_K3.10.0_GCC4.8.5/x86_64-native-linuxapp-gcc/17a519c90c8b4b879a147f2de71c86c4/dpdk/x86_64-native-linuxapp-gcc/include/rte_ring_generic.h:511:4: warning: implicit declaration of function ‘rte_atomic128_cmp_exchange’ [-Wimplicit-function-declaration]
    success = rte_atomic128_cmp_exchange(
    ^
/tmp/RHEL74_K3.10.0_GCC4.8.5/x86_64-native-linuxapp-gcc/17a519c90c8b4b879a147f2de71c86c4/dpdk/x86_64-native-linuxapp-gcc/include/rte_ring_generic.h:511:4: warning: nested extern declaration of ‘rte_atomic128_cmp_exchange’ [-Wnested-externs]
/tmp/RHEL74_K3.10.0_GCC4.8.5/x86_64-native-linuxapp-gcc/17a519c90c8b4b879a147f2de71c86c4/dpdk/x86_64-native-linuxapp-gcc/include/rte_ring_generic.h:512:7: error: ‘rte_int128_t’ undeclared (first use in this function)
      (rte_int128_t *)ring_ptr,
       ^
/tmp/RHEL74_K3.10.0_GCC4.8.5/x86_64-native-linuxapp-gcc/17a519c90c8b4b879a147f2de71c86c4/dpdk/x86_64-native-linuxapp-gcc/include/rte_ring_generic.h:512:7: note: each undeclared identifier is reported only once for each function it appears in
/tmp/RHEL74_K3.10.0_GCC4.8.5/x86_64-native-linuxapp-gcc/17a519c90c8b4b879a147f2de71c86c4/dpdk/x86_64-native-linuxapp-gcc/include/rte_ring_generic.h:512:21: error: expected expression before ‘)’ token
      (rte_int128_t *)ring_ptr,
                     ^
/tmp/RHEL74_K3.10.0_GCC4.8.5/x86_64-native-linuxapp-gcc/17a519c90c8b4b879a147f2de71c86c4/dpdk/x86_64-native-linuxapp-gcc/include/rte_ring_generic.h:473:40: warning: variable ‘new_value’ set but not used [-Wunused-but-set-variable]
    struct rte_ring_lf_entry old_value, new_value;
                                        ^
In file included from /tmp/RHEL74_K3.10.0_GCC4.8.5/x86_64-native-linuxapp-gcc/17a519c90c8b4b879a147f2de71c86c4/dpdk/x86_64-native-linuxapp-gcc/include/rte_ring.h:436:0,
                 from /tmp/RHEL74_K3.10.0_GCC4.8.5/x86_64-native-linuxapp-gcc/17a519c90c8b4b879a147f2de71c86c4/dpdk/lib/librte_mempool/rte_mempool.h:50,
                 from /tmp/RHEL74_K3.10.0_GCC4.8.5/x86_64-native-linuxapp-gcc/17a519c90c8b4b879a147f2de71c86c4/dpdk/lib/librte_mempool/rte_mempool.c:34:
/tmp/RHEL74_K3.10.0_GCC4.8.5/x86_64-native-linuxapp-gcc/17a519c90c8b4b879a147f2de71c86c4/dpdk/x86_64-native-linuxapp-gcc/include/rte_ring_generic.h: In function ‘__rte_ring_do_lf_enqueue_mp’:
/tmp/RHEL74_K3.10.0_GCC4.8.5/x86_64-native-linuxapp-gcc/17a519c90c8b4b879a147f2de71c86c4/dpdk/x86_64-native-linuxapp-gcc/include/rte_ring_generic.h:511:4: warning: implicit declaration of function ‘rte_atomic128_cmp_exchange’ [-Wimplicit-function-declaration]
    success = rte_atomic128_cmp_exchange(
    ^
/tmp/RHEL74_K3.10.0_GCC4.8.5/x86_64-native-linuxapp-gcc/17a519c90c8b4b879a147f2de71c86c4/dpdk/x86_64-native-linuxapp-gcc/include/rte_ring_generic.h:511:4: warning: nested extern declaration of ‘rte_atomic128_cmp_exchange’ [-Wnested-externs]
/tmp/RHEL74_K3.10.0_GCC4.8.5/x86_64-native-linuxapp-gcc/17a519c90c8b4b879a147f2de71c86c4/dpdk/x86_64-native-linuxapp-gcc/include/rte_ring_generic.h:512:7: error: ‘rte_int128_t’ undeclared (first use in this function)
      (rte_int128_t *)ring_ptr,
       ^
/tmp/RHEL74_K3.10.0_GCC4.8.5/x86_64-native-linuxapp-gcc/17a519c90c8b4b879a147f2de71c86c4/dpdk/x86_64-native-linuxapp-gcc/include/rte_ring_generic.h:512:7: note: each undeclared identifier is reported only once for each function it appears in
/tmp/RHEL74_K3.10.0_GCC4.8.5/x86_64-native-linuxapp-gcc/17a519c90c8b4b879a147f2de71c86c4/dpdk/x86_64-native-linuxapp-gcc/include/rte_ring_generic.h:512:21: error: expected expression before ‘)’ token
      (rte_int128_t *)ring_ptr,
                     ^
/tmp/RHEL74_K3.10.0_GCC4.8.5/x86_64-native-linuxapp-gcc/17a519c90c8b4b879a147f2de71c86c4/dpdk/x86_64-native-linuxapp-gcc/include/rte_ring_generic.h:473:40: warning: variable ‘new_value’ set but not used [-Wunused-but-set-variable]
    struct rte_ring_lf_entry old_value, new_value;
                                        ^
In file included from /tmp/RHEL74_K3.10.0_GCC4.8.5/x86_64-native-linuxapp-gcc/17a519c90c8b4b879a147f2de71c86c4/dpdk/x86_64-native-linuxapp-gcc/include/rte_ring.h:436:0,
                 from /tmp/RHEL74_K3.10.0_GCC4.8.5/x86_64-native-linuxapp-gcc/17a519c90c8b4b879a147f2de71c86c4/dpdk/x86_64-native-linuxapp-gcc/include/rte_mempool.h:50,
                 from /tmp/RHEL74_K3.10.0_GCC4.8.5/x86_64-native-linuxapp-gcc/17a519c90c8b4b879a147f2de71c86c4/dpdk/lib/librte_mempool/rte_mempool_ops_default.c:7:
/tmp/RHEL74_K3.10.0_GCC4.8.5/x86_64-native-linuxapp-gcc/17a519c90c8b4b879a147f2de71c86c4/dpdk/x86_64-native-linuxapp-gcc/include/rte_ring_generic.h: In function ‘__rte_ring_do_lf_enqueue_mp’:
/tmp/RHEL74_K3.10.0_GCC4.8.5/x86_64-native-linuxapp-gcc/17a519c90c8b4b879a147f2de71c86c4/dpdk/x86_64-native-linuxapp-gcc/include/rte_ring_generic.h:511:4: warning: implicit declaration of function ‘rte_atomic128_cmp_exchange’ [-Wimplicit-function-declaration]
    success = rte_atomic128_cmp_exchange(
    ^
/tmp/RHEL74_K3.10.0_GCC4.8.5/x86_64-native-linuxapp-gcc/17a519c90c8b4b879a147f2de71c86c4/dpdk/x86_64-native-linuxapp-gcc/include/rte_ring_generic.h:511:4: warning: nested extern declaration of ‘rte_atomic128_cmp_exchange’ [-Wnested-externs]
/tmp/RHEL74_K3.10.0_GCC4.8.5/x86_64-native-linuxapp-gcc/17a519c90c8b4b879a147f2de71c86c4/dpdk/x86_64-native-linuxapp-gcc/include/rte_ring_generic.h:512:7: error: ‘rte_int128_t’ undeclared (first use in this function)
      (rte_int128_t *)ring_ptr,
       ^
/tmp/RHEL74_K3.10.0_GCC4.8.5/x86_64-native-linuxapp-gcc/17a519c90c8b4b879a147f2de71c86c4/dpdk/x86_64-native-linuxapp-gcc/include/rte_ring_generic.h:512:7: note: each undeclared identifier is reported only once for each function it appears in
/tmp/RHEL74_K3.10.0_GCC4.8.5/x86_64-native-linuxapp-gcc/17a519c90c8b4b879a147f2de71c86c4/dpdk/x86_64-native-linuxapp-gcc/include/rte_ring_generic.h:512:21: error: expected expression before ‘)’ token
      (rte_int128_t *)ring_ptr,
                     ^
/tmp/RHEL74_K3.10.0_GCC4.8.5/x86_64-native-linuxapp-gcc/17a519c90c8b4b879a147f2de71c86c4/dpdk/x86_64-native-linuxapp-gcc/include/rte_ring_generic.h:473:40: warning: variable ‘new_value’ set but not used [-Wunused-but-set-variable]
    struct rte_ring_lf_entry old_value, new_value;
                                        ^
  CC power_kvm_vm.o
make[5]: *** [rte_mempool_ops.o] Error 1
make[5]: *** Waiting for unfinished jobs....

*Failed Build #21:
OS: CENTOS75
Target: x86_64-native-linuxapp-gcc
  CC rte_mempool_ops.o
In file included from /tmp/CENTOS75_K3.10.0_GCC4.8.5/x86_64-native-linuxapp-gcc/17a519c90c8b4b879a147f2de71c86c4/dpdk/x86_64-native-linuxapp-gcc/include/rte_ring.h:436:0,
                 from /tmp/CENTOS75_K3.10.0_GCC4.8.5/x86_64-native-linuxapp-gcc/17a519c90c8b4b879a147f2de71c86c4/dpdk/lib/librte_mempool/rte_mempool.h:50,
                 from /tmp/CENTOS75_K3.10.0_GCC4.8.5/x86_64-native-linuxapp-gcc/17a519c90c8b4b879a147f2de71c86c4/dpdk/lib/librte_mempool/rte_mempool.c:34:
/tmp/CENTOS75_K3.10.0_GCC4.8.5/x86_64-native-linuxapp-gcc/17a519c90c8b4b879a147f2de71c86c4/dpdk/x86_64-native-linuxapp-gcc/include/rte_ring_generic.h: In function ‘__rte_ring_do_lf_enqueue_mp’:
/tmp/CENTOS75_K3.10.0_GCC4.8.5/x86_64-native-linuxapp-gcc/17a519c90c8b4b879a147f2de71c86c4/dpdk/x86_64-native-linuxapp-gcc/include/rte_ring_generic.h:511:4: warning: implicit declaration of function ‘rte_atomic128_cmp_exchange’ [-Wimplicit-function-declaration]
    success = rte_atomic128_cmp_exchange(
    ^
/tmp/CENTOS75_K3.10.0_GCC4.8.5/x86_64-native-linuxapp-gcc/17a519c90c8b4b879a147f2de71c86c4/dpdk/x86_64-native-linuxapp-gcc/include/rte_ring_generic.h:511:4: warning: nested extern declaration of ‘rte_atomic128_cmp_exchange’ [-Wnested-externs]
/tmp/CENTOS75_K3.10.0_GCC4.8.5/x86_64-native-linuxapp-gcc/17a519c90c8b4b879a147f2de71c86c4/dpdk/x86_64-native-linuxapp-gcc/include/rte_ring_generic.h:512:7: error: ‘rte_int128_t’ undeclared (first use in this function)
      (rte_int128_t *)ring_ptr,
       ^
/tmp/CENTOS75_K3.10.0_GCC4.8.5/x86_64-native-linuxapp-gcc/17a519c90c8b4b879a147f2de71c86c4/dpdk/x86_64-native-linuxapp-gcc/include/rte_ring_generic.h:512:7: note: each undeclared identifier is reported only once for each function it appears in
/tmp/CENTOS75_K3.10.0_GCC4.8.5/x86_64-native-linuxapp-gcc/17a519c90c8b4b879a147f2de71c86c4/dpdk/x86_64-native-linuxapp-gcc/include/rte_ring_generic.h:512:21: error: expected expression before ‘)’ token
      (rte_int128_t *)ring_ptr,
                     ^
/tmp/CENTOS75_K3.10.0_GCC4.8.5/x86_64-native-linuxapp-gcc/17a519c90c8b4b879a147f2de71c86c4/dpdk/x86_64-native-linuxapp-gcc/include/rte_ring_generic.h:473:40: warning: variable ‘new_value’ set but not used [-Wunused-but-set-variable]
    struct rte_ring_lf_entry old_value, new_value;
                                        ^
  CC rte_mempool_ops_default.o
  AR librte_acl.a
  CC power_kvm_vm.o
--
/tmp/CENTOS75_K3.10.0_GCC4.8.5/x86_64-native-linuxapp-gcc/17a519c90c8b4b879a147f2de71c86c4/dpdk/x86_64-native-linuxapp-gcc/include/rte_ring_generic.h: In function ‘__rte_ring_do_lf_enqueue_mp’:
In file included from /tmp/CENTOS75_K3.10.0_GCC4.8.5/x86_64-native-linuxapp-gcc/17a519c90c8b4b879a147f2de71c86c4/dpdk/x86_64-native-linuxapp-gcc/include/rte_ring.h:436:0,
                 from /tmp/CENTOS75_K3.10.0_GCC4.8.5/x86_64-native-linuxapp-gcc/17a519c90c8b4b879a147f2de71c86c4/dpdk/x86_64-native-linuxapp-gcc/include/rte_mempool.h:50,
                 from /tmp/CENTOS75_K3.10.0_GCC4.8.5/x86_64-native-linuxapp-gcc/17a519c90c8b4b879a147f2de71c86c4/dpdk/lib/librte_mempool/rte_mempool_ops.c:9:
/tmp/CENTOS75_K3.10.0_GCC4.8.5/x86_64-native-linuxapp-gcc/17a519c90c8b4b879a147f2de71c86c4/dpdk/x86_64-native-linuxapp-gcc/include/rte_ring_generic.h: In function ‘__rte_ring_do_lf_enqueue_mp’:
/tmp/CENTOS75_K3.10.0_GCC4.8.5/x86_64-native-linuxapp-gcc/17a519c90c8b4b879a147f2de71c86c4/dpdk/x86_64-native-linuxapp-gcc/include/rte_ring_generic.h:511:4: warning: implicit declaration of function ‘rte_atomic128_cmp_exchange’ [-Wimplicit-function-declaration]
    success = rte_atomic128_cmp_exchange(
    ^
/tmp/CENTOS75_K3.10.0_GCC4.8.5/x86_64-native-linuxapp-gcc/17a519c90c8b4b879a147f2de71c86c4/dpdk/x86_64-native-linuxapp-gcc/include/rte_ring_generic.h:511:4: warning: nested extern declaration of ‘rte_atomic128_cmp_exchange’ [-Wnested-externs]
/tmp/CENTOS75_K3.10.0_GCC4.8.5/x86_64-native-linuxapp-gcc/17a519c90c8b4b879a147f2de71c86c4/dpdk/x86_64-native-linuxapp-gcc/include/rte_ring_generic.h:512:7: error: ‘rte_int128_t’ undeclared (first use in this function)
      (rte_int128_t *)ring_ptr,
       ^
/tmp/CENTOS75_K3.10.0_GCC4.8.5/x86_64-native-linuxapp-gcc/17a519c90c8b4b879a147f2de71c86c4/dpdk/x86_64-native-linuxapp-gcc/include/rte_ring_generic.h:512:7: note: each undeclared identifier is reported only once for each function it appears in
/tmp/CENTOS75_K3.10.0_GCC4.8.5/x86_64-native-linuxapp-gcc/17a519c90c8b4b879a147f2de71c86c4/dpdk/x86_64-native-linuxapp-gcc/include/rte_ring_generic.h:512:21: error: expected expression before ‘)’ token
      (rte_int128_t *)ring_ptr,
                     ^
/tmp/CENTOS75_K3.10.0_GCC4.8.5/x86_64-native-linuxapp-gcc/17a519c90c8b4b879a147f2de71c86c4/dpdk/x86_64-native-linuxapp-gcc/include/rte_ring_generic.h:473:40: warning: variable ‘new_value’ set but not used [-Wunused-but-set-variable]
    struct rte_ring_lf_entry old_value, new_value;
                                        ^
/tmp/CENTOS75_K3.10.0_GCC4.8.5/x86_64-native-linuxapp-gcc/17a519c90c8b4b879a147f2de71c86c4/dpdk/x86_64-native-linuxapp-gcc/include/rte_ring_generic.h:511:4: warning: implicit declaration of function ‘rte_atomic128_cmp_exchange’ [-Wimplicit-function-declaration]
    success = rte_atomic128_cmp_exchange(
    ^
/tmp/CENTOS75_K3.10.0_GCC4.8.5/x86_64-native-linuxapp-gcc/17a519c90c8b4b879a147f2de71c86c4/dpdk/x86_64-native-linuxapp-gcc/include/rte_ring_generic.h:511:4: warning: nested extern declaration of ‘rte_atomic128_cmp_exchange’ [-Wnested-externs]
/tmp/CENTOS75_K3.10.0_GCC4.8.5/x86_64-native-linuxapp-gcc/17a519c90c8b4b879a147f2de71c86c4/dpdk/x86_64-native-linuxapp-gcc/include/rte_ring_generic.h:512:7: error: ‘rte_int128_t’ undeclared (first use in this function)
      (rte_int128_t *)ring_ptr,
       ^
/tmp/CENTOS75_K3.10.0_GCC4.8.5/x86_64-native-linuxapp-gcc/17a519c90c8b4b879a147f2de71c86c4/dpdk/x86_64-native-linuxapp-gcc/include/rte_ring_generic.h:512:7: note: each undeclared identifier is reported only once for each function it appears in
/tmp/CENTOS75_K3.10.0_GCC4.8.5/x86_64-native-linuxapp-gcc/17a519c90c8b4b879a147f2de71c86c4/dpdk/x86_64-native-linuxapp-gcc/include/rte_ring_generic.h:512:21: error: expected expression before ‘)’ token
      (rte_int128_t *)ring_ptr,
                     ^
/tmp/CENTOS75_K3.10.0_GCC4.8.5/x86_64-native-linuxapp-gcc/17a519c90c8b4b879a147f2de71c86c4/dpdk/x86_64-native-linuxapp-gcc/include/rte_ring_generic.h:473:40: warning: variable ‘new_value’ set but not used [-Wunused-but-set-variable]
    struct rte_ring_lf_entry old_value, new_value;
                                        ^
  CC rte_power_empty_poll.o
make[5]: *** [rte_mempool_ops_default.o] Error 1
  AR librte_cmdline.a

*Failed Build #22:
OS: FC28
Target: x86_64-native-linuxapp-icc
  CC rte_cuckoo_hash.o
  CC rte_fbk_hash.o
In file included from /tmp/FC28_K4.16.3_ICC19.0.0/x86_64-native-linuxapp-icc/17a519c90c8b4b879a147f2de71c86c4/dpdk/x86_64-native-linuxapp-icc/include/rte_ring.h(436),
                 from /tmp/FC28_K4.16.3_ICC19.0.0/x86_64-native-linuxapp-icc/17a519c90c8b4b879a147f2de71c86c4/dpdk/lib/librte_mempool/rte_mempool.h(50),
                 from /tmp/FC28_K4.16.3_ICC19.0.0/x86_64-native-linuxapp-icc/17a519c90c8b4b879a147f2de71c86c4/dpdk/lib/librte_mempool/rte_mempool.c(34):
/tmp/FC28_K4.16.3_ICC19.0.0/x86_64-native-linuxapp-icc/17a519c90c8b4b879a147f2de71c86c4/dpdk/x86_64-native-linuxapp-icc/include/rte_ring_generic.h(511): warning #266: function "rte_atomic128_cmp_exchange" declared implicitly
  			success = rte_atomic128_cmp_exchange(
  			          ^

In file included from /tmp/FC28_K4.16.3_ICC19.0.0/x86_64-native-linuxapp-icc/17a519c90c8b4b879a147f2de71c86c4/dpdk/x86_64-native-linuxapp-icc/include/rte_ring.h(436),
                 from /tmp/FC28_K4.16.3_ICC19.0.0/x86_64-native-linuxapp-icc/17a519c90c8b4b879a147f2de71c86c4/dpdk/lib/librte_mempool/rte_mempool.h(50),
                 from /tmp/FC28_K4.16.3_ICC19.0.0/x86_64-native-linuxapp-icc/17a519c90c8b4b879a147f2de71c86c4/dpdk/lib/librte_mempool/rte_mempool.c(34):
/tmp/FC28_K4.16.3_ICC19.0.0/x86_64-native-linuxapp-icc/17a519c90c8b4b879a147f2de71c86c4/dpdk/x86_64-native-linuxapp-icc/include/rte_ring_generic.h(512): error: identifier "rte_int128_t" is undefined
  					(rte_int128_t *)ring_ptr,
  					 ^

In file included from /tmp/FC28_K4.16.3_ICC19.0.0/x86_64-native-linuxapp-icc/17a519c90c8b4b879a147f2de71c86c4/dpdk/x86_64-native-linuxapp-icc/include/rte_ring.h(436),
                 from /tmp/FC28_K4.16.3_ICC19.0.0/x86_64-native-linuxapp-icc/17a519c90c8b4b879a147f2de71c86c4/dpdk/lib/librte_mempool/rte_mempool.h(50),
                 from /tmp/FC28_K4.16.3_ICC19.0.0/x86_64-native-linuxapp-icc/17a519c90c8b4b879a147f2de71c86c4/dpdk/lib/librte_mempool/rte_mempool.c(34):
/tmp/FC28_K4.16.3_ICC19.0.0/x86_64-native-linuxapp-icc/17a519c90c8b4b879a147f2de71c86c4/dpdk/x86_64-native-linuxapp-icc/include/rte_ring_generic.h(512): error: expected an expression
  					(rte_int128_t *)ring_ptr,
  					               ^

In file included from /tmp/FC28_K4.16.3_ICC19.0.0/x86_64-native-linuxapp-icc/17a519c90c8b4b879a147f2de71c86c4/dpdk/x86_64-native-linuxapp-icc/include/rte_ring.h(436),
                 from /tmp/FC28_K4.16.3_ICC19.0.0/x86_64-native-linuxapp-icc/17a519c90c8b4b879a147f2de71c86c4/dpdk/lib/librte_mempool/rte_mempool.h(50),
                 from /tmp/FC28_K4.16.3_ICC19.0.0/x86_64-native-linuxapp-icc/17a519c90c8b4b879a147f2de71c86c4/dpdk/lib/librte_mempool/rte_mempool.c(34):
/tmp/FC28_K4.16.3_ICC19.0.0/x86_64-native-linuxapp-icc/17a519c90c8b4b879a147f2de71c86c4/dpdk/x86_64-native-linuxapp-icc/include/rte_ring_generic.h(512): error: expected a ")"
  					(rte_int128_t *)ring_ptr,
  					                ^

In file included from /tmp/FC28_K4.16.3_ICC19.0.0/x86_64-native-linuxapp-icc/17a519c90c8b4b879a147f2de71c86c4/dpdk/x86_64-native-linuxapp-icc/include/rte_ring.h(436),
                 from /tmp/FC28_K4.16.3_ICC19.0.0/x86_64-native-linuxapp-icc/17a519c90c8b4b879a147f2de71c86c4/dpdk/lib/librte_mempool/rte_mempool.h(50),
                 from /tmp/FC28_K4.16.3_ICC19.0.0/x86_64-native-linuxapp-icc/17a519c90c8b4b879a147f2de71c86c4/dpdk/lib/librte_mempool/rte_mempool.c(34):
/tmp/FC28_K4.16.3_ICC19.0.0/x86_64-native-linuxapp-icc/17a519c90c8b4b879a147f2de71c86c4/dpdk/x86_64-native-linuxapp-icc/include/rte_ring_generic.h(516): warning #12: parsing restarts here after previous syntax error
  					__ATOMIC_RELAXED);
  					                ^

compilation aborted for /tmp/FC28_K4.16.3_ICC19.0.0/x86_64-native-linuxapp-icc/17a519c90c8b4b879a147f2de71c86c4/dpdk/lib/librte_mempool/rte_mempool.c (code 2)
make[5]: *** [/tmp/FC28_K4.16.3_ICC19.0.0/x86_64-native-linuxapp-icc/17a519c90c8b4b879a147f2de71c86c4/dpdk/mk/internal/rte.compile-pre.mk:116: rte_mempool.o] Error 2
--
  INSTALL-LIB librte_power.a
  AR librte_acl.a
In file included from /tmp/FC28_K4.16.3_ICC19.0.0/x86_64-native-linuxapp-icc/17a519c90c8b4b879a147f2de71c86c4/dpdk/x86_64-native-linuxapp-icc/include/rte_ring.h(436),
                 from /tmp/FC28_K4.16.3_ICC19.0.0/x86_64-native-linuxapp-icc/17a519c90c8b4b879a147f2de71c86c4/dpdk/x86_64-native-linuxapp-icc/include/rte_mempool.h(50),
                 from /tmp/FC28_K4.16.3_ICC19.0.0/x86_64-native-linuxapp-icc/17a519c90c8b4b879a147f2de71c86c4/dpdk/lib/librte_mempool/rte_mempool_ops_default.c(7):
/tmp/FC28_K4.16.3_ICC19.0.0/x86_64-native-linuxapp-icc/17a519c90c8b4b879a147f2de71c86c4/dpdk/x86_64-native-linuxapp-icc/include/rte_ring_generic.h(511): warning #266: function "rte_atomic128_cmp_exchange" declared implicitly
  			success = rte_atomic128_cmp_exchange(
  			          ^

In file included from /tmp/FC28_K4.16.3_ICC19.0.0/x86_64-native-linuxapp-icc/17a519c90c8b4b879a147f2de71c86c4/dpdk/x86_64-native-linuxapp-icc/include/rte_ring.h(436),
                 from /tmp/FC28_K4.16.3_ICC19.0.0/x86_64-native-linuxapp-icc/17a519c90c8b4b879a147f2de71c86c4/dpdk/x86_64-native-linuxapp-icc/include/rte_mempool.h(50),
                 from /tmp/FC28_K4.16.3_ICC19.0.0/x86_64-native-linuxapp-icc/17a519c90c8b4b879a147f2de71c86c4/dpdk/lib/librte_mempool/rte_mempool_ops_default.c(7):
/tmp/FC28_K4.16.3_ICC19.0.0/x86_64-native-linuxapp-icc/17a519c90c8b4b879a147f2de71c86c4/dpdk/x86_64-native-linuxapp-icc/include/rte_ring_generic.h(512): error: identifier "rte_int128_t" is undefined
  					(rte_int128_t *)ring_ptr,
  					 ^

In file included from /tmp/FC28_K4.16.3_ICC19.0.0/x86_64-native-linuxapp-icc/17a519c90c8b4b879a147f2de71c86c4/dpdk/x86_64-native-linuxapp-icc/include/rte_ring.h(436),
                 from /tmp/FC28_K4.16.3_ICC19.0.0/x86_64-native-linuxapp-icc/17a519c90c8b4b879a147f2de71c86c4/dpdk/x86_64-native-linuxapp-icc/include/rte_mempool.h(50),
                 from /tmp/FC28_K4.16.3_ICC19.0.0/x86_64-native-linuxapp-icc/17a519c90c8b4b879a147f2de71c86c4/dpdk/lib/librte_mempool/rte_mempool_ops_default.c(7):
/tmp/FC28_K4.16.3_ICC19.0.0/x86_64-native-linuxapp-icc/17a519c90c8b4b879a147f2de71c86c4/dpdk/x86_64-native-linuxapp-icc/include/rte_ring_generic.h(512): error: expected an expression
  					(rte_int128_t *)ring_ptr,
  					               ^

In file included from /tmp/FC28_K4.16.3_ICC19.0.0/x86_64-native-linuxapp-icc/17a519c90c8b4b879a147f2de71c86c4/dpdk/x86_64-native-linuxapp-icc/include/rte_ring.h(436),
                 from /tmp/FC28_K4.16.3_ICC19.0.0/x86_64-native-linuxapp-icc/17a519c90c8b4b879a147f2de71c86c4/dpdk/x86_64-native-linuxapp-icc/include/rte_mempool.h(50),
                 from /tmp/FC28_K4.16.3_ICC19.0.0/x86_64-native-linuxapp-icc/17a519c90c8b4b879a147f2de71c86c4/dpdk/lib/librte_mempool/rte_mempool_ops_default.c(7):
/tmp/FC28_K4.16.3_ICC19.0.0/x86_64-native-linuxapp-icc/17a519c90c8b4b879a147f2de71c86c4/dpdk/x86_64-native-linuxapp-icc/include/rte_ring_generic.h(512): error: expected a ")"
  					(rte_int128_t *)ring_ptr,
  					                ^

In file included from /tmp/FC28_K4.16.3_ICC19.0.0/x86_64-native-linuxapp-icc/17a519c90c8b4b879a147f2de71c86c4/dpdk/x86_64-native-linuxapp-icc/include/rte_ring.h(436),
                 from /tmp/FC28_K4.16.3_ICC19.0.0/x86_64-native-linuxapp-icc/17a519c90c8b4b879a147f2de71c86c4/dpdk/x86_64-native-linuxapp-icc/include/rte_mempool.h(50),
                 from /tmp/FC28_K4.16.3_ICC19.0.0/x86_64-native-linuxapp-icc/17a519c90c8b4b879a147f2de71c86c4/dpdk/lib/librte_mempool/rte_mempool_ops_default.c(7):
/tmp/FC28_K4.16.3_ICC19.0.0/x86_64-native-linuxapp-icc/17a519c90c8b4b879a147f2de71c86c4/dpdk/x86_64-native-linuxapp-icc/include/rte_ring_generic.h(516): warning #12: parsing restarts here after previous syntax error
  					__ATOMIC_RELAXED);
  					                ^

  INSTALL-LIB librte_acl.a
compilation aborted for /tmp/FC28_K4.16.3_ICC19.0.0/x86_64-native-linuxapp-icc/17a519c90c8b4b879a147f2de71c86c4/dpdk/lib/librte_mempool/rte_mempool_ops_default.c (code 2)
make[5]: *** [/tmp/FC28_K4.16.3_ICC19.0.0/x86_64-native-linuxapp-icc/17a519c90c8b4b879a147f2de71c86c4/dpdk/mk/internal/rte.compile-pre.mk:116: rte_mempool_ops_default.o] Error 2
In file included from /tmp/FC28_K4.16.3_ICC19.0.0/x86_64-native-linuxapp-icc/17a519c90c8b4b879a147f2de71c86c4/dpdk/x86_64-native-linuxapp-icc/include/rte_ring.h(436),
                 from /tmp/FC28_K4.16.3_ICC19.0.0/x86_64-native-linuxapp-icc/17a519c90c8b4b879a147f2de71c86c4/dpdk/x86_64-native-linuxapp-icc/include/rte_mempool.h(50),
                 from /tmp/FC28_K4.16.3_ICC19.0.0/x86_64-native-linuxapp-icc/17a519c90c8b4b879a147f2de71c86c4/dpdk/lib/librte_mempool/rte_mempool_ops.c(9):
/tmp/FC28_K4.16.3_ICC19.0.0/x86_64-native-linuxapp-icc/17a519c90c8b4b879a147f2de71c86c4/dpdk/x86_64-native-linuxapp-icc/include/rte_ring_generic.h(511): warning #266: function "rte_atomic128_cmp_exchange" declared implicitly
  			success = rte_atomic128_cmp_exchange(
  			          ^

In file included from /tmp/FC28_K4.16.3_ICC19.0.0/x86_64-native-linuxapp-icc/17a519c90c8b4b879a147f2de71c86c4/dpdk/x86_64-native-linuxapp-icc/include/rte_ring.h(436),
                 from /tmp/FC28_K4.16.3_ICC19.0.0/x86_64-native-linuxapp-icc/17a519c90c8b4b879a147f2de71c86c4/dpdk/x86_64-native-linuxapp-icc/include/rte_mempool.h(50),
                 from /tmp/FC28_K4.16.3_ICC19.0.0/x86_64-native-linuxapp-icc/17a519c90c8b4b879a147f2de71c86c4/dpdk/lib/librte_mempool/rte_mempool_ops.c(9):
/tmp/FC28_K4.16.3_ICC19.0.0/x86_64-native-linuxapp-icc/17a519c90c8b4b879a147f2de71c86c4/dpdk/x86_64-native-linuxapp-icc/include/rte_ring_generic.h(512): error: identifier "rte_int128_t" is undefined
  					(rte_int128_t *)ring_ptr,
  					 ^

In file included from /tmp/FC28_K4.16.3_ICC19.0.0/x86_64-native-linuxapp-icc/17a519c90c8b4b879a147f2de71c86c4/dpdk/x86_64-native-linuxapp-icc/include/rte_ring.h(436),
                 from /tmp/FC28_K4.16.3_ICC19.0.0/x86_64-native-linuxapp-icc/17a519c90c8b4b879a147f2de71c86c4/dpdk/x86_64-native-linuxapp-icc/include/rte_mempool.h(50),
                 from /tmp/FC28_K4.16.3_ICC19.0.0/x86_64-native-linuxapp-icc/17a519c90c8b4b879a147f2de71c86c4/dpdk/lib/librte_mempool/rte_mempool_ops.c(9):
/tmp/FC28_K4.16.3_ICC19.0.0/x86_64-native-linuxapp-icc/17a519c90c8b4b879a147f2de71c86c4/dpdk/x86_64-native-linuxapp-icc/include/rte_ring_generic.h(512): error: expected an expression
  					(rte_int128_t *)ring_ptr,
  					               ^

In file included from /tmp/FC28_K4.16.3_ICC19.0.0/x86_64-native-linuxapp-icc/17a519c90c8b4b879a147f2de71c86c4/dpdk/x86_64-native-linuxapp-icc/include/rte_ring.h(436),
                 from /tmp/FC28_K4.16.3_ICC19.0.0/x86_64-native-linuxapp-icc/17a519c90c8b4b879a147f2de71c86c4/dpdk/x86_64-native-linuxapp-icc/include/rte_mempool.h(50),
                 from /tmp/FC28_K4.16.3_ICC19.0.0/x86_64-native-linuxapp-icc/17a519c90c8b4b879a147f2de71c86c4/dpdk/lib/librte_mempool/rte_mempool_ops.c(9):
/tmp/FC28_K4.16.3_ICC19.0.0/x86_64-native-linuxapp-icc/17a519c90c8b4b879a147f2de71c86c4/dpdk/x86_64-native-linuxapp-icc/include/rte_ring_generic.h(512): error: expected a ")"
  					(rte_int128_t *)ring_ptr,
  					                ^

In file included from /tmp/FC28_K4.16.3_ICC19.0.0/x86_64-native-linuxapp-icc/17a519c90c8b4b879a147f2de71c86c4/dpdk/x86_64-native-linuxapp-icc/include/rte_ring.h(436),
                 from /tmp/FC28_K4.16.3_ICC19.0.0/x86_64-native-linuxapp-icc/17a519c90c8b4b879a147f2de71c86c4/dpdk/x86_64-native-linuxapp-icc/include/rte_mempool.h(50),
                 from /tmp/FC28_K4.16.3_ICC19.0.0/x86_64-native-linuxapp-icc/17a519c90c8b4b879a147f2de71c86c4/dpdk/lib/librte_mempool/rte_mempool_ops.c(9):
/tmp/FC28_K4.16.3_ICC19.0.0/x86_64-native-linuxapp-icc/17a519c90c8b4b879a147f2de71c86c4/dpdk/x86_64-native-linuxapp-icc/include/rte_ring_generic.h(516): warning #12: parsing restarts here after previous syntax error
  					__ATOMIC_RELAXED);
  					                ^

compilation aborted for /tmp/FC28_K4.16.3_ICC19.0.0/x86_64-native-linuxapp-icc/17a519c90c8b4b879a147f2de71c86c4/dpdk/lib/librte_mempool/rte_mempool_ops.c (code 2)
make[5]: *** [/tmp/FC28_K4.16.3_ICC19.0.0/x86_64-native-linuxapp-icc/17a519c90c8b4b879a147f2de71c86c4/dpdk/mk/internal/rte.compile-pre.mk:116: rte_mempool_ops.o] Error 2

*Failed Build #23:
OS: SUSE12
Target: x86_64-native-linuxapp-gcc
  CC rte_mempool_ops_default.o
In file included from /tmp/SUSE12_K3.7.10_GCC4.7.2/x86_64-native-linuxapp-gcc/17a519c90c8b4b879a147f2de71c86c4/dpdk/x86_64-native-linuxapp-gcc/include/rte_ring.h:436:0,
                 from /tmp/SUSE12_K3.7.10_GCC4.7.2/x86_64-native-linuxapp-gcc/17a519c90c8b4b879a147f2de71c86c4/dpdk/lib/librte_mempool/rte_mempool.h:50,
                 from /tmp/SUSE12_K3.7.10_GCC4.7.2/x86_64-native-linuxapp-gcc/17a519c90c8b4b879a147f2de71c86c4/dpdk/lib/librte_mempool/rte_mempool_ops_default.c:7:
/tmp/SUSE12_K3.7.10_GCC4.7.2/x86_64-native-linuxapp-gcc/17a519c90c8b4b879a147f2de71c86c4/dpdk/x86_64-native-linuxapp-gcc/include/rte_ring_generic.h: In function ‘__rte_ring_do_lf_enqueue_mp’:
/tmp/SUSE12_K3.7.10_GCC4.7.2/x86_64-native-linuxapp-gcc/17a519c90c8b4b879a147f2de71c86c4/dpdk/x86_64-native-linuxapp-gcc/include/rte_ring_generic.h:511:14: warning: implicit declaration of function ‘rte_atomic128_cmp_exchange’; did you mean ‘rte_atomic32_exchange’? [-Wimplicit-function-declaration]
    success = rte_atomic128_cmp_exchange(
              ^~~~~~~~~~~~~~~~~~~~~~~~~~
              rte_atomic32_exchange
/tmp/SUSE12_K3.7.10_GCC4.7.2/x86_64-native-linuxapp-gcc/17a519c90c8b4b879a147f2de71c86c4/dpdk/x86_64-native-linuxapp-gcc/include/rte_ring_generic.h:511:14: warning: nested extern declaration of ‘rte_atomic128_cmp_exchange’ [-Wnested-externs]
/tmp/SUSE12_K3.7.10_GCC4.7.2/x86_64-native-linuxapp-gcc/17a519c90c8b4b879a147f2de71c86c4/dpdk/x86_64-native-linuxapp-gcc/include/rte_ring_generic.h:512:7: error: ‘rte_int128_t’ undeclared (first use in this function); did you mean ‘__int128_t’?
      (rte_int128_t *)ring_ptr,
       ^~~~~~~~~~~~
       __int128_t
/tmp/SUSE12_K3.7.10_GCC4.7.2/x86_64-native-linuxapp-gcc/17a519c90c8b4b879a147f2de71c86c4/dpdk/x86_64-native-linuxapp-gcc/include/rte_ring_generic.h:512:7: note: each undeclared identifier is reported only once for each function it appears in
/tmp/SUSE12_K3.7.10_GCC4.7.2/x86_64-native-linuxapp-gcc/17a519c90c8b4b879a147f2de71c86c4/dpdk/x86_64-native-linuxapp-gcc/include/rte_ring_generic.h:512:21: error: expected expression before ‘)’ token
      (rte_int128_t *)ring_ptr,
                     ^
/tmp/SUSE12_K3.7.10_GCC4.7.2/x86_64-native-linuxapp-gcc/17a519c90c8b4b879a147f2de71c86c4/dpdk/x86_64-native-linuxapp-gcc/include/rte_ring_generic.h:473:40: warning: variable ‘new_value’ set but not used [-Wunused-but-set-variable]
    struct rte_ring_lf_entry old_value, new_value;
                                        ^~~~~~~~~
  SYMLINK-FILE include/rte_hash.h
  SYMLINK-FILE include/rte_hash_crc.h
  SYMLINK-FILE include/rte_jhash.h
In file included from /tmp/SUSE12_K3.7.10_GCC4.7.2/x86_64-native-linuxapp-gcc/17a519c90c8b4b879a147f2de71c86c4/dpdk/x86_64-native-linuxapp-gcc/include/rte_ring.h:436:0,
                 from /tmp/SUSE12_K3.7.10_GCC4.7.2/x86_64-native-linuxapp-gcc/17a519c90c8b4b879a147f2de71c86c4/dpdk/lib/librte_mempool/rte_mempool.h:50,
                 from /tmp/SUSE12_K3.7.10_GCC4.7.2/x86_64-native-linuxapp-gcc/17a519c90c8b4b879a147f2de71c86c4/dpdk/lib/librte_mempool/rte_mempool.c:34:
/tmp/SUSE12_K3.7.10_GCC4.7.2/x86_64-native-linuxapp-gcc/17a519c90c8b4b879a147f2de71c86c4/dpdk/x86_64-native-linuxapp-gcc/include/rte_ring_generic.h: In function ‘__rte_ring_do_lf_enqueue_mp’:
/tmp/SUSE12_K3.7.10_GCC4.7.2/x86_64-native-linuxapp-gcc/17a519c90c8b4b879a147f2de71c86c4/dpdk/x86_64-native-linuxapp-gcc/include/rte_ring_generic.h:511:14: warning: implicit declaration of function ‘rte_atomic128_cmp_exchange’; did you mean ‘rte_atomic32_exchange’? [-Wimplicit-function-declaration]
    success = rte_atomic128_cmp_exchange(
              ^~~~~~~~~~~~~~~~~~~~~~~~~~
              rte_atomic32_exchange
/tmp/SUSE12_K3.7.10_GCC4.7.2/x86_64-native-linuxapp-gcc/17a519c90c8b4b879a147f2de71c86c4/dpdk/x86_64-native-linuxapp-gcc/include/rte_ring_generic.h:511:14: warning: nested extern declaration of ‘rte_atomic128_cmp_exchange’ [-Wnested-externs]
/tmp/SUSE12_K3.7.10_GCC4.7.2/x86_64-native-linuxapp-gcc/17a519c90c8b4b879a147f2de71c86c4/dpdk/x86_64-native-linuxapp-gcc/include/rte_ring_generic.h:512:7: error: ‘rte_int128_t’ undeclared (first use in this function); did you mean ‘__int128_t’?
      (rte_int128_t *)ring_ptr,
       ^~~~~~~~~~~~
       __int128_t
/tmp/SUSE12_K3.7.10_GCC4.7.2/x86_64-native-linuxapp-gcc/17a519c90c8b4b879a147f2de71c86c4/dpdk/x86_64-native-linuxapp-gcc/include/rte_ring_generic.h:512:7: note: each undeclared identifier is reported only once for each function it appears in
/tmp/SUSE12_K3.7.10_GCC4.7.2/x86_64-native-linuxapp-gcc/17a519c90c8b4b879a147f2de71c86c4/dpdk/x86_64-native-linuxapp-gcc/include/rte_ring_generic.h:512:21: error: expected expression before ‘)’ token
      (rte_int128_t *)ring_ptr,
                     ^
/tmp/SUSE12_K3.7.10_GCC4.7.2/x86_64-native-linuxapp-gcc/17a519c90c8b4b879a147f2de71c86c4/dpdk/x86_64-native-linuxapp-gcc/include/rte_ring_generic.h:473:40: warning: variable ‘new_value’ set but not used [-Wunused-but-set-variable]
    struct rte_ring_lf_entry old_value, new_value;
                                        ^~~~~~~~~
  SYMLINK-FILE include/rte_thash.h
In file included from /tmp/SUSE12_K3.7.10_GCC4.7.2/x86_64-native-linuxapp-gcc/17a519c90c8b4b879a147f2de71c86c4/dpdk/x86_64-native-linuxapp-gcc/include/rte_ring.h:436:0,
                 from /tmp/SUSE12_K3.7.10_GCC4.7.2/x86_64-native-linuxapp-gcc/17a519c90c8b4b879a147f2de71c86c4/dpdk/lib/librte_mempool/rte_mempool.h:50,
                 from /tmp/SUSE12_K3.7.10_GCC4.7.2/x86_64-native-linuxapp-gcc/17a519c90c8b4b879a147f2de71c86c4/dpdk/lib/librte_mempool/rte_mempool_ops.c:9:
/tmp/SUSE12_K3.7.10_GCC4.7.2/x86_64-native-linuxapp-gcc/17a519c90c8b4b879a147f2de71c86c4/dpdk/x86_64-native-linuxapp-gcc/include/rte_ring_generic.h: In function ‘__rte_ring_do_lf_enqueue_mp’:
/tmp/SUSE12_K3.7.10_GCC4.7.2/x86_64-native-linuxapp-gcc/17a519c90c8b4b879a147f2de71c86c4/dpdk/x86_64-native-linuxapp-gcc/include/rte_ring_generic.h:511:14: warning: implicit declaration of function ‘rte_atomic128_cmp_exchange’; did you mean ‘rte_atomic32_exchange’? [-Wimplicit-function-declaration]
    success = rte_atomic128_cmp_exchange(
              ^~~~~~~~~~~~~~~~~~~~~~~~~~
              rte_atomic32_exchange
/tmp/SUSE12_K3.7.10_GCC4.7.2/x86_64-native-linuxapp-gcc/17a519c90c8b4b879a147f2de71c86c4/dpdk/x86_64-native-linuxapp-gcc/include/rte_ring_generic.h:511:14: warning: nested extern declaration of ‘rte_atomic128_cmp_exchange’ [-Wnested-externs]
/tmp/SUSE12_K3.7.10_GCC4.7.2/x86_64-native-linuxapp-gcc/17a519c90c8b4b879a147f2de71c86c4/dpdk/x86_64-native-linuxapp-gcc/include/rte_ring_generic.h:512:7: error: ‘rte_int128_t’ undeclared (first use in this function); did you mean ‘__int128_t’?
      (rte_int128_t *)ring_ptr,
       ^~~~~~~~~~~~
       __int128_t
/tmp/SUSE12_K3.7.10_GCC4.7.2/x86_64-native-linuxapp-gcc/17a519c90c8b4b879a147f2de71c86c4/dpdk/x86_64-native-linuxapp-gcc/include/rte_ring_generic.h:512:7: note: each undeclared identifier is reported only once for each function it appears in
/tmp/SUSE12_K3.7.10_GCC4.7.2/x86_64-native-linuxapp-gcc/17a519c90c8b4b879a147f2de71c86c4/dpdk/x86_64-native-linuxapp-gcc/include/rte_ring_generic.h:512:21: error: expected expression before ‘)’ token
      (rte_int128_t *)ring_ptr,
                     ^
/tmp/SUSE12_K3.7.10_GCC4.7.2/x86_64-native-linuxapp-gcc/17a519c90c8b4b879a147f2de71c86c4/dpdk/x86_64-native-linuxapp-gcc/include/rte_ring_generic.h:473:40: warning: variable ‘new_value’ set but not used [-Wunused-but-set-variable]
    struct rte_ring_lf_entry old_value, new_value;
                                        ^~~~~~~~~
  SYMLINK-FILE include/rte_fbk_hash.h
  CC rte_cuckoo_hash.o
  CC rte_fbk_hash.o
  SYMLINK-FILE include/rte_power_empty_poll.h
  SYMLINK-FILE include/rte_power.h
  CC rte_power.o
/tmp/SUSE12_K3.7.10_GCC4.7.2/x86_64-native-linuxapp-gcc/17a519c90c8b4b879a147f2de71c86c4/dpdk/mk/internal/rte.compile-pre.mk:114: recipe for target 'rte_mempool_ops_default.o' failed
make[5]: *** [rte_mempool_ops_default.o] Error 1
make[5]: *** Waiting for unfinished jobs....
  CC power_kvm_vm.o
  CC power_acpi_cpufreq.o
  CC guest_channel.o
/tmp/SUSE12_K3.7.10_GCC4.7.2/x86_64-native-linuxapp-gcc/17a519c90c8b4b879a147f2de71c86c4/dpdk/mk/internal/rte.compile-pre.mk:114: recipe for target 'rte_mempool.o' failed
make[5]: *** [rte_mempool.o] Error 1
  CC rte_power_empty_poll.o
/tmp/SUSE12_K3.7.10_GCC4.7.2/x86_64-native-linuxapp-gcc/17a519c90c8b4b879a147f2de71c86c4/dpdk/mk/internal/rte.compile-pre.mk:114: recipe for target 'rte_mempool_ops.o' failed
make[5]: *** [rte_mempool_ops.o] Error 1
/tmp/SUSE12_K3.7.10_GCC4.7.2/x86_64-native-linuxapp-gcc/17a519c90c8b4b879a147f2de71c86c4/dpdk/mk/rte.subdir.mk:35: recipe for target 'librte_mempool' failed
make[4]: *** [librte_mempool] Error 2
make[4]: *** Waiting for unfinished jobs....
  CC power_pstate_cpufreq.o
  AR librte_acl.a
  INSTALL-LIB librte_acl.a
  AR librte_power.a
  INSTALL-LIB librte_power.a
  AR librte_hash.a
  INSTALL-LIB librte_hash.a
/tmp/SUSE12_K3.7.10_GCC4.7.2/x86_64-native-linuxapp-gcc/17a519c90c8b4b879a147f2de71c86c4/dpdk/mk/rte.sdkbuild.mk:46: recipe for target 'lib' failed
make[3]: *** [lib] Error 2
/tmp/SUSE12_K3.7.10_GCC4.7.2/x86_64-native-linuxapp-gcc/17a519c90c8b4b879a147f2de71c86c4/dpdk/mk/rte.sdkroot.mk:98: recipe for target 'all' failed
make[2]: *** [all] Error 2
/tmp/SUSE12_K3.7.10_GCC4.7.2/x86_64-native-linuxapp-gcc/17a519c90c8b4b879a147f2de71c86c4/dpdk/mk/rte.sdkinstall.mk:60: recipe for target 'pre_install' failed
make[1]: *** [pre_install] Error 2
/tmp/SUSE12_K3.7.10_GCC4.7.2/x86_64-native-linuxapp-gcc/17a519c90c8b4b879a147f2de71c86c4/dpdk/mk/rte.sdkroot.mk:77: recipe for target 'install' failed
make: *** [install] Error 2

*Failed Build #24:
OS: CENTOS76
Target: x86_64-native-linuxapp-gcc
  CC rte_mempool_ops_default.o
In file included from /tmp/CENTOS76_K3.10.0_GCC4.8.5/x86_64-native-linuxapp-gcc/17a519c90c8b4b879a147f2de71c86c4/dpdk/x86_64-native-linuxapp-gcc/include/rte_ring.h:436:0,
                 from /tmp/CENTOS76_K3.10.0_GCC4.8.5/x86_64-native-linuxapp-gcc/17a519c90c8b4b879a147f2de71c86c4/dpdk/lib/librte_mempool/rte_mempool.h:50,
                 from /tmp/CENTOS76_K3.10.0_GCC4.8.5/x86_64-native-linuxapp-gcc/17a519c90c8b4b879a147f2de71c86c4/dpdk/lib/librte_mempool/rte_mempool_ops.c:9:
/tmp/CENTOS76_K3.10.0_GCC4.8.5/x86_64-native-linuxapp-gcc/17a519c90c8b4b879a147f2de71c86c4/dpdk/x86_64-native-linuxapp-gcc/include/rte_ring_generic.h: In function ‘__rte_ring_do_lf_enqueue_mp’:
/tmp/CENTOS76_K3.10.0_GCC4.8.5/x86_64-native-linuxapp-gcc/17a519c90c8b4b879a147f2de71c86c4/dpdk/x86_64-native-linuxapp-gcc/include/rte_ring_generic.h:511:4: warning: implicit declaration of function ‘rte_atomic128_cmp_exchange’ [-Wimplicit-function-declaration]
    success = rte_atomic128_cmp_exchange(
    ^
/tmp/CENTOS76_K3.10.0_GCC4.8.5/x86_64-native-linuxapp-gcc/17a519c90c8b4b879a147f2de71c86c4/dpdk/x86_64-native-linuxapp-gcc/include/rte_ring_generic.h:511:4: warning: nested extern declaration of ‘rte_atomic128_cmp_exchange’ [-Wnested-externs]
/tmp/CENTOS76_K3.10.0_GCC4.8.5/x86_64-native-linuxapp-gcc/17a519c90c8b4b879a147f2de71c86c4/dpdk/x86_64-native-linuxapp-gcc/include/rte_ring_generic.h:512:7: error: ‘rte_int128_t’ undeclared (first use in this function)
      (rte_int128_t *)ring_ptr,
       ^
/tmp/CENTOS76_K3.10.0_GCC4.8.5/x86_64-native-linuxapp-gcc/17a519c90c8b4b879a147f2de71c86c4/dpdk/x86_64-native-linuxapp-gcc/include/rte_ring_generic.h:512:7: note: each undeclared identifier is reported only once for each function it appears in
/tmp/CENTOS76_K3.10.0_GCC4.8.5/x86_64-native-linuxapp-gcc/17a519c90c8b4b879a147f2de71c86c4/dpdk/x86_64-native-linuxapp-gcc/include/rte_ring_generic.h:512:21: error: expected expression before ‘)’ token
      (rte_int128_t *)ring_ptr,
                     ^
/tmp/CENTOS76_K3.10.0_GCC4.8.5/x86_64-native-linuxapp-gcc/17a519c90c8b4b879a147f2de71c86c4/dpdk/x86_64-native-linuxapp-gcc/include/rte_ring_generic.h:473:40: warning: variable ‘new_value’ set but not used [-Wunused-but-set-variable]
    struct rte_ring_lf_entry old_value, new_value;
                                        ^
In file included from /tmp/CENTOS76_K3.10.0_GCC4.8.5/x86_64-native-linuxapp-gcc/17a519c90c8b4b879a147f2de71c86c4/dpdk/x86_64-native-linuxapp-gcc/include/rte_ring.h:436:0,
                 from /tmp/CENTOS76_K3.10.0_GCC4.8.5/x86_64-native-linuxapp-gcc/17a519c90c8b4b879a147f2de71c86c4/dpdk/lib/librte_mempool/rte_mempool.h:50,
                 from /tmp/CENTOS76_K3.10.0_GCC4.8.5/x86_64-native-linuxapp-gcc/17a519c90c8b4b879a147f2de71c86c4/dpdk/lib/librte_mempool/rte_mempool_ops_default.c:7:
/tmp/CENTOS76_K3.10.0_GCC4.8.5/x86_64-native-linuxapp-gcc/17a519c90c8b4b879a147f2de71c86c4/dpdk/x86_64-native-linuxapp-gcc/include/rte_ring_generic.h: In function ‘__rte_ring_do_lf_enqueue_mp’:
/tmp/CENTOS76_K3.10.0_GCC4.8.5/x86_64-native-linuxapp-gcc/17a519c90c8b4b879a147f2de71c86c4/dpdk/x86_64-native-linuxapp-gcc/include/rte_ring_generic.h:511:4: warning: implicit declaration of function ‘rte_atomic128_cmp_exchange’ [-Wimplicit-function-declaration]
    success = rte_atomic128_cmp_exchange(
    ^
/tmp/CENTOS76_K3.10.0_GCC4.8.5/x86_64-native-linuxapp-gcc/17a519c90c8b4b879a147f2de71c86c4/dpdk/x86_64-native-linuxapp-gcc/include/rte_ring_generic.h:511:4: warning: nested extern declaration of ‘rte_atomic128_cmp_exchange’ [-Wnested-externs]
/tmp/CENTOS76_K3.10.0_GCC4.8.5/x86_64-native-linuxapp-gcc/17a519c90c8b4b879a147f2de71c86c4/dpdk/x86_64-native-linuxapp-gcc/include/rte_ring_generic.h:512:7: error: ‘rte_int128_t’ undeclared (first use in this function)
      (rte_int128_t *)ring_ptr,
       ^
/tmp/CENTOS76_K3.10.0_GCC4.8.5/x86_64-native-linuxapp-gcc/17a519c90c8b4b879a147f2de71c86c4/dpdk/x86_64-native-linuxapp-gcc/include/rte_ring_generic.h:512:7: note: each undeclared identifier is reported only once for each function it appears in
/tmp/CENTOS76_K3.10.0_GCC4.8.5/x86_64-native-linuxapp-gcc/17a519c90c8b4b879a147f2de71c86c4/dpdk/x86_64-native-linuxapp-gcc/include/rte_ring_generic.h:512:21: error: expected expression before ‘)’ token
      (rte_int128_t *)ring_ptr,
                     ^
/tmp/CENTOS76_K3.10.0_GCC4.8.5/x86_64-native-linuxapp-gcc/17a519c90c8b4b879a147f2de71c86c4/dpdk/x86_64-native-linuxapp-gcc/include/rte_ring_generic.h:473:40: warning: variable ‘new_value’ set but not used [-Wunused-but-set-variable]
    struct rte_ring_lf_entry old_value, new_value;
                                        ^
  CC rte_power.o
  CC power_acpi_cpufreq.o
make[5]: *** [rte_mempool_ops.o] Error 1
--
  CC guest_channel.o
In file included from /tmp/CENTOS76_K3.10.0_GCC4.8.5/x86_64-native-linuxapp-gcc/17a519c90c8b4b879a147f2de71c86c4/dpdk/x86_64-native-linuxapp-gcc/include/rte_ring.h:436:0,
                 from /tmp/CENTOS76_K3.10.0_GCC4.8.5/x86_64-native-linuxapp-gcc/17a519c90c8b4b879a147f2de71c86c4/dpdk/lib/librte_mempool/rte_mempool.h:50,
                 from /tmp/CENTOS76_K3.10.0_GCC4.8.5/x86_64-native-linuxapp-gcc/17a519c90c8b4b879a147f2de71c86c4/dpdk/lib/librte_mempool/rte_mempool.c:34:
/tmp/CENTOS76_K3.10.0_GCC4.8.5/x86_64-native-linuxapp-gcc/17a519c90c8b4b879a147f2de71c86c4/dpdk/x86_64-native-linuxapp-gcc/include/rte_ring_generic.h: In function ‘__rte_ring_do_lf_enqueue_mp’:
/tmp/CENTOS76_K3.10.0_GCC4.8.5/x86_64-native-linuxapp-gcc/17a519c90c8b4b879a147f2de71c86c4/dpdk/x86_64-native-linuxapp-gcc/include/rte_ring_generic.h:511:4: warning: implicit declaration of function ‘rte_atomic128_cmp_exchange’ [-Wimplicit-function-declaration]
    success = rte_atomic128_cmp_exchange(
    ^
/tmp/CENTOS76_K3.10.0_GCC4.8.5/x86_64-native-linuxapp-gcc/17a519c90c8b4b879a147f2de71c86c4/dpdk/x86_64-native-linuxapp-gcc/include/rte_ring_generic.h:511:4: warning: nested extern declaration of ‘rte_atomic128_cmp_exchange’ [-Wnested-externs]
/tmp/CENTOS76_K3.10.0_GCC4.8.5/x86_64-native-linuxapp-gcc/17a519c90c8b4b879a147f2de71c86c4/dpdk/x86_64-native-linuxapp-gcc/include/rte_ring_generic.h:512:7: error: ‘rte_int128_t’ undeclared (first use in this function)
      (rte_int128_t *)ring_ptr,
       ^
/tmp/CENTOS76_K3.10.0_GCC4.8.5/x86_64-native-linuxapp-gcc/17a519c90c8b4b879a147f2de71c86c4/dpdk/x86_64-native-linuxapp-gcc/include/rte_ring_generic.h:512:7: note: each undeclared identifier is reported only once for each function it appears in
/tmp/CENTOS76_K3.10.0_GCC4.8.5/x86_64-native-linuxapp-gcc/17a519c90c8b4b879a147f2de71c86c4/dpdk/x86_64-native-linuxapp-gcc/include/rte_ring_generic.h:512:21: error: expected expression before ‘)’ token
      (rte_int128_t *)ring_ptr,
                     ^
/tmp/CENTOS76_K3.10.0_GCC4.8.5/x86_64-native-linuxapp-gcc/17a519c90c8b4b879a147f2de71c86c4/dpdk/x86_64-native-linuxapp-gcc/include/rte_ring_generic.h:473:40: warning: variable ‘new_value’ set but not used [-Wunused-but-set-variable]
    struct rte_ring_lf_entry old_value, new_value;
                                        ^
  CC rte_power_empty_poll.o
  CC power_pstate_cpufreq.o
make[5]: *** [rte_mempool.o] Error 1

DPDK STV team


More information about the test-report mailing list