[dpdk-test-report] |FAILURE| pw51304-51310 [PATCH] [v8, 1/6] ring: add a pointer-width headtail structure

dpdklab at iol.unh.edu dpdklab at iol.unh.edu
Tue Mar 19 02:44:28 CET 2019


Test-Label: Performance-Testing
Test-Status: FAILURE
http://dpdk.org/patch/51304

_build patch failure_

Submitter: Gage Eads <gage.eads at intel.com>
Date: Tuesday, March 19 2019 01:20:05 
Applied on: CommitID:239912fa798e6e671072ca7ff987afd74c1e506c
Apply patch set 51304-51310 failed:

Configuration done using x86_64-native-linuxapp-gcc
== Build lib
== Build lib/librte_kvargs
== Build lib/librte_eal
== Build lib/librte_eal/common
== Build lib/librte_eal/linux
== Build lib/librte_eal/linux/eal
== Build lib/librte_pci
== Build lib/librte_ring
== Build lib/librte_mempool
  CC rte_mempool.o
In file included from /var/lib/jenkins/workspace/Apply-Custom-Patch-Set/dpdk/x86_64-native-linuxapp-gcc/include/rte_ring.h:436:0,
                 from /var/lib/jenkins/workspace/Apply-Custom-Patch-Set/dpdk/lib/librte_mempool/rte_mempool.h:50,
                 from /var/lib/jenkins/workspace/Apply-Custom-Patch-Set/dpdk/lib/librte_mempool/rte_mempool.c:34:
/var/lib/jenkins/workspace/Apply-Custom-Patch-Set/dpdk/x86_64-native-linuxapp-gcc/include/rte_ring_generic.h: In function ‘__rte_ring_do_lf_enqueue_mp’:
/var/lib/jenkins/workspace/Apply-Custom-Patch-Set/dpdk/x86_64-native-linuxapp-gcc/include/rte_ring_generic.h:511:4: error: implicit declaration of function ‘rte_atomic128_cmp_exchange’ [-Werror=implicit-function-declaration]
    success = rte_atomic128_cmp_exchange(
    ^
/var/lib/jenkins/workspace/Apply-Custom-Patch-Set/dpdk/x86_64-native-linuxapp-gcc/include/rte_ring_generic.h:511:4: error: nested extern declaration of ‘rte_atomic128_cmp_exchange’ [-Werror=nested-externs]
/var/lib/jenkins/workspace/Apply-Custom-Patch-Set/dpdk/x86_64-native-linuxapp-gcc/include/rte_ring_generic.h:512:7: error: ‘rte_int128_t’ undeclared (first use in this function)
      (rte_int128_t *)ring_ptr,
       ^
/var/lib/jenkins/workspace/Apply-Custom-Patch-Set/dpdk/x86_64-native-linuxapp-gcc/include/rte_ring_generic.h:512:7: note: each undeclared identifier is reported only once for each function it appears in
/var/lib/jenkins/workspace/Apply-Custom-Patch-Set/dpdk/x86_64-native-linuxapp-gcc/include/rte_ring_generic.h:512:21: error: expected expression before ‘)’ token
      (rte_int128_t *)ring_ptr,
                     ^
/var/lib/jenkins/workspace/Apply-Custom-Patch-Set/dpdk/x86_64-native-linuxapp-gcc/include/rte_ring_generic.h:473:40: error: variable ‘new_value’ set but not used [-Werror=unused-but-set-variable]
    struct rte_ring_lf_entry old_value, new_value;
                                        ^
cc1: all warnings being treated as errors
make[5]: *** [rte_mempool.o] Error 1
make[4]: *** [librte_mempool] Error 2
make[3]: *** [lib] Error 2
make[2]: *** [all] Error 2
make[1]: *** [pre_install] Error 2
make: *** [install] Error 2

https://lab.dpdk.org/results/dashboard/patchsets/4921/

UNH-IOL DPDK Performance Test Lab


More information about the test-report mailing list