[dpdk-test-report] |FAILURE| pw61344[v4] ethdev: add HIGIG2 key field to flow API

sys_stv at intel.com sys_stv at intel.com
Thu Oct 17 06:43:49 CEST 2019


Test-Label: Intel-compilation
Test-Status: FAILURE
http://dpdk.org/patch/61344

_Compilation issues_

Submitter: Kiran Kumar Kokkilagadda <kirankumark at marvell.com>
Date: 2019-10-17 04:15:50
Reply_mail: 20191017041550.4075-1-kirankumark at marvell.com
DPDK git baseline: Repo:dpdk-next-net, CommitID: f4d89aa83c044b0d0b7c1094bf4e9b9b9a6cb940

Makefile build Summary: 22 Builds Done, 18 Successful, 4 Failures

Meson build Summary: 7 Builds Done, 5 Successful, 2 Failures

               +==============================================+===========+==========+
               |                   Makefile                   |   Meson   | Document |
+--------------+------+-------+------+------------+-----------+-----------+----------+
| os           | gcc  | clang | icc  | gcc+shared | gcc+debug | gcc/clang | pdf/html |
+--------------+------+-------+------+------------+-----------+-----------+----------+
| RHEL76-64    | FAIL |       |      |            |           |           |          |
| CENTOS76-64  | FAIL | pass  | pass | FAIL       | FAIL      |           |          |
| UB1804-64    | pass | pass  | pass |            |           | FAIL      | pass     |
| UB1604-32    | pass |       |      |            |           | FAIL      |          |
| UB1904-64    | pass |       |      |            |           |           |          |
| UB1604-64    | pass | pass  |      |            |           |           |          |
| FC30-64      | pass | pass  |      |            |           | pass      |          |
| WIN10-64     |      |       |      |            |           | pass      |          |
| FreeBSD12-64 | pass | pass  |      | pass       | pass      | pass      |          |
| RHEL80-64    | pass |       |      |            |           |           |          |
| SUSE15-64    | pass | pass  |      |            |           | pass      |          |
+--------------+------+-------+------+------------+-----------+-----------+----------+

Test environment and configuration as below:

** Makefile build **


OS: RHEL76-64
	Kernel Version: 3.10.0-957.el7.x86_64
	CPU info: Intel(R) Xeon(R) CPU E5-2699 v4 @ 2.20GHz
	GCC Version: gcc (GCC) 4.8.5 20150623 (Red Hat 4.8.5-36)
	Clang Version: NA
	x86_64-native-linuxapp-gcc


OS: CENTOS76-64
	Kernel Version: 3.10.0-957.27.2.el7.x86_64
	CPU info: Intel(R) Xeon(R) CPU E5-2699 v4 @ 2.20GHz
	GCC Version: gcc (GCC) 4.8.5 20150623 (Red Hat 4.8.5-36)
	Clang Version: 3.4.2 (tags/RELEASE_34/dot2-final)
	x86_64-native-linuxapp-gcc+shared
	x86_64-native-linuxapp-gcc+debug
	x86_64-native-linuxapp-gcc
	x86_64-native-linuxapp-clang
	x86_64-native-linuxapp-icc


OS: UB1804-64
	Kernel Version: 4.15.0-20-generic
	CPU info: Intel(R) Xeon(R) CPU E5-2699 v3 @ 2.30GHz
	GCC Version: gcc (Ubuntu 7.3.0-16ubuntu3) 7.3.0
	Clang Version: 6.0.0-1ubuntu2 (tags/RELEASE_600/final)
	x86_64-native-linuxapp-clang
	x86_64-native-linuxapp-icc
	x86_64-native-linuxapp-gcc


OS: UB1904-64
	Kernel Version: 5.0.0-13-generic
	CPU info: Intel(R) Xeon(R) CPU E5-2699 v3 @ 2.30GHz
	GCC Version: gcc (Ubuntu 8.3.0-6ubuntu1) 8.3.0
	Clang Version: 8.0.0-3 (tags/RELEASE_800/final)
	x86_64-native-linuxapp-gcc


OS: UB1604-32
	Kernel Version: 4.4.0-131-generic
	CPU info: Intel(R) Xeon(R) CPU E5-2699 v3 @ 2.30GHz
	GCC Version: gcc (Ubuntu 5.4.0-6ubuntu1~16.04.11) 5.4.0 20160609
	Clang Version: 3.8.0-2ubuntu4 (tags/RELEASE_380/final)
	i686-native-linuxapp-gcc


OS: UB1604-64
	Kernel Version: 4.4.0-47-generic
	CPU info: Intel(R) Xeon(R) CPU E5-2699 v3 @ 2.30GHz
	GCC Version: gcc (Ubuntu 5.4.0-6ubuntu1~16.04.10) 5.4.0 20160609
	Clang Version: 3.8.0-2ubuntu4 (tags/RELEASE_380/final)
	x86_64-native-linuxapp-clang
	x86_64-native-linuxapp-gcc


OS: FC30-64
	Kernel Version: 5.1.7-300.fc30.x86_64
	CPU info: Intel(R) Xeon(R) CPU E5-2699 v4 @ 2.20GHz
	GCC Version: gcc (GCC) 9.1.1 20190503 (Red Hat 9.1.1-1)
	Clang Version: 8.0.0 (Fedora 8.0.0-1.fc30)
	x86_64-native-linuxapp-gcc
	x86_64-native-linuxapp-clang


OS: FreeBSD12-64
	Kernel Version: 12.0-RC3
	CPU info: Intel(R) Xeon(R) CPU E5-2699 v4 @ 2.20GHz (2194.98-MHz K8-class CPU)
	GCC Version: gcc (FreeBSD Ports Collection) 7.3.0
	Clang Version: 6.0.1 (tags/RELEASE_601/final 335540) (based on LLVM 6.0.1)
	x86_64-native-bsdapp-gcc+debug
	x86_64-native-bsdapp-gcc+shared
	x86_64-native-bsdapp-clang
	x86_64-native-bsdapp-gcc


OS: RHEL80-64
	Kernel Version: 4.18.0-80.el8.x86_64
	CPU info: Intel(R) Xeon(R) CPU E5-2699 v4 @ 2.20GHz
	GCC Version: gcc (GCC) 8.2.1 20180905 (Red Hat 8.2.1-3)
	Clang Version: 6.0.1 (tags/RELEASE_601/final)
	x86_64-native-linuxapp-gcc


OS: SUSE15-64
	Kernel Version: 4.12.14-lp150.11-default
	CPU info: Intel(R) Xeon(R) CPU E5-2699 v4 @ 2.20GHz
	GCC Version: gcc (SUSE Linux) 7.3.1 20180323 [gcc-7-branch revision 258812]
	Clang Version: 5.0.1 (tags/RELEASE_501/final 312548)
	x86_64-native-linuxapp-gcc
	x86_64-native-linuxapp-clang


** Meson build **


OS: UB1804-64
	Kernel Version: 4.15.0-20-generic
	CPU info: Intel(R) Xeon(R) CPU E5-2699 v4 @ 2.20GHz
	GCC Version: gcc (Ubuntu 7.3.0-27ubuntu1~18.04) 7.3.0
	Clang Version: 6.0.0-1ubuntu2 (tags/RELEASE_600/final)
	x86_64-native-linuxapp-doc
	build-gcc-static
	build-gcc-shared
	build-clang-static
	build-clang-shared
	build-x86-default


OS: UB1604-32
	Kernel Version: 4.4.0-131-generic
	CPU info: Intel(R) Xeon(R) CPU E5-2699 v4 @ 2.20GHz
	GCC Version: gcc (Ubuntu 5.4.0-6ubuntu1~16.04.11) 5.4.0 20160609
	Clang Version: 3.8.0-2ubuntu4 (tags/RELEASE_380/final)
	build-gcc-static
	build-gcc-shared
	build-clang-static
	build-clang-shared
	build-x86-default


OS: FC30-64
	Kernel Version: 5.0.9-301.fc30.x86_64
	CPU info: Intel(R) Xeon(R) CPU E5-2699 v4 @ 2.20GHz
	GCC Version: gcc (GCC) 9.1.1 20190503 (Red Hat 9.1.1-1)
	Clang Version: 8.0.0 (Fedora 8.0.0-1.fc30)
	build-gcc-static
	build-gcc-shared
	build-clang-static
	build-clang-shared
	build-x86-default


OS: WIN10-64
	Kernel Version: N/A
	CPU info: N/A
	GCC Version: N/A
	Clang Version: Clang 8.0.0
	x86_64-windows-clang


OS: FreeBSD12-64
	Kernel Version: 12.0-RC3
	CPU info: Intel(R) Xeon(R) CPU E5-2699 v4 @ 2.20GHz (2194.97-MHz K8-class CPU)
	GCC Version: gcc (FreeBSD Ports Collection) 7.3.0
	Clang Version: 6.0.1 (tags/RELEASE_601/final 335540) (based on LLVM 6.0.1)
	build-gcc-static
	build-gcc-shared
	build-clang-static
	build-clang-shared
	build-x86-default


OS: SUSE15-64
	Kernel Version: 4.12.14-lp150.11-default
	CPU info: Intel(R) Xeon(R) CPU E5-2699 v4 @ 2.20GHz
	GCC Version: gcc (SUSE Linux) 7.3.1 20180323 [gcc-7-branch revision 258812]
	Clang Version: 5.0.1 (tags/RELEASE_501/final 312548)
	build-gcc-static
	build-gcc-shared
	build-clang-static
	build-clang-shared
	build-x86-default


*Make Build Failed #1:
OS: RHEL76-64
Target: x86_64-native-linuxapp-gcc
/tmp/RHEL76-64_K3.10.0_GCC4.8.5/x86_64-native-linuxapp-gcc/05d3c1f17b3c4467a34f657b39749119/dpdk/x86_64-native-linuxapp-gcc/include/rte_higig.h:101:11: note: ‘opcode’ declared here
  uint16_t opcode:3;
           ^
cc1: error: unrecognized command line option "-Wno-address-of-packed-member" [-Werror]
cc1: all warnings being treated as errors
make[6]: *** [ark_ethdev.o] Error 1
make[5]: *** [ark] Error 2
make[4]: *** [net] Error 2
make[4]: *** Waiting for unfinished jobs....
  CC virtio_rxtx.o
  AR librte_pmd_crypto_scheduler.a
  INSTALL-LIB librte_pmd_crypto_scheduler.a
  CC otx_zip_pmd.o
--
  CC fpga_lte_fec.o.pmd.o
  INSTALL-LIB librte_pmd_octeontx_crypto.a
  LD fpga_lte_fec.o
  AR librte_pmd_bbdev_fpga_lte_fec.a
  INSTALL-LIB librte_pmd_bbdev_fpga_lte_fec.a
make[3]: *** [drivers] Error 2
make[2]: *** [all] Error 2
make[1]: *** [pre_install] Error 2
make: *** [install] Error 2


*Make Build Failed #2:
OS: CENTOS76-64
Target: x86_64-native-linuxapp-gcc+shared
/tmp/CENTOS76-64_K3.10.0_GCC4.8.5/x86_64-native-linuxapp-gcc+shared/05d3c1f17b3c4467a34f657b39749119/dpdk/x86_64-native-linuxapp-gcc/include/rte_higig.h:101:11: note: ‘opcode’ declared here
  uint16_t opcode:3;
           ^
cc1: error: unrecognized command line option "-Wno-address-of-packed-member" [-Werror]
cc1: all warnings being treated as errors
make[6]: *** [ark_ethdev.o] Error 1
make[5]: *** [ark] Error 2
make[5]: *** Waiting for unfinished jobs....
cc1: warning: unrecognized command line option "-Wno-address-of-packed-member" [enabled by default]
  CC otx_cryptodev_capabilities.o
  PMDINFO axgbe_ethdev.o.pmd.c
  CC axgbe_ethdev.o.pmd.o
--
  CC null_crypto_pmd.o.pmd.o
  LD librte_pmd_atlantic.so.1.1
  LD null_crypto_pmd.o
  CC rte_openssl_pmd_ops.o
  INSTALL-LIB librte_pmd_atlantic.so.1.1
make[4]: *** [net] Error 2
make[4]: *** Waiting for unfinished jobs....
  CC null_crypto_pmd_ops.o
  CC scheduler_multicore.o
== Build drivers/crypto/caam_jr
  CC mc/dpseci.o
--
  PMDINFO dpaa_sec.o.pmd.c
  CC dpaa_sec.o.pmd.o
  LD dpaa_sec.o
  LD librte_pmd_dpaa_sec.so.1.1
  INSTALL-LIB librte_pmd_dpaa_sec.so.1.1
make[3]: *** [drivers] Error 2
make[2]: *** [all] Error 2
make[1]: *** [pre_install] Error 2
make: *** [install] Error 2


*Make Build Failed #3:
OS: CENTOS76-64
Target: x86_64-native-linuxapp-gcc+debug
  uint16_t opcode:3;
           ^
  AR librte_pmd_bbdev_null.a
cc1: error: unrecognized command line option "-Wno-address-of-packed-member" [-Werror]
cc1: all warnings being treated as errors
make[6]: *** [ark_ethdev.o] Error 1
make[5]: *** [ark] Error 2
make[5]: *** Waiting for unfinished jobs....
  INSTALL-LIB librte_pmd_bbdev_null.a
  CC qat_sym_session.o
  PMDINFO isal_compress_pmd.o.pmd.c
  CC qat_sym_pmd.o
--
  CC null_crypto_pmd_ops.o
  CC rte_cryptodev_scheduler.o
  CC rte_openssl_pmd_ops.o
  AR librte_pmd_atlantic.a
  INSTALL-LIB librte_pmd_atlantic.a
make[4]: *** [net] Error 2
make[4]: *** Waiting for unfinished jobs....
== Build drivers/crypto/nitrox
  AR librte_pmd_null_crypto.a
  INSTALL-LIB librte_pmd_null_crypto.a
  CC scheduler_roundrobin.o
--
  LD dpaa_sec.o
  AR librte_pmd_dpaa_sec.a
  INSTALL-LIB librte_pmd_dpaa_sec.a
  AR librte_pmd_octeontx_crypto.a
  INSTALL-LIB librte_pmd_octeontx_crypto.a
make[3]: *** [drivers] Error 2
make[2]: *** [all] Error 2
make[1]: *** [pre_install] Error 2
make: *** [install] Error 2


*Make Build Failed #4:
OS: CENTOS76-64
Target: x86_64-native-linuxapp-gcc
/tmp/CENTOS76-64_K3.10.0_GCC4.8.5/x86_64-native-linuxapp-gcc/05d3c1f17b3c4467a34f657b39749119/dpdk/x86_64-native-linuxapp-gcc/include/rte_higig.h:101:11: note: ‘opcode’ declared here
  uint16_t opcode:3;
           ^
cc1: error: unrecognized command line option "-Wno-address-of-packed-member" [-Werror]
cc1: all warnings being treated as errors
make[6]: *** [ark_ethdev.o] Error 1
make[5]: *** [ark] Error 2
make[5]: *** Waiting for unfinished jobs....
  CC isal_compress_pmd_ops.o
  CC rte_aesni_mb_pmd_ops.o
== Build drivers/net/atlantic
  AR librte_pmd_bbdev_null.a
--
  CC scheduler_pkt_size_distr.o
  CC caam_jr_hw.o
  CC caam_jr_uio.o
  AR librte_pmd_atlantic.a
  INSTALL-LIB librte_pmd_atlantic.a
make[4]: *** [net] Error 2
make[4]: *** Waiting for unfinished jobs....
  CC scheduler_failover.o
  CC scheduler_multicore.o
  CC nitrox_device.o
  CC virtqueue.o
--
  LD dpaa2_sec_dpseci.o
  AR librte_pmd_dpaa2_sec.a
  INSTALL-LIB librte_pmd_dpaa2_sec.a
  AR librte_pmd_octeontx_crypto.a
  INSTALL-LIB librte_pmd_octeontx_crypto.a
make[3]: *** [drivers] Error 2
make[2]: *** [all] Error 2
make[1]: *** [pre_install] Error 2
make: *** [install] Error 2

*Meson Build Failed #1:
OS: UB1604-32
Target:build-gcc-static
test -d build && rmdir -p build || true
gcc -O3 -include rte_config.h -march=nehalem -I/tmp/UB1604-32_K4.4.0_GCC5.4.0/i686-native-linuxapp-gcc/05d3c1f17b3c4467a34f657b39749119/dpdk/build-x86-default/install-root/usr/local/include main.c -o build/l2fwd-shared  -L/tmp/UB1604-32_K4.4.0_GCC5.4.0/i686-native-linuxapp-gcc/05d3c1f17b3c4467a34f657b39749119/dpdk/build-x86-default/install-root/usr/local/lib -lrte_bpf -lrte_flow_classify -lrte_pipeline -lrte_table -lrte_port -lrte_ipsec -lrte_vhost -lrte_stack -lrte_security -lrte_sched -lrte_reorder -lrte_rcu -lrte_rawdev -lrte_pdump -lrte_power -lrte_member -lrte_lpm -lrte_latencystats -lrte_jobstats -lrte_ip_frag -lrte_gso -lrte_gro -lrte_eventdev -lrte_efd -lrte_distributor -lrte_cryptodev -lrte_compressdev -lrte_cfgfile -lrte_bitratestats -lrte_bbdev -lrte_acl -lrte_timer -lrte_hash -lrte_metrics -lrte_cmdline -lrte_pci -lrte_ethdev -lrte_meter -lrte_net -lrte_mbuf -lrte_mempool -lrte_ring -lrte_eal -lrte_kvargs
In file included from /tmp/UB1604-32_K4.4.0_GCC5.4.0/i686-native-linuxapp-gcc/05d3c1f17b3c4467a34f657b39749119/dpdk/build-x86-default/install-root/usr/local/include/rte_eth_ctrl.h:11:0,
                 from /tmp/UB1604-32_K4.4.0_GCC5.4.0/i686-native-linuxapp-gcc/05d3c1f17b3c4467a34f657b39749119/dpdk/build-x86-default/install-root/usr/local/include/rte_ethdev.h:891,
                 from main.c:38:
/tmp/UB1604-32_K4.4.0_GCC5.4.0/i686-native-linuxapp-gcc/05d3c1f17b3c4467a34f657b39749119/dpdk/build-x86-default/install-root/usr/local/include/rte_flow.h:30:23: fatal error: rte_higig.h: No such file or directory
compilation terminated.
Makefile:28: recipe for target 'build/l2fwd-shared' failed
make: *** [build/l2fwd-shared] Error 1
make: Leaving directory '/tmp/UB1604-32_K4.4.0_GCC5.4.0/i686-native-linuxapp-gcc/05d3c1f17b3c4467a34f657b39749119/dpdk/build-x86-default/install-root/usr/local/share/dpdk/examples/l2fwd'
## Building l3fwd
make: Entering directory '/tmp/UB1604-32_K4.4.0_GCC5.4.0/i686-native-linuxapp-gcc/05d3c1f17b3c4467a34f657b39749119/dpdk/build-x86-default/install-root/usr/local/share/dpdk/examples/l3fwd'
Unknown option --path
rm -f build/l3fwd build/l3fwd-static build/l3fwd-shared
test -d build && rmdir -p build || true
gcc -O3 -include rte_config.h -march=nehalem -I/tmp/UB1604-32_K4.4.0_GCC5.4.0/i686-native-linuxapp-gcc/05d3c1f17b3c4467a34f657b39749119/dpdk/build-x86-default/install-root/usr/local/include main.c l3fwd_lpm.c l3fwd_em.c -o build/l3fwd-shared  -L/tmp/UB1604-32_K4.4.0_GCC5.4.0/i686-native-linuxapp-gcc/05d3c1f17b3c4467a34f657b39749119/dpdk/build-x86-default/install-root/usr/local/lib -lrte_bpf -lrte_flow_classify -lrte_pipeline -lrte_table -lrte_port -lrte_ipsec -lrte_vhost -lrte_stack -lrte_security -lrte_sched -lrte_reorder -lrte_rcu -lrte_rawdev -lrte_pdump -lrte_power -lrte_member -lrte_lpm -lrte_latencystats -lrte_jobstats -lrte_ip_frag -lrte_gso -lrte_gro -lrte_eventdev -lrte_efd -lrte_distributor -lrte_cryptodev -lrte_compressdev -lrte_cfgfile -lrte_bitratestats -lrte_bbdev -lrte_acl -lrte_timer -lrte_hash -lrte_metrics -lrte_cmdline -lrte_pci -lrte_ethdev -lrte_meter -lrte_net -lrte_mbuf -lrte_mempool -lrte_ring -lrte_eal -lrte_kvargs
In file included from /tmp/UB1604-32_K4.4.0_GCC5.4.0/i686-native-linuxapp-gcc/05d3c1f17b3c4467a34f657b39749119/dpdk/build-x86-default/install-root/usr/local/include/rte_eth_ctrl.h:11:0,
                 from /tmp/UB1604-32_K4.4.0_GCC5.4.0/i686-native-linuxapp-gcc/05d3c1f17b3c4467a34f657b39749119/dpdk/build-x86-default/install-root/usr/local/include/rte_ethdev.h:891,
                 from main.c:36:
/tmp/UB1604-32_K4.4.0_GCC5.4.0/i686-native-linuxapp-gcc/05d3c1f17b3c4467a34f657b39749119/dpdk/build-x86-default/install-root/usr/local/include/rte_flow.h:30:23: fatal error: rte_higig.h: No such file or directory
compilation terminated.
In file included from /tmp/UB1604-32_K4.4.0_GCC5.4.0/i686-native-linuxapp-gcc/05d3c1f17b3c4467a34f657b39749119/dpdk/build-x86-default/install-root/usr/local/include/rte_eth_ctrl.h:11:0,
                 from /tmp/UB1604-32_K4.4.0_GCC5.4.0/i686-native-linuxapp-gcc/05d3c1f17b3c4467a34f657b39749119/dpdk/build-x86-default/install-root/usr/local/include/rte_ethdev.h:891,
                 from l3fwd_lpm.c:21:
/tmp/UB1604-32_K4.4.0_GCC5.4.0/i686-native-linuxapp-gcc/05d3c1f17b3c4467a34f657b39749119/dpdk/build-x86-default/install-root/usr/local/include/rte_flow.h:30:23: fatal error: rte_higig.h: No such file or directory
compilation terminated.
In file included from /tmp/UB1604-32_K4.4.0_GCC5.4.0/i686-native-linuxapp-gcc/05d3c1f17b3c4467a34f657b39749119/dpdk/build-x86-default/install-root/usr/local/include/rte_eth_ctrl.h:11:0,
                 from /tmp/UB1604-32_K4.4.0_GCC5.4.0/i686-native-linuxapp-gcc/05d3c1f17b3c4467a34f657b39749119/dpdk/build-x86-default/install-root/usr/local/include/rte_ethdev.h:891,
                 from l3fwd_em.c:20:
/tmp/UB1604-32_K4.4.0_GCC5.4.0/i686-native-linuxapp-gcc/05d3c1f17b3c4467a34f657b39749119/dpdk/build-x86-default/install-root/usr/local/include/rte_flow.h:30:23: fatal error: rte_higig.h: No such file or directory
compilation terminated.
Makefile:28: recipe for target 'build/l3fwd-shared' failed
make: *** [build/l3fwd-shared] Error 1
make: Leaving directory '/tmp/UB1604-32_K4.4.0_GCC5.4.0/i686-native-linuxapp-gcc/05d3c1f17b3c4467a34f657b39749119/dpdk/build-x86-default/install-root/usr/local/share/dpdk/examples/l3fwd'
## Building skeleton
make: Entering directory '/tmp/UB1604-32_K4.4.0_GCC5.4.0/i686-native-linuxapp-gcc/05d3c1f17b3c4467a34f657b39749119/dpdk/build-x86-default/install-root/usr/local/share/dpdk/examples/skeleton'
Unknown option --path
rm -f build/basicfwd build/basicfwd-static build/basicfwd-shared
test -d build && rmdir -p build || true
gcc -O3 -include rte_config.h -march=nehalem -I/tmp/UB1604-32_K4.4.0_GCC5.4.0/i686-native-linuxapp-gcc/05d3c1f17b3c4467a34f657b39749119/dpdk/build-x86-default/install-root/usr/local/include basicfwd.c -o build/basicfwd-shared  -L/tmp/UB1604-32_K4.4.0_GCC5.4.0/i686-native-linuxapp-gcc/05d3c1f17b3c4467a34f657b39749119/dpdk/build-x86-default/install-root/usr/local/lib -lrte_bpf -lrte_flow_classify -lrte_pipeline -lrte_table -lrte_port -lrte_ipsec -lrte_vhost -lrte_stack -lrte_security -lrte_sched -lrte_reorder -lrte_rcu -lrte_rawdev -lrte_pdump -lrte_power -lrte_member -lrte_lpm -lrte_latencystats -lrte_jobstats -lrte_ip_frag -lrte_gso -lrte_gro -lrte_eventdev -lrte_efd -lrte_distributor -lrte_cryptodev -lrte_compressdev -lrte_cfgfile -lrte_bitratestats -lrte_bbdev -lrte_acl -lrte_timer -lrte_hash -lrte_metrics -lrte_cmdline -lrte_pci -lrte_ethdev -lrte_meter -lrte_net -lrte_mbuf -lrte_mempool -lrte_ring -lrte_eal -lrte_kvargs
In file included from /tmp/UB1604-32_K4.4.0_GCC5.4.0/i686-native-linuxapp-gcc/05d3c1f17b3c4467a34f657b39749119/dpdk/build-x86-default/install-root/usr/local/include/rte_eth_ctrl.h:11:0,
                 from /tmp/UB1604-32_K4.4.0_GCC5.4.0/i686-native-linuxapp-gcc/05d3c1f17b3c4467a34f657b39749119/dpdk/build-x86-default/install-root/usr/local/include/rte_ethdev.h:891,
                 from basicfwd.c:8:
/tmp/UB1604-32_K4.4.0_GCC5.4.0/i686-native-linuxapp-gcc/05d3c1f17b3c4467a34f657b39749119/dpdk/build-x86-default/install-root/usr/local/include/rte_flow.h:30:23: fatal error: rte_higig.h: No such file or directory
compilation terminated.
Makefile:28: recipe for target 'build/basicfwd-shared' failed
make: *** [build/basicfwd-shared] Error 1
make: Leaving directory '/tmp/UB1604-32_K4.4.0_GCC5.4.0/i686-native-linuxapp-gcc/05d3c1f17b3c4467a34f657b39749119/dpdk/build-x86-default/install-root/usr/local/share/dpdk/examples/skeleton'
## Building timer
make: Entering directory '/tmp/UB1604-32_K4.4.0_GCC5.4.0/i686-native-linuxapp-gcc/05d3c1f17b3c4467a34f657b39749119/dpdk/build-x86-default/install-root/usr/local/share/dpdk/examples/timer'
Unknown option --path
rm -f build/timer build/timer-static build/timer-shared


*Meson Build Failed #2:
OS: UB1804-64
Target:build-gcc-static
test -d build && rmdir -p build || true
gcc -O3 -include rte_config.h -march=nehalem -mno-avx512f -I/tmp/UB1804-64_K4.15.0_GCC7.3.0/x86_64-native-linuxapp-gcc/05d3c1f17b3c4467a34f657b39749119/dpdk/build-x86-default/install-root/usr/local/include -I/usr/lib/include main.c -o build/l2fwd-shared  -L/tmp/UB1804-64_K4.15.0_GCC7.3.0/x86_64-native-linuxapp-gcc/05d3c1f17b3c4467a34f657b39749119/dpdk/build-x86-default/install-root/usr/local/lib -lrte_bpf -lrte_flow_classify -lrte_pipeline -lrte_table -lrte_port -lrte_ipsec -lrte_vhost -lrte_stack -lrte_security -lrte_sched -lrte_reorder -lrte_rcu -lrte_rawdev -lrte_pdump -lrte_power -lrte_member -lrte_lpm -lrte_latencystats -lrte_kni -lrte_jobstats -lrte_ip_frag -lrte_gso -lrte_gro -lrte_eventdev -lrte_efd -lrte_distributor -lrte_cryptodev -lrte_compressdev -lrte_cfgfile -lrte_bitratestats -lrte_bbdev -lrte_acl -lrte_timer -lrte_hash -lrte_metrics -lrte_cmdline -lrte_pci -lrte_ethdev -lrte_meter -lrte_net -lrte_mbuf -lrte_mempool -lrte_ring -lrte_eal -lrte_kvargs
In file included from /tmp/UB1804-64_K4.15.0_GCC7.3.0/x86_64-native-linuxapp-gcc/05d3c1f17b3c4467a34f657b39749119/dpdk/build-x86-default/install-root/usr/local/include/rte_eth_ctrl.h:11:0,
                 from /tmp/UB1804-64_K4.15.0_GCC7.3.0/x86_64-native-linuxapp-gcc/05d3c1f17b3c4467a34f657b39749119/dpdk/build-x86-default/install-root/usr/local/include/rte_ethdev.h:891,
                 from main.c:38:
/tmp/UB1804-64_K4.15.0_GCC7.3.0/x86_64-native-linuxapp-gcc/05d3c1f17b3c4467a34f657b39749119/dpdk/build-x86-default/install-root/usr/local/include/rte_flow.h:30:10: fatal error: rte_higig.h: No such file or directory
 #include <rte_higig.h>
          ^~~~~~~~~~~~~
compilation terminated.
Makefile:28: recipe for target 'build/l2fwd-shared' failed
make: *** [build/l2fwd-shared] Error 1
make: Leaving directory '/tmp/UB1804-64_K4.15.0_GCC7.3.0/x86_64-native-linuxapp-gcc/05d3c1f17b3c4467a34f657b39749119/dpdk/build-x86-default/install-root/usr/local/share/dpdk/examples/l2fwd'
## Building l3fwd
make: Entering directory '/tmp/UB1804-64_K4.15.0_GCC7.3.0/x86_64-native-linuxapp-gcc/05d3c1f17b3c4467a34f657b39749119/dpdk/build-x86-default/install-root/usr/local/share/dpdk/examples/l3fwd'
Unknown option --path
rm -f build/l3fwd build/l3fwd-static build/l3fwd-shared
test -d build && rmdir -p build || true
gcc -O3 -include rte_config.h -march=nehalem -mno-avx512f -I/tmp/UB1804-64_K4.15.0_GCC7.3.0/x86_64-native-linuxapp-gcc/05d3c1f17b3c4467a34f657b39749119/dpdk/build-x86-default/install-root/usr/local/include -I/usr/lib/include main.c l3fwd_lpm.c l3fwd_em.c -o build/l3fwd-shared  -L/tmp/UB1804-64_K4.15.0_GCC7.3.0/x86_64-native-linuxapp-gcc/05d3c1f17b3c4467a34f657b39749119/dpdk/build-x86-default/install-root/usr/local/lib -lrte_bpf -lrte_flow_classify -lrte_pipeline -lrte_table -lrte_port -lrte_ipsec -lrte_vhost -lrte_stack -lrte_security -lrte_sched -lrte_reorder -lrte_rcu -lrte_rawdev -lrte_pdump -lrte_power -lrte_member -lrte_lpm -lrte_latencystats -lrte_kni -lrte_jobstats -lrte_ip_frag -lrte_gso -lrte_gro -lrte_eventdev -lrte_efd -lrte_distributor -lrte_cryptodev -lrte_compressdev -lrte_cfgfile -lrte_bitratestats -lrte_bbdev -lrte_acl -lrte_timer -lrte_hash -lrte_metrics -lrte_cmdline -lrte_pci -lrte_ethdev -lrte_meter -lrte_net -lrte_mbuf -lrte_mempool -lrte_ring -lrte_eal -lrte_kvargs
In file included from /tmp/UB1804-64_K4.15.0_GCC7.3.0/x86_64-native-linuxapp-gcc/05d3c1f17b3c4467a34f657b39749119/dpdk/build-x86-default/install-root/usr/local/include/rte_eth_ctrl.h:11:0,
                 from /tmp/UB1804-64_K4.15.0_GCC7.3.0/x86_64-native-linuxapp-gcc/05d3c1f17b3c4467a34f657b39749119/dpdk/build-x86-default/install-root/usr/local/include/rte_ethdev.h:891,
                 from main.c:36:
/tmp/UB1804-64_K4.15.0_GCC7.3.0/x86_64-native-linuxapp-gcc/05d3c1f17b3c4467a34f657b39749119/dpdk/build-x86-default/install-root/usr/local/include/rte_flow.h:30:10: fatal error: rte_higig.h: No such file or directory
 #include <rte_higig.h>
          ^~~~~~~~~~~~~
compilation terminated.
In file included from /tmp/UB1804-64_K4.15.0_GCC7.3.0/x86_64-native-linuxapp-gcc/05d3c1f17b3c4467a34f657b39749119/dpdk/build-x86-default/install-root/usr/local/include/rte_eth_ctrl.h:11:0,
                 from /tmp/UB1804-64_K4.15.0_GCC7.3.0/x86_64-native-linuxapp-gcc/05d3c1f17b3c4467a34f657b39749119/dpdk/build-x86-default/install-root/usr/local/include/rte_ethdev.h:891,
                 from l3fwd_lpm.c:21:
/tmp/UB1804-64_K4.15.0_GCC7.3.0/x86_64-native-linuxapp-gcc/05d3c1f17b3c4467a34f657b39749119/dpdk/build-x86-default/install-root/usr/local/include/rte_flow.h:30:10: fatal error: rte_higig.h: No such file or directory
 #include <rte_higig.h>
          ^~~~~~~~~~~~~
compilation terminated.
In file included from /tmp/UB1804-64_K4.15.0_GCC7.3.0/x86_64-native-linuxapp-gcc/05d3c1f17b3c4467a34f657b39749119/dpdk/build-x86-default/install-root/usr/local/include/rte_eth_ctrl.h:11:0,
                 from /tmp/UB1804-64_K4.15.0_GCC7.3.0/x86_64-native-linuxapp-gcc/05d3c1f17b3c4467a34f657b39749119/dpdk/build-x86-default/install-root/usr/local/include/rte_ethdev.h:891,
                 from l3fwd_em.c:20:
/tmp/UB1804-64_K4.15.0_GCC7.3.0/x86_64-native-linuxapp-gcc/05d3c1f17b3c4467a34f657b39749119/dpdk/build-x86-default/install-root/usr/local/include/rte_flow.h:30:10: fatal error: rte_higig.h: No such file or directory
 #include <rte_higig.h>
          ^~~~~~~~~~~~~
compilation terminated.
Makefile:28: recipe for target 'build/l3fwd-shared' failed
make: *** [build/l3fwd-shared] Error 1
make: Leaving directory '/tmp/UB1804-64_K4.15.0_GCC7.3.0/x86_64-native-linuxapp-gcc/05d3c1f17b3c4467a34f657b39749119/dpdk/build-x86-default/install-root/usr/local/share/dpdk/examples/l3fwd'
## Building skeleton
make: Entering directory '/tmp/UB1804-64_K4.15.0_GCC7.3.0/x86_64-native-linuxapp-gcc/05d3c1f17b3c4467a34f657b39749119/dpdk/build-x86-default/install-root/usr/local/share/dpdk/examples/skeleton'
Unknown option --path
rm -f build/basicfwd build/basicfwd-static build/basicfwd-shared
test -d build && rmdir -p build || true
gcc -O3 -include rte_config.h -march=nehalem -mno-avx512f -I/tmp/UB1804-64_K4.15.0_GCC7.3.0/x86_64-native-linuxapp-gcc/05d3c1f17b3c4467a34f657b39749119/dpdk/build-x86-default/install-root/usr/local/include -I/usr/lib/include basicfwd.c -o build/basicfwd-shared  -L/tmp/UB1804-64_K4.15.0_GCC7.3.0/x86_64-native-linuxapp-gcc/05d3c1f17b3c4467a34f657b39749119/dpdk/build-x86-default/install-root/usr/local/lib -lrte_bpf -lrte_flow_classify -lrte_pipeline -lrte_table -lrte_port -lrte_ipsec -lrte_vhost -lrte_stack -lrte_security -lrte_sched -lrte_reorder -lrte_rcu -lrte_rawdev -lrte_pdump -lrte_power -lrte_member -lrte_lpm -lrte_latencystats -lrte_kni -lrte_jobstats -lrte_ip_frag -lrte_gso -lrte_gro -lrte_eventdev -lrte_efd -lrte_distributor -lrte_cryptodev -lrte_compressdev -lrte_cfgfile -lrte_bitratestats -lrte_bbdev -lrte_acl -lrte_timer -lrte_hash -lrte_metrics -lrte_cmdline -lrte_pci -lrte_ethdev -lrte_meter -lrte_net -lrte_mbuf -lrte_mempool -lrte_ring -lrte_eal -lrte_kvargs
In file included from /tmp/UB1804-64_K4.15.0_GCC7.3.0/x86_64-native-linuxapp-gcc/05d3c1f17b3c4467a34f657b39749119/dpdk/build-x86-default/install-root/usr/local/include/rte_eth_ctrl.h:11:0,
                 from /tmp/UB1804-64_K4.15.0_GCC7.3.0/x86_64-native-linuxapp-gcc/05d3c1f17b3c4467a34f657b39749119/dpdk/build-x86-default/install-root/usr/local/include/rte_ethdev.h:891,
                 from basicfwd.c:8:
/tmp/UB1804-64_K4.15.0_GCC7.3.0/x86_64-native-linuxapp-gcc/05d3c1f17b3c4467a34f657b39749119/dpdk/build-x86-default/install-root/usr/local/include/rte_flow.h:30:10: fatal error: rte_higig.h: No such file or directory
 #include <rte_higig.h>
          ^~~~~~~~~~~~~
compilation terminated.
Makefile:28: recipe for target 'build/basicfwd-shared' failed
make: *** [build/basicfwd-shared] Error 1
make: Leaving directory '/tmp/UB1804-64_K4.15.0_GCC7.3.0/x86_64-native-linuxapp-gcc/05d3c1f17b3c4467a34f657b39749119/dpdk/build-x86-default/install-root/usr/local/share/dpdk/examples/skeleton'
## Building timer
make: Entering directory '/tmp/UB1804-64_K4.15.0_GCC7.3.0/x86_64-native-linuxapp-gcc/05d3c1f17b3c4467a34f657b39749119/dpdk/build-x86-default/install-root/usr/local/share/dpdk/examples/timer'
Unknown option --path
rm -f build/timer build/timer-static build/timer-shared

DPDK STV team


More information about the test-report mailing list