[dpdk-test-report] |FAILURE| pw(76550) [v8, 8/8] net/dpaa: add RSS update func with FMCless

sys_stv at intel.com sys_stv at intel.com
Fri Sep 4 12:15:13 CEST 2020


Test-Label: Intel-compilation
Test-Status: FAILURE
http://dpdk.org/patch/76550

_Compilation issues_

Submitter: Hemant Agrawal <hemant.agrawal at nxp.com>
Date: 2020-09-04 08:39:30
Reply_mail: 20200904083930.17608-8-hemant.agrawal at nxp.com

DPDK git baseline: Repo:dpdk-next-net, CommitID: 14c8e679ee5650d5f3a0c0a1c86f3d6e2691ba29


Meson build Summary: 8 Builds Done, 8 Successful, 0 Failures, 0 Blocked

Makefile build Summary: 20 Builds Done, 4 Successful, 16 Failures, 0 Blocked

                +==============================================+===========+==========+
                |                   Makefile                   |   Meson   | Document |
+----------------+------+-------+------+------------+-----------+-----------+----------+
| os             | gcc  | clang | icc  | gcc+shared | gcc+debug | gcc/clang | pdf/html |
+----------------+------+-------+------+------------+-----------+-----------+----------+
| CENTOS82-64    | FAIL | FAIL  | FAIL | FAIL       | FAIL      | pass      |          |
| RHEL82-64      | FAIL |       |      |            |           |           |          |
| UB1804-64      | FAIL |       |      |            |           |           |          |
| FC32-64        | FAIL | FAIL  |      |            |           | pass      |          |
| CENTOS77-64    | FAIL |       |      |            |           |           |          |
| UB2004-64      | FAIL | FAIL  | FAIL |            |           | pass      | pass     |
| WIN10-64       |      |       |      |            |           | pass      |          |
| UB2004-32      | FAIL |       |      |            |           | pass      |          |
| FreeBSD1201-64 | pass | pass  |      | pass       | pass      | pass      |          |
| SUSE15-64      | FAIL | FAIL  |      |            |           | pass      |          |
+----------------+------+-------+------+------------+-----------+-----------+----------+
Test environment and configuration as below:

** Makefile build **


OS: CENTOS82-64
	Kernel Version: 4.18.0-193.el8.x86_64
	CPU info: Intel(R) Xeon(R) Platinum 8280M CPU @ 2.70GHz
	GCC Version: gcc (GCC) 8.3.1 20191121 (Red Hat 8.3.1-5)
	Clang Version: 9.0.1 (Red Hat 9.0.1-2.module_el8.2.0+309+0c7b6b03)
	x86_64-native-linuxapp-gcc
	x86_64-native-linuxapp-clang
	x86_64-native-linuxapp-icc
	x86_64-native-linuxapp-gcc+shared
	x86_64-native-linuxapp-gcc+debug


OS: RHEL82-64
	Kernel Version: 4.18.0-193.el8.x86_64
	CPU info: Intel(R) Xeon(R) Platinum 8280M CPU @ 2.70GHz
	GCC Version: gcc (GCC) 8.3.1 20191121 (Red Hat 8.3.1-5)
	Clang Version: 8.0.1 (Red Hat 8.0.1-1.module_el8.1.0+215+a01033fb)
	x86_64-native-linuxapp-gcc


OS: UB1804-64
	Kernel Version: 5.3.0-59-generic
	CPU info: Intel(R) Xeon(R) Platinum 8180 CPU @ 2.50GHz
	GCC Version: gcc (Ubuntu 7.5.0-3ubuntu1~18.04) 7.5.0
	Clang Version: 6.0.0-1ubuntu2 (tags/RELEASE_600/final)
	x86_64-native-linuxapp-gcc


OS: FC32-64
	Kernel Version: 5.6.0-0.rc7.git0.2.fc32.x86_64
	CPU info: Intel(R) Xeon(R) Platinum 8280M CPU @ 2.70GHz
	GCC Version: gcc (GCC) 10.0.1 20200311 (Red Hat 10.0.1-0.9)
	Clang Version: 10.0.0 (Fedora 10.0.0-0.3.rc4.fc32)
	x86_64-native-linuxapp-gcc
	x86_64-native-linuxapp-clang


OS: CENTOS77-64
	Kernel Version: 3.10.0-1062.9.1.el7.x86_64
	CPU info: Intel(R) Xeon(R) Platinum 8280M CPU @ 2.70GHz
	GCC Version: gcc (GCC) 4.8.5 20150623 (Red Hat 4.8.5-39)
	Clang Version: 3.4.2 (tags/RELEASE_34/dot2-final)
	x86_64-native-linuxapp-gcc


OS: UB2004-64
	Kernel Version: 5.4.0-26-generic
	CPU info: Intel(R) Xeon(R) Platinum 8180 CPU @ 2.50GHz
	GCC Version: gcc (Ubuntu 10-20200416-0ubuntu1) 10.0.1 20200416 (experimental) [master revision 3c3f12e2a76:dcee354ce56:44b326839d864fc10c459916abcc97f35a9ac3de]
	Clang Version: 10.0.0-4ubuntu1
	x86_64-native-linuxapp-clang
	x86_64-native-linuxapp-gcc
	x86_64-native-linuxapp-icc


OS: UB2004-32
	Kernel Version: 5.4.0-26-generic
	CPU info: Intel(R) Xeon(R) Platinum 8180 CPU @ 2.50GHz
	GCC Version: gcc (Ubuntu 9.3.0-10ubuntu2) 9.3.0
	Clang Version: 10.0.0-4ubuntu1
	i686-native-linuxapp-gcc


OS: FreeBSD1201-64
	Kernel Version: 12.1-RELEASE
	CPU info: Intel(R) Xeon(R) CPU E5-2699 v3 @ 2.30GHz (2294.74-MHz K8-class CPU)
	GCC Version: gcc (FreeBSD Ports Collection) 9.2.0
	Clang Version: 8.0.1 (tags/RELEASE_801/final 366581) (based on LLVM 8.0.1)
	x86_64-native-bsdapp-gcc
	x86_64-native-bsdapp-clang
	x86_64-native-bsdapp-gcc+shared
	x86_64-native-bsdapp-gcc+debug


OS: SUSE15-64
	Kernel Version: 4.12.14-lp150.11-default
	CPU info: Intel(R) Xeon(R) CPU E5-2699 v4 @ 2.20GHz
	GCC Version: gcc (SUSE Linux) 7.3.1 20180323 [gcc-7-branch revision 258812]
	Clang Version: 5.0.1 (tags/RELEASE_501/final 312548)
	x86_64-native-linuxapp-clang
	x86_64-native-linuxapp-gcc

** Meson build **


OS: CENTOS82-64
	Kernel Version: 4.18.0-193.el8.x86_64
	CPU info: Intel(R) Xeon(R) CPU E5-2699 v4 @ 2.20GHz
	GCC Version: gcc (GCC) 8.3.1 20191121 (Red Hat 8.3.1-5)
	Clang Version: 9.0.1 (Red Hat 9.0.1-2.module_el8.2.0+309+0c7b6b03)
	./build-gcc-static
	./build-gcc-shared
	./build-clang-static
	./build-clang-shared
	./build-x86-default


OS: UB2004-64
	Kernel Version: 5.4.0-26-generic
	CPU info: Intel(R) Xeon(R) Platinum 8180 CPU @ 2.50GHz
	GCC Version: gcc (Ubuntu 9.3.0-10ubuntu2) 9.3.0
	Clang Version: 10.0.0-4ubuntu1
	x86_64-native-linuxapp-doc
	./build-gcc-static
	./build-gcc-shared
	./build-clang-static
	./build-clang-shared
	./build-x86-default


OS: FC32-64
	Kernel Version: 5.6.0-0.rc7.git0.2.fc32.x86_64
	CPU info: Intel(R) Xeon(R) CPU E5-2699 v4 @ 2.20GHz
	GCC Version: gcc (GCC) 10.0.1 20200311 (Red Hat 10.0.1-0.9)
	Clang Version: 10.0.0 (Fedora 10.0.0-0.3.rc4.fc32)
	./build-gcc-static
	./build-gcc-shared
	./build-clang-static
	./build-clang-shared
	./build-x86-default


OS: WIN10-64
	Kernel Version: N/A
	CPU info: N/A
	GCC Version: N/A
	Clang Version: Clang 8.0.0
	x86_64-windows-clang


OS: UB2004-32
	Kernel Version: 5.4.0-26-generic
	CPU info: Intel(R) Xeon(R) CPU E5-2699 v4 @ 2.20GHz
	GCC Version: gcc (Ubuntu 9.3.0-10ubuntu2) 9.3.0
	Clang Version: 10.0.0-4ubuntu1
	./build-gcc-static
	./build-gcc-shared
	./build-x86-default
	/root/UB2004-32_K4.15.0_GCC9.3.0/i686-native-linuxapp-gcc/a0a4e391698e4d3493eb55745b7f9ff8/dpdk/build-x86-default install >/dev/null


OS: FreeBSD1201-64
	Kernel Version: 12.1-RELEASE
	CPU info: Intel(R) Xeon(R) CPU E5-2699 v4 @ 2.20GHz (2194.97-MHz K8-class CPU)
	GCC Version: gcc (FreeBSD Ports Collection) 9.2.0
	Clang Version: 8.0.1 (tags/RELEASE_801/final 366581) (based on LLVM 8.0.1)
	./build-gcc-static
	./build-gcc-shared
	./build-clang-static
	./build-clang-shared
	./build-x86-default


OS: SUSE15-64
	Kernel Version: 4.12.14-lp150.12.82-default
	CPU info: Intel(R) Xeon(R) CPU E5-2699 v4 @ 2.20GHz
	GCC Version: gcc (SUSE Linux) 7.4.1 20190905 [gcc-7-branch revision 275407]
	Clang Version: 5.0.1 (tags/RELEASE_501/final 312548)
	./build-gcc-static
	./build-gcc-shared
	./build-clang-static
	./build-clang-shared
	./build-x86-default



*Makefile Build Failed #1:
OS: CENTOS77-64
Target: x86_64-native-linuxapp-gcc
dpaa_ethdev.c:(.text+0x1663): undefined reference to `dpaa_port_vsp_update'
/root/CENTOS77-64_K3.10.0_GCC4.8.5/x86_64-native-linuxapp-gcc/a0a4e391698e4d3493eb55745b7f9ff8/dpdk/x86_64-native-linuxapp-gcc/lib/librte_pmd_dpaa.a(dpaa_ethdev.o): In function `rte_dpaa_probe':
dpaa_ethdev.c:(.text+0x27fe): undefined reference to `dpaa_port_fmc_init'
collect2: error: ld returned 1 exit status
make[5]: *** [testsad] Error 1
make[4]: *** [test-sad] Error 2
make[4]: *** Waiting for unfinished jobs....
  CC runtime.o
  CC test_resource.o
--
dpaa_ethdev.c:(.text+0x1663): undefined reference to `dpaa_port_vsp_update'
/root/CENTOS77-64_K3.10.0_GCC4.8.5/x86_64-native-linuxapp-gcc/a0a4e391698e4d3493eb55745b7f9ff8/dpdk/x86_64-native-linuxapp-gcc/lib/librte_pmd_dpaa.a(dpaa_ethdev.o): In function `rte_dpaa_probe':
dpaa_ethdev.c:(.text+0x27fe): undefined reference to `dpaa_port_fmc_init'
collect2: error: ld returned 1 exit status
make[5]: *** [dpdk-procinfo] Error 1
make[4]: *** [proc-info] Error 2
  CC pipeline_lpm.o
  CC main.o
/root/CENTOS77-64_K3.10.0_GCC4.8.5/x86_64-native-linuxapp-gcc/a0a4e391698e4d3493eb55745b7f9ff8/dpdk/x86_64-native-linuxapp-gcc/lib/librte_pmd_dpaa.a(dpaa_ethdev.o): In function `dpaa_eth_rx_queue_setup':
dpaa_ethdev.c:(.text+0x1663): undefined reference to `dpaa_port_vsp_update'
/root/CENTOS77-64_K3.10.0_GCC4.8.5/x86_64-native-linuxapp-gcc/a0a4e391698e4d3493eb55745b7f9ff8/dpdk/x86_64-native-linuxapp-gcc/lib/librte_pmd_dpaa.a(dpaa_ethdev.o): In function `rte_dpaa_probe':
dpaa_ethdev.c:(.text+0x27fe): undefined reference to `dpaa_port_fmc_init'
collect2: error: ld returned 1 exit status
make[5]: *** [cmdline_test] Error 1
make[4]: *** [test-cmdline] Error 2
  CC test_prefetch.o
  CC pipeline_lpm_ipv6.o
/root/CENTOS77-64_K3.10.0_GCC4.8.5/x86_64-native-linuxapp-gcc/a0a4e391698e4d3493eb55745b7f9ff8/dpdk/x86_64-native-linuxapp-gcc/lib/librte_pmd_dpaa.a(dpaa_ethdev.o): In function `dpaa_eth_rx_queue_setup':
dpaa_ethdev.c:(.text+0x1663): undefined reference to `dpaa_port_vsp_update'
/root/CENTOS77-64_K3.10.0_GCC4.8.5/x86_64-native-linuxapp-gcc/a0a4e391698e4d3493eb55745b7f9ff8/dpdk/x86_64-native-linuxapp-gcc/lib/librte_pmd_dpaa.a(dpaa_ethdev.o): In function `rte_dpaa_probe':
dpaa_ethdev.c:(.text+0x27fe): undefined reference to `dpaa_port_fmc_init'
collect2: error: ld returned 1 exit status
make[5]: *** [testacl] Error 1
make[4]: *** [test-acl] Error 2
  CC test_byteorder.o
  CC pipeline_acl.o
/root/CENTOS77-64_K3.10.0_GCC4.8.5/x86_64-native-linuxapp-gcc/a0a4e391698e4d3493eb55745b7f9ff8/dpdk/x86_64-native-linuxapp-gcc/lib/librte_pmd_dpaa.a(dpaa_ethdev.o): In function `dpaa_eth_rx_queue_setup':
dpaa_ethdev.c:(.text+0x1663): undefined reference to `dpaa_port_vsp_update'
/root/CENTOS77-64_K3.10.0_GCC4.8.5/x86_64-native-linuxapp-gcc/a0a4e391698e4d3493eb55745b7f9ff8/dpdk/x86_64-native-linuxapp-gcc/lib/librte_pmd_dpaa.a(dpaa_ethdev.o): In function `rte_dpaa_probe':
dpaa_ethdev.c:(.text+0x27fe): undefined reference to `dpaa_port_fmc_init'
collect2: error: ld returned 1 exit status
make[5]: *** [dpdk-pdump] Error 1
  CC parameters.o
make[4]: *** [pdump] Error 2
  CC cmdline.o
/root/CENTOS77-64_K3.10.0_GCC4.8.5/x86_64-native-linuxapp-gcc/a0a4e391698e4d3493eb55745b7f9ff8/dpdk/x86_64-native-linuxapp-gcc/lib/librte_pmd_dpaa.a(dpaa_ethdev.o): In function `dpaa_eth_rx_queue_setup':
dpaa_ethdev.c:(.text+0x1663): undefined reference to `dpaa_port_vsp_update'
/root/CENTOS77-64_K3.10.0_GCC4.8.5/x86_64-native-linuxapp-gcc/a0a4e391698e4d3493eb55745b7f9ff8/dpdk/x86_64-native-linuxapp-gcc/lib/librte_pmd_dpaa.a(dpaa_ethdev.o): In function `rte_dpaa_probe':
dpaa_ethdev.c:(.text+0x27fe): undefined reference to `dpaa_port_fmc_init'
collect2: error: ld returned 1 exit status
make[5]: *** [testfib] Error 1
make[4]: *** [test-fib] Error 2
  CC cmdline_flow.o
  CC test_per_lcore.o
  CC test_atomic.o
--
dpaa_ethdev.c:(.text+0x1663): undefined reference to `dpaa_port_vsp_update'
/root/CENTOS77-64_K3.10.0_GCC4.8.5/x86_64-native-linuxapp-gcc/a0a4e391698e4d3493eb55745b7f9ff8/dpdk/x86_64-native-linuxapp-gcc/lib/librte_pmd_dpaa.a(dpaa_ethdev.o): In function `rte_dpaa_probe':
dpaa_ethdev.c:(.text+0x27fe): undefined reference to `dpaa_port_fmc_init'
collect2: error: ld returned 1 exit status
make[5]: *** [testpipeline] Error 1
make[4]: *** [test-pipeline] Error 2
  CC test_bitops.o
  CC test_reciprocal_division.o
  CC test_reciprocal_division_perf.o
--
dpaa_ethdev.c:(.text+0x1663): undefined reference to `dpaa_port_vsp_update'
/root/CENTOS77-64_K3.10.0_GCC4.8.5/x86_64-native-linuxapp-gcc/a0a4e391698e4d3493eb55745b7f9ff8/dpdk/x86_64-native-linuxapp-gcc/lib/librte_pmd_dpaa.a(dpaa_ethdev.o): In function `rte_dpaa_probe':
dpaa_ethdev.c:(.text+0x27fe): undefined reference to `dpaa_port_fmc_init'
collect2: error: ld returned 1 exit status
make[5]: *** [dpdk-test-flow-perf] Error 1
make[4]: *** [test-flow-perf] Error 2
  CC test_ring_perf.o
  CC csumonly.o
  CC icmpecho.o
--
dpaa_ethdev.c:(.text+0x1663): undefined reference to `dpaa_port_vsp_update'
/root/CENTOS77-64_K3.10.0_GCC4.8.5/x86_64-native-linuxapp-gcc/a0a4e391698e4d3493eb55745b7f9ff8/dpdk/x86_64-native-linuxapp-gcc/lib/librte_pmd_dpaa.a(dpaa_ethdev.o): In function `rte_dpaa_probe':
dpaa_ethdev.c:(.text+0x27fe): undefined reference to `dpaa_port_fmc_init'
collect2: error: ld returned 1 exit status
make[5]: *** [testpmd] Error 1
make[4]: *** [test-pmd] Error 2
  CC test_memcpy_perf.o
  CC test_member.o
  CC test_member_perf.o
--
dpaa_ethdev.c:(.text+0x1663): undefined reference to `dpaa_port_vsp_update'
/root/CENTOS77-64_K3.10.0_GCC4.8.5/x86_64-native-linuxapp-gcc/a0a4e391698e4d3493eb55745b7f9ff8/dpdk/x86_64-native-linuxapp-gcc/lib/librte_pmd_dpaa.a(dpaa_ethdev.o): In function `rte_dpaa_probe':
dpaa_ethdev.c:(.text+0x27fe): undefined reference to `dpaa_port_fmc_init'
collect2: error: ld returned 1 exit status
make[5]: *** [test] Error 1
make[4]: *** [test] Error 2
make[3]: *** [app] Error 2
make[2]: *** [all] Error 2
make[1]: *** [pre_install] Error 2
make: *** [install] Error 2


*Makefile Build Failed #2:
OS: CENTOS82-64
Target: x86_64-native-linuxapp-gcc
dpaa_ethdev.c:(.text.unlikely+0x126e): undefined reference to `dpaa_port_vsp_update'
/root/CENTOS82-64_K4.18.0_GCC8.3.1/x86_64-native-linuxapp-gcc/a0a4e391698e4d3493eb55745b7f9ff8/dpdk/x86_64-native-linuxapp-gcc/lib/librte_pmd_dpaa.a(dpaa_ethdev.o): In function `rte_dpaa_probe':
dpaa_ethdev.c:(.text.unlikely+0x1959): undefined reference to `dpaa_port_fmc_init'
collect2: error: ld returned 1 exit status
make[5]: *** [/root/CENTOS82-64_K4.18.0_GCC8.3.1/x86_64-native-linuxapp-gcc/a0a4e391698e4d3493eb55745b7f9ff8/dpdk/mk/rte.app.mk:456: cmdline_test] Error 1
make[4]: *** [/root/CENTOS82-64_K4.18.0_GCC8.3.1/x86_64-native-linuxapp-gcc/a0a4e391698e4d3493eb55745b7f9ff8/dpdk/mk/rte.subdir.mk:35: test-cmdline] Error 2
make[4]: *** Waiting for unfinished jobs....
  CC runtime.o
/root/CENTOS82-64_K4.18.0_GCC8.3.1/x86_64-native-linuxapp-gcc/a0a4e391698e4d3493eb55745b7f9ff8/dpdk/x86_64-native-linuxapp-gcc/lib/librte_pmd_dpaa.a(dpaa_ethdev.o): In function `dpaa_eth_rx_queue_setup':
dpaa_ethdev.c:(.text.unlikely+0x126e): undefined reference to `dpaa_port_vsp_update'
/root/CENTOS82-64_K4.18.0_GCC8.3.1/x86_64-native-linuxapp-gcc/a0a4e391698e4d3493eb55745b7f9ff8/dpdk/x86_64-native-linuxapp-gcc/lib/librte_pmd_dpaa.a(dpaa_ethdev.o): In function `rte_dpaa_probe':
dpaa_ethdev.c:(.text.unlikely+0x1959): undefined reference to `dpaa_port_fmc_init'
collect2: error: ld returned 1 exit status
make[5]: *** [/root/CENTOS82-64_K4.18.0_GCC8.3.1/x86_64-native-linuxapp-gcc/a0a4e391698e4d3493eb55745b7f9ff8/dpdk/mk/rte.app.mk:456: dpdk-procinfo] Error 1
make[4]: *** [/root/CENTOS82-64_K4.18.0_GCC8.3.1/x86_64-native-linuxapp-gcc/a0a4e391698e4d3493eb55745b7f9ff8/dpdk/mk/rte.subdir.mk:35: proc-info] Error 2
  CC main.o
/root/CENTOS82-64_K4.18.0_GCC8.3.1/x86_64-native-linuxapp-gcc/a0a4e391698e4d3493eb55745b7f9ff8/dpdk/x86_64-native-linuxapp-gcc/lib/librte_pmd_dpaa.a(dpaa_ethdev.o): In function `dpaa_eth_rx_queue_setup':
dpaa_ethdev.c:(.text.unlikely+0x126e): undefined reference to `dpaa_port_vsp_update'
/root/CENTOS82-64_K4.18.0_GCC8.3.1/x86_64-native-linuxapp-gcc/a0a4e391698e4d3493eb55745b7f9ff8/dpdk/x86_64-native-linuxapp-gcc/lib/librte_pmd_dpaa.a(dpaa_ethdev.o): In function `rte_dpaa_probe':
dpaa_ethdev.c:(.text.unlikely+0x1959): undefined reference to `dpaa_port_fmc_init'
collect2: error: ld returned 1 exit status
make[5]: *** [/root/CENTOS82-64_K4.18.0_GCC8.3.1/x86_64-native-linuxapp-gcc/a0a4e391698e4d3493eb55745b7f9ff8/dpdk/mk/rte.app.mk:456: testsad] Error 1
make[4]: *** [/root/CENTOS82-64_K4.18.0_GCC8.3.1/x86_64-native-linuxapp-gcc/a0a4e391698e4d3493eb55745b7f9ff8/dpdk/mk/rte.subdir.mk:35: test-sad] Error 2
  LD testfib
  CC pipeline_stub.o
  CC test_resource.o
--
dpaa_ethdev.c:(.text.unlikely+0x126e): undefined reference to `dpaa_port_vsp_update'
/root/CENTOS82-64_K4.18.0_GCC8.3.1/x86_64-native-linuxapp-gcc/a0a4e391698e4d3493eb55745b7f9ff8/dpdk/x86_64-native-linuxapp-gcc/lib/librte_pmd_dpaa.a(dpaa_ethdev.o): In function `rte_dpaa_probe':
dpaa_ethdev.c:(.text.unlikely+0x1959): undefined reference to `dpaa_port_fmc_init'
collect2: error: ld returned 1 exit status
make[5]: *** [/root/CENTOS82-64_K4.18.0_GCC8.3.1/x86_64-native-linuxapp-gcc/a0a4e391698e4d3493eb55745b7f9ff8/dpdk/mk/rte.app.mk:456: testacl] Error 1
make[4]: *** [/root/CENTOS82-64_K4.18.0_GCC8.3.1/x86_64-native-linuxapp-gcc/a0a4e391698e4d3493eb55745b7f9ff8/dpdk/mk/rte.subdir.mk:35: test-acl] Error 2
  CC test_prefetch.o
/root/CENTOS82-64_K4.18.0_GCC8.3.1/x86_64-native-linuxapp-gcc/a0a4e391698e4d3493eb55745b7f9ff8/dpdk/x86_64-native-linuxapp-gcc/lib/librte_pmd_dpaa.a(dpaa_ethdev.o): In function `dpaa_eth_rx_queue_setup':
dpaa_ethdev.c:(.text.unlikely+0x126e): undefined reference to `dpaa_port_vsp_update'
/root/CENTOS82-64_K4.18.0_GCC8.3.1/x86_64-native-linuxapp-gcc/a0a4e391698e4d3493eb55745b7f9ff8/dpdk/x86_64-native-linuxapp-gcc/lib/librte_pmd_dpaa.a(dpaa_ethdev.o): In function `rte_dpaa_probe':
dpaa_ethdev.c:(.text.unlikely+0x1959): undefined reference to `dpaa_port_fmc_init'
collect2: error: ld returned 1 exit status
make[5]: *** [/root/CENTOS82-64_K4.18.0_GCC8.3.1/x86_64-native-linuxapp-gcc/a0a4e391698e4d3493eb55745b7f9ff8/dpdk/mk/rte.app.mk:456: dpdk-pdump] Error 1
make[4]: *** [/root/CENTOS82-64_K4.18.0_GCC8.3.1/x86_64-native-linuxapp-gcc/a0a4e391698e4d3493eb55745b7f9ff8/dpdk/mk/rte.subdir.mk:35: pdump] Error 2
  CC test_byteorder.o
  CC test_per_lcore.o
  CC pipeline_hash.o
--
dpaa_ethdev.c:(.text.unlikely+0x126e): undefined reference to `dpaa_port_vsp_update'
/root/CENTOS82-64_K4.18.0_GCC8.3.1/x86_64-native-linuxapp-gcc/a0a4e391698e4d3493eb55745b7f9ff8/dpdk/x86_64-native-linuxapp-gcc/lib/librte_pmd_dpaa.a(dpaa_ethdev.o): In function `rte_dpaa_probe':
dpaa_ethdev.c:(.text.unlikely+0x1959): undefined reference to `dpaa_port_fmc_init'
collect2: error: ld returned 1 exit status
make[5]: *** [/root/CENTOS82-64_K4.18.0_GCC8.3.1/x86_64-native-linuxapp-gcc/a0a4e391698e4d3493eb55745b7f9ff8/dpdk/mk/rte.app.mk:456: testfib] Error 1
make[4]: *** [/root/CENTOS82-64_K4.18.0_GCC8.3.1/x86_64-native-linuxapp-gcc/a0a4e391698e4d3493eb55745b7f9ff8/dpdk/mk/rte.subdir.mk:35: test-fib] Error 2
  CC test_spinlock.o
  CC pipeline_lpm_ipv6.o
  CC test_ticketlock.o
--
dpaa_ethdev.c:(.text.unlikely+0x126e): undefined reference to `dpaa_port_vsp_update'
/root/CENTOS82-64_K4.18.0_GCC8.3.1/x86_64-native-linuxapp-gcc/a0a4e391698e4d3493eb55745b7f9ff8/dpdk/x86_64-native-linuxapp-gcc/lib/librte_pmd_dpaa.a(dpaa_ethdev.o): In function `rte_dpaa_probe':
dpaa_ethdev.c:(.text.unlikely+0x1959): undefined reference to `dpaa_port_fmc_init'
collect2: error: ld returned 1 exit status
  CC test_ring_st_peek_stress.o
make[5]: *** [/root/CENTOS82-64_K4.18.0_GCC8.3.1/x86_64-native-linuxapp-gcc/a0a4e391698e4d3493eb55745b7f9ff8/dpdk/mk/rte.app.mk:456: dpdk-test-flow-perf] Error 1
make[4]: *** [/root/CENTOS82-64_K4.18.0_GCC8.3.1/x86_64-native-linuxapp-gcc/a0a4e391698e4d3493eb55745b7f9ff8/dpdk/mk/rte.subdir.mk:35: test-flow-perf] Error 2
  CC test_ring_stress.o
  CC cmdline_mtr.o
  CC test_pmd_perf.o
--
dpaa_ethdev.c:(.text.unlikely+0x126e): undefined reference to `dpaa_port_vsp_update'
/root/CENTOS82-64_K4.18.0_GCC8.3.1/x86_64-native-linuxapp-gcc/a0a4e391698e4d3493eb55745b7f9ff8/dpdk/x86_64-native-linuxapp-gcc/lib/librte_pmd_dpaa.a(dpaa_ethdev.o): In function `rte_dpaa_probe':
dpaa_ethdev.c:(.text.unlikely+0x1959): undefined reference to `dpaa_port_fmc_init'
collect2: error: ld returned 1 exit status
make[5]: *** [/root/CENTOS82-64_K4.18.0_GCC8.3.1/x86_64-native-linuxapp-gcc/a0a4e391698e4d3493eb55745b7f9ff8/dpdk/mk/rte.app.mk:456: testpipeline] Error 1
make[4]: *** [/root/CENTOS82-64_K4.18.0_GCC8.3.1/x86_64-native-linuxapp-gcc/a0a4e391698e4d3493eb55745b7f9ff8/dpdk/mk/rte.subdir.mk:35: test-pipeline] Error 2
make[5]: Warning: File 'config.c' has modification time 40792 s in the future
  CC test_table.o
  CC cmdline_tm.o
--
dpaa_ethdev.c:(.text.unlikely+0x126e): undefined reference to `dpaa_port_vsp_update'
/root/CENTOS82-64_K4.18.0_GCC8.3.1/x86_64-native-linuxapp-gcc/a0a4e391698e4d3493eb55745b7f9ff8/dpdk/x86_64-native-linuxapp-gcc/lib/librte_pmd_dpaa.a(dpaa_ethdev.o): In function `rte_dpaa_probe':
dpaa_ethdev.c:(.text.unlikely+0x1959): undefined reference to `dpaa_port_fmc_init'
collect2: error: ld returned 1 exit status
make[5]: *** [/root/CENTOS82-64_K4.18.0_GCC8.3.1/x86_64-native-linuxapp-gcc/a0a4e391698e4d3493eb55745b7f9ff8/dpdk/mk/rte.app.mk:456: testpmd] Error 1
make[4]: *** [/root/CENTOS82-64_K4.18.0_GCC8.3.1/x86_64-native-linuxapp-gcc/a0a4e391698e4d3493eb55745b7f9ff8/dpdk/mk/rte.subdir.mk:35: test-pmd] Error 2
  CC test_lpm.o
  CC test_lpm_perf.o
  CC test_lpm6.o
--
dpaa_ethdev.c:(.text.unlikely+0x126e): undefined reference to `dpaa_port_vsp_update'
/root/CENTOS82-64_K4.18.0_GCC8.3.1/x86_64-native-linuxapp-gcc/a0a4e391698e4d3493eb55745b7f9ff8/dpdk/x86_64-native-linuxapp-gcc/lib/librte_pmd_dpaa.a(dpaa_ethdev.o): In function `rte_dpaa_probe':
dpaa_ethdev.c:(.text.unlikely+0x1959): undefined reference to `dpaa_port_fmc_init'
collect2: error: ld returned 1 exit status
make[5]: *** [/root/CENTOS82-64_K4.18.0_GCC8.3.1/x86_64-native-linuxapp-gcc/a0a4e391698e4d3493eb55745b7f9ff8/dpdk/mk/rte.app.mk:456: test] Error 1
make[4]: *** [/root/CENTOS82-64_K4.18.0_GCC8.3.1/x86_64-native-linuxapp-gcc/a0a4e391698e4d3493eb55745b7f9ff8/dpdk/mk/rte.subdir.mk:35: test] Error 2
make[3]: *** [/root/CENTOS82-64_K4.18.0_GCC8.3.1/x86_64-native-linuxapp-gcc/a0a4e391698e4d3493eb55745b7f9ff8/dpdk/mk/rte.sdkbuild.mk:53: app] Error 2
make[2]: *** [/root/CENTOS82-64_K4.18.0_GCC8.3.1/x86_64-native-linuxapp-gcc/a0a4e391698e4d3493eb55745b7f9ff8/dpdk/mk/rte.sdkroot.mk:115: all] Error 2
make[1]: *** [/root/CENTOS82-64_K4.18.0_GCC8.3.1/x86_64-native-linuxapp-gcc/a0a4e391698e4d3493eb55745b7f9ff8/dpdk/mk/rte.sdkinstall.mk:61: pre_install] Error 2
make: *** [/root/CENTOS82-64_K4.18.0_GCC8.3.1/x86_64-native-linuxapp-gcc/a0a4e391698e4d3493eb55745b7f9ff8/dpdk/mk/rte.sdkroot.mk:92: install] Error 2


*Makefile Build Failed #3:
OS: CENTOS82-64
Target: x86_64-native-linuxapp-clang
  CC config.o
  CC test.o
  LD testsad
clang-9: error: linker command failed with exit code 1 (use -v to see invocation)
make[5]: *** [/root/CENTOS82-64_K4.18.0_Clang7.0.1/x86_64-native-linuxapp-clang/a0a4e391698e4d3493eb55745b7f9ff8/dpdk/mk/rte.app.mk:456: cmdline_test] Error 1
make[4]: *** [/root/CENTOS82-64_K4.18.0_Clang7.0.1/x86_64-native-linuxapp-clang/a0a4e391698e4d3493eb55745b7f9ff8/dpdk/mk/rte.subdir.mk:37: test-cmdline] Error 2
make[4]: *** Waiting for unfinished jobs....
  CC resource.o
/root/CENTOS82-64_K4.18.0_Clang7.0.1/x86_64-native-linuxapp-clang/a0a4e391698e4d3493eb55745b7f9ff8/dpdk/x86_64-native-linuxapp-clang/lib/librte_pmd_dpaa.a(dpaa_ethdev.o): In function `dpaa_eth_rx_queue_setup':
--
/root/CENTOS82-64_K4.18.0_Clang7.0.1/x86_64-native-linuxapp-clang/a0a4e391698e4d3493eb55745b7f9ff8/dpdk/x86_64-native-linuxapp-clang/lib/librte_pmd_dpaa.a(dpaa_ethdev.o): In function `rte_dpaa_probe':
dpaa_ethdev.c:(.text+0x2496): undefined reference to `dpaa_port_fmc_init'
  CC test_resource.o
clang-9: error: linker command failed with exit code 1 (use -v to see invocation)
make[5]: *** [/root/CENTOS82-64_K4.18.0_Clang7.0.1/x86_64-native-linuxapp-clang/a0a4e391698e4d3493eb55745b7f9ff8/dpdk/mk/rte.app.mk:456: dpdk-pdump] Error 1
make[4]: *** [/root/CENTOS82-64_K4.18.0_Clang7.0.1/x86_64-native-linuxapp-clang/a0a4e391698e4d3493eb55745b7f9ff8/dpdk/mk/rte.subdir.mk:37: pdump] Error 2
  CC test_prefetch.o
  CC init.o
/root/CENTOS82-64_K4.18.0_Clang7.0.1/x86_64-native-linuxapp-clang/a0a4e391698e4d3493eb55745b7f9ff8/dpdk/x86_64-native-linuxapp-clang/lib/librte_pmd_dpaa.a(dpaa_ethdev.o): In function `dpaa_eth_rx_queue_setup':
dpaa_ethdev.c:(.text+0x1555): undefined reference to `dpaa_port_vsp_update'
/root/CENTOS82-64_K4.18.0_Clang7.0.1/x86_64-native-linuxapp-clang/a0a4e391698e4d3493eb55745b7f9ff8/dpdk/x86_64-native-linuxapp-clang/lib/librte_pmd_dpaa.a(dpaa_ethdev.o): In function `rte_dpaa_probe':
dpaa_ethdev.c:(.text+0x2496): undefined reference to `dpaa_port_fmc_init'
clang-9: error: linker command failed with exit code 1 (use -v to see invocation)
make[5]: *** [/root/CENTOS82-64_K4.18.0_Clang7.0.1/x86_64-native-linuxapp-clang/a0a4e391698e4d3493eb55745b7f9ff8/dpdk/mk/rte.app.mk:456: testacl] Error 1
make[4]: *** [/root/CENTOS82-64_K4.18.0_Clang7.0.1/x86_64-native-linuxapp-clang/a0a4e391698e4d3493eb55745b7f9ff8/dpdk/mk/rte.subdir.mk:37: test-acl] Error 2
/root/CENTOS82-64_K4.18.0_Clang7.0.1/x86_64-native-linuxapp-clang/a0a4e391698e4d3493eb55745b7f9ff8/dpdk/x86_64-native-linuxapp-clang/lib/librte_pmd_dpaa.a(dpaa_ethdev.o): In function `dpaa_eth_rx_queue_setup':
dpaa_ethdev.c:(.text+0x1555): undefined reference to `dpaa_port_vsp_update'
/root/CENTOS82-64_K4.18.0_Clang7.0.1/x86_64-native-linuxapp-clang/a0a4e391698e4d3493eb55745b7f9ff8/dpdk/x86_64-native-linuxapp-clang/lib/librte_pmd_dpaa.a(dpaa_ethdev.o): In function `rte_dpaa_probe':
--
  CC runtime.o
  CC test_byteorder.o
  CC items_gen.o
clang-9: error: linker command failed with exit code 1 (use -v to see invocation)
  LD testfib
make[5]: *** [/root/CENTOS82-64_K4.18.0_Clang7.0.1/x86_64-native-linuxapp-clang/a0a4e391698e4d3493eb55745b7f9ff8/dpdk/mk/rte.app.mk:456: dpdk-procinfo] Error 1
make[4]: *** [/root/CENTOS82-64_K4.18.0_Clang7.0.1/x86_64-native-linuxapp-clang/a0a4e391698e4d3493eb55745b7f9ff8/dpdk/mk/rte.subdir.mk:37: proc-info] Error 2
  CC pipeline_stub.o
  CC test_per_lcore.o
clang-9: error: linker command failed with exit code 1 (use -v to see invocation)
make[5]: *** [/root/CENTOS82-64_K4.18.0_Clang7.0.1/x86_64-native-linuxapp-clang/a0a4e391698e4d3493eb55745b7f9ff8/dpdk/mk/rte.app.mk:456: testsad] Error 1
make[4]: *** [/root/CENTOS82-64_K4.18.0_Clang7.0.1/x86_64-native-linuxapp-clang/a0a4e391698e4d3493eb55745b7f9ff8/dpdk/mk/rte.subdir.mk:37: test-sad] Error 2
  CC test_atomic.o
  CC pipeline_hash.o
  CC test_barrier.o
--
dpaa_ethdev.c:(.text+0x2496): undefined reference to `dpaa_port_fmc_init'
  CC test_malloc.o
  CC parameters.o
clang-9: error: linker command failed with exit code 1 (use -v to see invocation)
make[5]: *** [/root/CENTOS82-64_K4.18.0_Clang7.0.1/x86_64-native-linuxapp-clang/a0a4e391698e4d3493eb55745b7f9ff8/dpdk/mk/rte.app.mk:456: testfib] Error 1
make[4]: *** [/root/CENTOS82-64_K4.18.0_Clang7.0.1/x86_64-native-linuxapp-clang/a0a4e391698e4d3493eb55745b7f9ff8/dpdk/mk/rte.subdir.mk:37: test-fib] Error 2
  CC pipeline_lpm.o
  CC test_cycles.o
  CC pipeline_lpm_ipv6.o
--
/root/CENTOS82-64_K4.18.0_Clang7.0.1/x86_64-native-linuxapp-clang/a0a4e391698e4d3493eb55745b7f9ff8/dpdk/x86_64-native-linuxapp-clang/lib/librte_pmd_dpaa.a(dpaa_ethdev.o): In function `rte_dpaa_probe':
dpaa_ethdev.c:(.text+0x2496): undefined reference to `dpaa_port_fmc_init'
  LD dpdk-test-flow-perf
clang-9: error: linker command failed with exit code 1 (use -v to see invocation)
make[5]: *** [/root/CENTOS82-64_K4.18.0_Clang7.0.1/x86_64-native-linuxapp-clang/a0a4e391698e4d3493eb55745b7f9ff8/dpdk/mk/rte.app.mk:456: testpipeline] Error 1
make[4]: *** [/root/CENTOS82-64_K4.18.0_Clang7.0.1/x86_64-native-linuxapp-clang/a0a4e391698e4d3493eb55745b7f9ff8/dpdk/mk/rte.subdir.mk:37: test-pipeline] Error 2
  CC iofwd.o
/root/CENTOS82-64_K4.18.0_Clang7.0.1/x86_64-native-linuxapp-clang/a0a4e391698e4d3493eb55745b7f9ff8/dpdk/x86_64-native-linuxapp-clang/lib/librte_pmd_dpaa.a(dpaa_ethdev.o): In function `dpaa_eth_rx_queue_setup':
dpaa_ethdev.c:(.text+0x1555): undefined reference to `dpaa_port_vsp_update'
--
dpaa_ethdev.c:(.text+0x2496): undefined reference to `dpaa_port_fmc_init'
  CC test_ring_perf.o
  CC test_ring_mt_peek_stress.o
clang-9: error: linker command failed with exit code 1 (use -v to see invocation)
make[5]: *** [/root/CENTOS82-64_K4.18.0_Clang7.0.1/x86_64-native-linuxapp-clang/a0a4e391698e4d3493eb55745b7f9ff8/dpdk/mk/rte.app.mk:456: dpdk-test-flow-perf] Error 1
make[4]: *** [/root/CENTOS82-64_K4.18.0_Clang7.0.1/x86_64-native-linuxapp-clang/a0a4e391698e4d3493eb55745b7f9ff8/dpdk/mk/rte.subdir.mk:37: test-flow-perf] Error 2
  CC test_ring_rts_stress.o
  CC macfwd.o
  CC macswap.o
--
dpaa_ethdev.c:(.text+0x1555): undefined reference to `dpaa_port_vsp_update'
/root/CENTOS82-64_K4.18.0_Clang7.0.1/x86_64-native-linuxapp-clang/a0a4e391698e4d3493eb55745b7f9ff8/dpdk/x86_64-native-linuxapp-clang/lib/librte_pmd_dpaa.a(dpaa_ethdev.o): In function `rte_dpaa_probe':
dpaa_ethdev.c:(.text+0x2496): undefined reference to `dpaa_port_fmc_init'
clang-9: error: linker command failed with exit code 1 (use -v to see invocation)
make[5]: *** [/root/CENTOS82-64_K4.18.0_Clang7.0.1/x86_64-native-linuxapp-clang/a0a4e391698e4d3493eb55745b7f9ff8/dpdk/mk/rte.app.mk:456: testpmd] Error 1
make[4]: *** [/root/CENTOS82-64_K4.18.0_Clang7.0.1/x86_64-native-linuxapp-clang/a0a4e391698e4d3493eb55745b7f9ff8/dpdk/mk/rte.subdir.mk:37: test-pmd] Error 2
  CC test_member_perf.o
  CC test_efd.o
  CC test_efd_perf.o
--
dpaa_ethdev.c:(.text+0x1555): undefined reference to `dpaa_port_vsp_update'
/root/CENTOS82-64_K4.18.0_Clang7.0.1/x86_64-native-linuxapp-clang/a0a4e391698e4d3493eb55745b7f9ff8/dpdk/x86_64-native-linuxapp-clang/lib/librte_pmd_dpaa.a(dpaa_ethdev.o): In function `rte_dpaa_probe':
dpaa_ethdev.c:(.text+0x2496): undefined reference to `dpaa_port_fmc_init'
clang-9: error: linker command failed with exit code 1 (use -v to see invocation)
make[5]: *** [/root/CENTOS82-64_K4.18.0_Clang7.0.1/x86_64-native-linuxapp-clang/a0a4e391698e4d3493eb55745b7f9ff8/dpdk/mk/rte.app.mk:456: test] Error 1
make[4]: *** [/root/CENTOS82-64_K4.18.0_Clang7.0.1/x86_64-native-linuxapp-clang/a0a4e391698e4d3493eb55745b7f9ff8/dpdk/mk/rte.subdir.mk:37: test] Error 2
make[3]: *** [/root/CENTOS82-64_K4.18.0_Clang7.0.1/x86_64-native-linuxapp-clang/a0a4e391698e4d3493eb55745b7f9ff8/dpdk/mk/rte.sdkbuild.mk:53: app] Error 2
make[2]: *** [/root/CENTOS82-64_K4.18.0_Clang7.0.1/x86_64-native-linuxapp-clang/a0a4e391698e4d3493eb55745b7f9ff8/dpdk/mk/rte.sdkroot.mk:115: all] Error 2
make[1]: *** [/root/CENTOS82-64_K4.18.0_Clang7.0.1/x86_64-native-linuxapp-clang/a0a4e391698e4d3493eb55745b7f9ff8/dpdk/mk/rte.sdkinstall.mk:61: pre_install] Error 2
make: *** [/root/CENTOS82-64_K4.18.0_Clang7.0.1/x86_64-native-linuxapp-clang/a0a4e391698e4d3493eb55745b7f9ff8/dpdk/mk/rte.sdkroot.mk:92: install] Error 2


*Makefile Build Failed #4:
OS: CENTOS82-64
Target: x86_64-native-linuxapp-icc
/root/CENTOS82-64_K4.18.0_ICC19.1.1/x86_64-native-linuxapp-icc/a0a4e391698e4d3493eb55745b7f9ff8/dpdk/x86_64-native-linuxapp-icc/lib/librte_pmd_dpaa.a(dpaa_ethdev.o): In function `rte_dpaa_probe':
dpaa_ethdev.c:(.text+0x2372): undefined reference to `dpaa_port_fmc_init'
  CC test_resource.o
make[5]: *** [/root/CENTOS82-64_K4.18.0_ICC19.1.1/x86_64-native-linuxapp-icc/a0a4e391698e4d3493eb55745b7f9ff8/dpdk/mk/rte.app.mk:456: testsad] Error 1
make[4]: *** [/root/CENTOS82-64_K4.18.0_ICC19.1.1/x86_64-native-linuxapp-icc/a0a4e391698e4d3493eb55745b7f9ff8/dpdk/mk/rte.subdir.mk:37: test-sad] Error 2
make[4]: *** Waiting for unfinished jobs....
/root/CENTOS82-64_K4.18.0_ICC19.1.1/x86_64-native-linuxapp-icc/a0a4e391698e4d3493eb55745b7f9ff8/dpdk/x86_64-native-linuxapp-icc/lib/librte_pmd_dpaa.a(dpaa_ethdev.o): In function `dpaa_eth_rx_queue_setup':
dpaa_ethdev.c:(.text+0x12ca): undefined reference to `dpaa_port_vsp_update'
/root/CENTOS82-64_K4.18.0_ICC19.1.1/x86_64-native-linuxapp-icc/a0a4e391698e4d3493eb55745b7f9ff8/dpdk/x86_64-native-linuxapp-icc/lib/librte_pmd_dpaa.a(dpaa_ethdev.o): In function `rte_dpaa_probe':
dpaa_ethdev.c:(.text+0x2372): undefined reference to `dpaa_port_fmc_init'
  CC test_prefetch.o
make[5]: *** [/root/CENTOS82-64_K4.18.0_ICC19.1.1/x86_64-native-linuxapp-icc/a0a4e391698e4d3493eb55745b7f9ff8/dpdk/mk/rte.app.mk:456: testacl] Error 1
make[4]: *** [/root/CENTOS82-64_K4.18.0_ICC19.1.1/x86_64-native-linuxapp-icc/a0a4e391698e4d3493eb55745b7f9ff8/dpdk/mk/rte.subdir.mk:37: test-acl] Error 2
  CC test_byteorder.o
make[5]: *** [/root/CENTOS82-64_K4.18.0_ICC19.1.1/x86_64-native-linuxapp-icc/a0a4e391698e4d3493eb55745b7f9ff8/dpdk/mk/rte.app.mk:456: cmdline_test] Error 1
make[4]: *** [/root/CENTOS82-64_K4.18.0_ICC19.1.1/x86_64-native-linuxapp-icc/a0a4e391698e4d3493eb55745b7f9ff8/dpdk/mk/rte.subdir.mk:37: test-cmdline] Error 2
  CC test_per_lcore.o
make[5]: *** [/root/CENTOS82-64_K4.18.0_ICC19.1.1/x86_64-native-linuxapp-icc/a0a4e391698e4d3493eb55745b7f9ff8/dpdk/mk/rte.app.mk:456: dpdk-procinfo] Error 1
make[4]: *** [/root/CENTOS82-64_K4.18.0_ICC19.1.1/x86_64-native-linuxapp-icc/a0a4e391698e4d3493eb55745b7f9ff8/dpdk/mk/rte.subdir.mk:37: proc-info] Error 2
  CC test_atomic.o
  CC test_barrier.o
/root/CENTOS82-64_K4.18.0_ICC19.1.1/x86_64-native-linuxapp-icc/a0a4e391698e4d3493eb55745b7f9ff8/dpdk/x86_64-native-linuxapp-icc/lib/librte_pmd_dpaa.a(dpaa_ethdev.o): In function `dpaa_eth_rx_queue_setup':
--
  CC test_malloc.o
  CC test_cycles.o
  CC test_mcslock.o
make[5]: *** [/root/CENTOS82-64_K4.18.0_ICC19.1.1/x86_64-native-linuxapp-icc/a0a4e391698e4d3493eb55745b7f9ff8/dpdk/mk/rte.app.mk:456: testfib] Error 1
make[4]: *** [/root/CENTOS82-64_K4.18.0_ICC19.1.1/x86_64-native-linuxapp-icc/a0a4e391698e4d3493eb55745b7f9ff8/dpdk/mk/rte.subdir.mk:37: test-fib] Error 2
  CC pipeline_stub.o
  CC pipeline_hash.o
  CC test_spinlock.o
--
dpaa_ethdev.c:(.text+0x12ca): undefined reference to `dpaa_port_vsp_update'
/root/CENTOS82-64_K4.18.0_ICC19.1.1/x86_64-native-linuxapp-icc/a0a4e391698e4d3493eb55745b7f9ff8/dpdk/x86_64-native-linuxapp-icc/lib/librte_pmd_dpaa.a(dpaa_ethdev.o): In function `rte_dpaa_probe':
dpaa_ethdev.c:(.text+0x2372): undefined reference to `dpaa_port_fmc_init'
make[5]: *** [/root/CENTOS82-64_K4.18.0_ICC19.1.1/x86_64-native-linuxapp-icc/a0a4e391698e4d3493eb55745b7f9ff8/dpdk/mk/rte.app.mk:456: dpdk-test-flow-perf] Error 1
make[4]: *** [/root/CENTOS82-64_K4.18.0_ICC19.1.1/x86_64-native-linuxapp-icc/a0a4e391698e4d3493eb55745b7f9ff8/dpdk/mk/rte.subdir.mk:37: test-flow-perf] Error 2
  CC test_ring_rts_stress.o
  CC cmdline.o
/root/CENTOS82-64_K4.18.0_ICC19.1.1/x86_64-native-linuxapp-icc/a0a4e391698e4d3493eb55745b7f9ff8/dpdk/x86_64-native-linuxapp-icc/lib/librte_pmd_dpaa.a(dpaa_ethdev.o): In function `dpaa_eth_rx_queue_setup':
--
dpaa_ethdev.c:(.text+0x2372): undefined reference to `dpaa_port_fmc_init'
  CC cmdline_flow.o
  CC test_ring_st_peek_stress.o
make[5]: *** [/root/CENTOS82-64_K4.18.0_ICC19.1.1/x86_64-native-linuxapp-icc/a0a4e391698e4d3493eb55745b7f9ff8/dpdk/mk/rte.app.mk:456: dpdk-pdump] Error 1
make[4]: *** [/root/CENTOS82-64_K4.18.0_ICC19.1.1/x86_64-native-linuxapp-icc/a0a4e391698e4d3493eb55745b7f9ff8/dpdk/mk/rte.subdir.mk:37: pdump] Error 2
  CC test_ring_stress.o
  CC test_pmd_perf.o
/root/CENTOS82-64_K4.18.0_ICC19.1.1/x86_64-native-linuxapp-icc/a0a4e391698e4d3493eb55745b7f9ff8/dpdk/x86_64-native-linuxapp-icc/lib/librte_pmd_dpaa.a(dpaa_ethdev.o): In function `dpaa_eth_rx_queue_setup':
--
dpaa_ethdev.c:(.text+0x2372): undefined reference to `dpaa_port_fmc_init'
  CC test_table.o
  CC test_table_pipeline.o
make[5]: *** [/root/CENTOS82-64_K4.18.0_ICC19.1.1/x86_64-native-linuxapp-icc/a0a4e391698e4d3493eb55745b7f9ff8/dpdk/mk/rte.app.mk:456: testpipeline] Error 1
make[4]: *** [/root/CENTOS82-64_K4.18.0_ICC19.1.1/x86_64-native-linuxapp-icc/a0a4e391698e4d3493eb55745b7f9ff8/dpdk/mk/rte.subdir.mk:37: test-pipeline] Error 2
  CC test_table_tables.o
  CC test_table_ports.o
  CC test_table_combined.o
--
dpaa_ethdev.c:(.text+0x12ca): undefined reference to `dpaa_port_vsp_update'
/root/CENTOS82-64_K4.18.0_ICC19.1.1/x86_64-native-linuxapp-icc/a0a4e391698e4d3493eb55745b7f9ff8/dpdk/x86_64-native-linuxapp-icc/lib/librte_pmd_dpaa.a(dpaa_ethdev.o): In function `rte_dpaa_probe':
dpaa_ethdev.c:(.text+0x2372): undefined reference to `dpaa_port_fmc_init'
make[5]: *** [/root/CENTOS82-64_K4.18.0_ICC19.1.1/x86_64-native-linuxapp-icc/a0a4e391698e4d3493eb55745b7f9ff8/dpdk/mk/rte.app.mk:456: testpmd] Error 1
make[4]: *** [/root/CENTOS82-64_K4.18.0_ICC19.1.1/x86_64-native-linuxapp-icc/a0a4e391698e4d3493eb55745b7f9ff8/dpdk/mk/rte.subdir.mk:37: test-pmd] Error 2
  CC test_latencystats.o
  CC test_pdump.o
  CC test_cmdline.o
--
dpaa_ethdev.c:(.text+0x12ca): undefined reference to `dpaa_port_vsp_update'
/root/CENTOS82-64_K4.18.0_ICC19.1.1/x86_64-native-linuxapp-icc/a0a4e391698e4d3493eb55745b7f9ff8/dpdk/x86_64-native-linuxapp-icc/lib/librte_pmd_dpaa.a(dpaa_ethdev.o): In function `rte_dpaa_probe':
dpaa_ethdev.c:(.text+0x2372): undefined reference to `dpaa_port_fmc_init'
make[5]: *** [/root/CENTOS82-64_K4.18.0_ICC19.1.1/x86_64-native-linuxapp-icc/a0a4e391698e4d3493eb55745b7f9ff8/dpdk/mk/rte.app.mk:456: test] Error 1
make[4]: *** [/root/CENTOS82-64_K4.18.0_ICC19.1.1/x86_64-native-linuxapp-icc/a0a4e391698e4d3493eb55745b7f9ff8/dpdk/mk/rte.subdir.mk:37: test] Error 2
make[3]: *** [/root/CENTOS82-64_K4.18.0_ICC19.1.1/x86_64-native-linuxapp-icc/a0a4e391698e4d3493eb55745b7f9ff8/dpdk/mk/rte.sdkbuild.mk:53: app] Error 2
make[2]: *** [/root/CENTOS82-64_K4.18.0_ICC19.1.1/x86_64-native-linuxapp-icc/a0a4e391698e4d3493eb55745b7f9ff8/dpdk/mk/rte.sdkroot.mk:115: all] Error 2
make[1]: *** [/root/CENTOS82-64_K4.18.0_ICC19.1.1/x86_64-native-linuxapp-icc/a0a4e391698e4d3493eb55745b7f9ff8/dpdk/mk/rte.sdkinstall.mk:61: pre_install] Error 2
make: *** [/root/CENTOS82-64_K4.18.0_ICC19.1.1/x86_64-native-linuxapp-icc/a0a4e391698e4d3493eb55745b7f9ff8/dpdk/mk/rte.sdkroot.mk:92: install] Error 2


*Makefile Build Failed #5:
OS: CENTOS82-64
Target: x86_64-native-linuxapp-gcc+shared
dpaa_ethdev.c:(.text.unlikely+0x1482): undefined reference to `dpaa_port_vsp_update'
dpaa_ethdev.o: In function `rte_dpaa_probe':
dpaa_ethdev.c:(.text.unlikely+0x1bdd): undefined reference to `dpaa_port_fmc_init'
collect2: error: ld returned 1 exit status
make[6]: *** [/root/CENTOS82-64_K4.18.0_GCC8.3.1/x86_64-native-linuxapp-gcc+shared/a0a4e391698e4d3493eb55745b7f9ff8/dpdk/mk/rte.lib.mk:95: librte_pmd_dpaa.so.20.0.3] Error 1
make[5]: *** [/root/CENTOS82-64_K4.18.0_GCC8.3.1/x86_64-native-linuxapp-gcc+shared/a0a4e391698e4d3493eb55745b7f9ff8/dpdk/mk/rte.subdir.mk:35: dpaa] Error 2
make[5]: *** Waiting for unfinished jobs....
  CC e1000_82542.o
  CC enic_ethdev.o
--
  INSTALL-LIB librte_pmd_hinic.so.20.0.3
  LD librte_pmd_enic.so.20.0.3
  INSTALL-LIB librte_pmd_enic.so.20.0.3
make[4]: *** [/root/CENTOS82-64_K4.18.0_GCC8.3.1/x86_64-native-linuxapp-gcc+shared/a0a4e391698e4d3493eb55745b7f9ff8/dpdk/mk/rte.subdir.mk:35: net] Error 2
make[3]: *** [/root/CENTOS82-64_K4.18.0_GCC8.3.1/x86_64-native-linuxapp-gcc+shared/a0a4e391698e4d3493eb55745b7f9ff8/dpdk/mk/rte.sdkbuild.mk:51: drivers] Error 2
make[2]: *** [/root/CENTOS82-64_K4.18.0_GCC8.3.1/x86_64-native-linuxapp-gcc+shared/a0a4e391698e4d3493eb55745b7f9ff8/dpdk/mk/rte.sdkroot.mk:115: all] Error 2
make[1]: *** [/root/CENTOS82-64_K4.18.0_GCC8.3.1/x86_64-native-linuxapp-gcc+shared/a0a4e391698e4d3493eb55745b7f9ff8/dpdk/mk/rte.sdkinstall.mk:61: pre_install] Error 2
make: *** [/root/CENTOS82-64_K4.18.0_GCC8.3.1/x86_64-native-linuxapp-gcc+shared/a0a4e391698e4d3493eb55745b7f9ff8/dpdk/mk/rte.sdkroot.mk:92: install] Error 2


*Makefile Build Failed #6:
OS: CENTOS82-64
Target: x86_64-native-linuxapp-gcc+debug
dpaa_ethdev.c:(.text.unlikely+0x126e): undefined reference to `dpaa_port_vsp_update'
/root/CENTOS82-64_K4.18.0_GCC8.3.1/x86_64-native-linuxapp-gcc+debug/a0a4e391698e4d3493eb55745b7f9ff8/dpdk/x86_64-native-linuxapp-gcc/lib/librte_pmd_dpaa.a(dpaa_ethdev.o): In function `rte_dpaa_probe':
dpaa_ethdev.c:(.text.unlikely+0x1959): undefined reference to `dpaa_port_fmc_init'
collect2: error: ld returned 1 exit status
make[5]: *** [/root/CENTOS82-64_K4.18.0_GCC8.3.1/x86_64-native-linuxapp-gcc+debug/a0a4e391698e4d3493eb55745b7f9ff8/dpdk/mk/rte.app.mk:456: testacl] Error 1
make[4]: *** [/root/CENTOS82-64_K4.18.0_GCC8.3.1/x86_64-native-linuxapp-gcc+debug/a0a4e391698e4d3493eb55745b7f9ff8/dpdk/mk/rte.subdir.mk:37: test-acl] Error 2
make[4]: *** Waiting for unfinished jobs....
  CC test_resource.o
  LD dpdk-procinfo
--
dpaa_ethdev.c:(.text.unlikely+0x126e): undefined reference to `dpaa_port_vsp_update'
/root/CENTOS82-64_K4.18.0_GCC8.3.1/x86_64-native-linuxapp-gcc+debug/a0a4e391698e4d3493eb55745b7f9ff8/dpdk/x86_64-native-linuxapp-gcc/lib/librte_pmd_dpaa.a(dpaa_ethdev.o): In function `rte_dpaa_probe':
dpaa_ethdev.c:(.text.unlikely+0x1959): undefined reference to `dpaa_port_fmc_init'
collect2: error: ld returned 1 exit status
make[5]: *** [/root/CENTOS82-64_K4.18.0_GCC8.3.1/x86_64-native-linuxapp-gcc+debug/a0a4e391698e4d3493eb55745b7f9ff8/dpdk/mk/rte.app.mk:456: cmdline_test] Error 1
make[4]: *** [/root/CENTOS82-64_K4.18.0_GCC8.3.1/x86_64-native-linuxapp-gcc+debug/a0a4e391698e4d3493eb55745b7f9ff8/dpdk/mk/rte.subdir.mk:37: test-cmdline] Error 2
  CC main.o
  CC init.o
  CC test_atomic.o
--
dpaa_ethdev.c:(.text.unlikely+0x126e): undefined reference to `dpaa_port_vsp_update'
/root/CENTOS82-64_K4.18.0_GCC8.3.1/x86_64-native-linuxapp-gcc+debug/a0a4e391698e4d3493eb55745b7f9ff8/dpdk/x86_64-native-linuxapp-gcc/lib/librte_pmd_dpaa.a(dpaa_ethdev.o): In function `rte_dpaa_probe':
dpaa_ethdev.c:(.text.unlikely+0x1959): undefined reference to `dpaa_port_fmc_init'
collect2: error: ld returned 1 exit status
make[5]: *** [/root/CENTOS82-64_K4.18.0_GCC8.3.1/x86_64-native-linuxapp-gcc+debug/a0a4e391698e4d3493eb55745b7f9ff8/dpdk/mk/rte.app.mk:456: dpdk-pdump] Error 1
make[4]: *** [/root/CENTOS82-64_K4.18.0_GCC8.3.1/x86_64-native-linuxapp-gcc+debug/a0a4e391698e4d3493eb55745b7f9ff8/dpdk/mk/rte.subdir.mk:37: pdump] Error 2
  CC parameters.o
  CC test_malloc.o
/root/CENTOS82-64_K4.18.0_GCC8.3.1/x86_64-native-linuxapp-gcc+debug/a0a4e391698e4d3493eb55745b7f9ff8/dpdk/x86_64-native-linuxapp-gcc/lib/librte_pmd_dpaa.a(dpaa_ethdev.o): In function `dpaa_eth_rx_queue_setup':
dpaa_ethdev.c:(.text.unlikely+0x126e): undefined reference to `dpaa_port_vsp_update'
/root/CENTOS82-64_K4.18.0_GCC8.3.1/x86_64-native-linuxapp-gcc+debug/a0a4e391698e4d3493eb55745b7f9ff8/dpdk/x86_64-native-linuxapp-gcc/lib/librte_pmd_dpaa.a(dpaa_ethdev.o): In function `rte_dpaa_probe':
dpaa_ethdev.c:(.text.unlikely+0x1959): undefined reference to `dpaa_port_fmc_init'
collect2: error: ld returned 1 exit status
make[5]: *** [/root/CENTOS82-64_K4.18.0_GCC8.3.1/x86_64-native-linuxapp-gcc+debug/a0a4e391698e4d3493eb55745b7f9ff8/dpdk/mk/rte.app.mk:456: dpdk-procinfo] Error 1
make[4]: *** [/root/CENTOS82-64_K4.18.0_GCC8.3.1/x86_64-native-linuxapp-gcc+debug/a0a4e391698e4d3493eb55745b7f9ff8/dpdk/mk/rte.subdir.mk:37: proc-info] Error 2
  CC test_cycles.o
/root/CENTOS82-64_K4.18.0_GCC8.3.1/x86_64-native-linuxapp-gcc+debug/a0a4e391698e4d3493eb55745b7f9ff8/dpdk/x86_64-native-linuxapp-gcc/lib/librte_pmd_dpaa.a(dpaa_ethdev.o): In function `dpaa_eth_rx_queue_setup':
dpaa_ethdev.c:(.text.unlikely+0x126e): undefined reference to `dpaa_port_vsp_update'
/root/CENTOS82-64_K4.18.0_GCC8.3.1/x86_64-native-linuxapp-gcc+debug/a0a4e391698e4d3493eb55745b7f9ff8/dpdk/x86_64-native-linuxapp-gcc/lib/librte_pmd_dpaa.a(dpaa_ethdev.o): In function `rte_dpaa_probe':
dpaa_ethdev.c:(.text.unlikely+0x1959): undefined reference to `dpaa_port_fmc_init'
collect2: error: ld returned 1 exit status
make[5]: *** [/root/CENTOS82-64_K4.18.0_GCC8.3.1/x86_64-native-linuxapp-gcc+debug/a0a4e391698e4d3493eb55745b7f9ff8/dpdk/mk/rte.app.mk:456: testsad] Error 1
make[4]: *** [/root/CENTOS82-64_K4.18.0_GCC8.3.1/x86_64-native-linuxapp-gcc+debug/a0a4e391698e4d3493eb55745b7f9ff8/dpdk/mk/rte.subdir.mk:37: test-sad] Error 2
  CC test_mcslock.o
  CC test_spinlock.o
/root/CENTOS82-64_K4.18.0_GCC8.3.1/x86_64-native-linuxapp-gcc+debug/a0a4e391698e4d3493eb55745b7f9ff8/dpdk/x86_64-native-linuxapp-gcc/lib/librte_pmd_dpaa.a(dpaa_ethdev.o): In function `dpaa_eth_rx_queue_setup':
dpaa_ethdev.c:(.text.unlikely+0x126e): undefined reference to `dpaa_port_vsp_update'
/root/CENTOS82-64_K4.18.0_GCC8.3.1/x86_64-native-linuxapp-gcc+debug/a0a4e391698e4d3493eb55745b7f9ff8/dpdk/x86_64-native-linuxapp-gcc/lib/librte_pmd_dpaa.a(dpaa_ethdev.o): In function `rte_dpaa_probe':
dpaa_ethdev.c:(.text.unlikely+0x1959): undefined reference to `dpaa_port_fmc_init'
collect2: error: ld returned 1 exit status
make[5]: *** [/root/CENTOS82-64_K4.18.0_GCC8.3.1/x86_64-native-linuxapp-gcc+debug/a0a4e391698e4d3493eb55745b7f9ff8/dpdk/mk/rte.app.mk:456: testfib] Error 1
make[4]: *** [/root/CENTOS82-64_K4.18.0_GCC8.3.1/x86_64-native-linuxapp-gcc+debug/a0a4e391698e4d3493eb55745b7f9ff8/dpdk/mk/rte.subdir.mk:37: test-fib] Error 2
  CC cmdline.o
  CC test_ticketlock.o
  CC runtime.o
--
dpaa_ethdev.c:(.text.unlikely+0x126e): undefined reference to `dpaa_port_vsp_update'
/root/CENTOS82-64_K4.18.0_GCC8.3.1/x86_64-native-linuxapp-gcc+debug/a0a4e391698e4d3493eb55745b7f9ff8/dpdk/x86_64-native-linuxapp-gcc/lib/librte_pmd_dpaa.a(dpaa_ethdev.o): In function `rte_dpaa_probe':
dpaa_ethdev.c:(.text.unlikely+0x1959): undefined reference to `dpaa_port_fmc_init'
collect2: error: ld returned 1 exit status
make[5]: *** [/root/CENTOS82-64_K4.18.0_GCC8.3.1/x86_64-native-linuxapp-gcc+debug/a0a4e391698e4d3493eb55745b7f9ff8/dpdk/mk/rte.app.mk:456: dpdk-test-flow-perf] Error 1
make[4]: *** [/root/CENTOS82-64_K4.18.0_GCC8.3.1/x86_64-native-linuxapp-gcc+debug/a0a4e391698e4d3493eb55745b7f9ff8/dpdk/mk/rte.subdir.mk:37: test-flow-perf] Error 2
  CC test_ring_mt_peek_stress.o
  CC pipeline_acl.o
  CC test_ring_rts_stress.o
--
dpaa_ethdev.c:(.text.unlikely+0x126e): undefined reference to `dpaa_port_vsp_update'
/root/CENTOS82-64_K4.18.0_GCC8.3.1/x86_64-native-linuxapp-gcc+debug/a0a4e391698e4d3493eb55745b7f9ff8/dpdk/x86_64-native-linuxapp-gcc/lib/librte_pmd_dpaa.a(dpaa_ethdev.o): In function `rte_dpaa_probe':
dpaa_ethdev.c:(.text.unlikely+0x1959): undefined reference to `dpaa_port_fmc_init'
collect2: error: ld returned 1 exit status
make[5]: *** [/root/CENTOS82-64_K4.18.0_GCC8.3.1/x86_64-native-linuxapp-gcc+debug/a0a4e391698e4d3493eb55745b7f9ff8/dpdk/mk/rte.app.mk:456: testpipeline] Error 1
make[4]: *** [/root/CENTOS82-64_K4.18.0_GCC8.3.1/x86_64-native-linuxapp-gcc+debug/a0a4e391698e4d3493eb55745b7f9ff8/dpdk/mk/rte.subdir.mk:37: test-pipeline] Error 2
  CC macswap.o
  CC flowgen.o
  CC test_table_acl.o
--
dpaa_ethdev.c:(.text.unlikely+0x126e): undefined reference to `dpaa_port_vsp_update'
/root/CENTOS82-64_K4.18.0_GCC8.3.1/x86_64-native-linuxapp-gcc+debug/a0a4e391698e4d3493eb55745b7f9ff8/dpdk/x86_64-native-linuxapp-gcc/lib/librte_pmd_dpaa.a(dpaa_ethdev.o): In function `rte_dpaa_probe':
dpaa_ethdev.c:(.text.unlikely+0x1959): undefined reference to `dpaa_port_fmc_init'
collect2: error: ld returned 1 exit status
make[5]: *** [/root/CENTOS82-64_K4.18.0_GCC8.3.1/x86_64-native-linuxapp-gcc+debug/a0a4e391698e4d3493eb55745b7f9ff8/dpdk/mk/rte.app.mk:456: testpmd] Error 1
make[4]: *** [/root/CENTOS82-64_K4.18.0_GCC8.3.1/x86_64-native-linuxapp-gcc+debug/a0a4e391698e4d3493eb55745b7f9ff8/dpdk/mk/rte.subdir.mk:37: test-pmd] Error 2
  CC test_rib6.o
  CC test_fib.o
  CC test_fib6.o
--
dpaa_ethdev.c:(.text.unlikely+0x126e): undefined reference to `dpaa_port_vsp_update'
/root/CENTOS82-64_K4.18.0_GCC8.3.1/x86_64-native-linuxapp-gcc+debug/a0a4e391698e4d3493eb55745b7f9ff8/dpdk/x86_64-native-linuxapp-gcc/lib/librte_pmd_dpaa.a(dpaa_ethdev.o): In function `rte_dpaa_probe':
dpaa_ethdev.c:(.text.unlikely+0x1959): undefined reference to `dpaa_port_fmc_init'
collect2: error: ld returned 1 exit status
make[5]: *** [/root/CENTOS82-64_K4.18.0_GCC8.3.1/x86_64-native-linuxapp-gcc+debug/a0a4e391698e4d3493eb55745b7f9ff8/dpdk/mk/rte.app.mk:456: test] Error 1
make[4]: *** [/root/CENTOS82-64_K4.18.0_GCC8.3.1/x86_64-native-linuxapp-gcc+debug/a0a4e391698e4d3493eb55745b7f9ff8/dpdk/mk/rte.subdir.mk:37: test] Error 2
make[3]: *** [/root/CENTOS82-64_K4.18.0_GCC8.3.1/x86_64-native-linuxapp-gcc+debug/a0a4e391698e4d3493eb55745b7f9ff8/dpdk/mk/rte.sdkbuild.mk:53: app] Error 2
make[2]: *** [/root/CENTOS82-64_K4.18.0_GCC8.3.1/x86_64-native-linuxapp-gcc+debug/a0a4e391698e4d3493eb55745b7f9ff8/dpdk/mk/rte.sdkroot.mk:115: all] Error 2
make[1]: *** [/root/CENTOS82-64_K4.18.0_GCC8.3.1/x86_64-native-linuxapp-gcc+debug/a0a4e391698e4d3493eb55745b7f9ff8/dpdk/mk/rte.sdkinstall.mk:61: pre_install] Error 2
make: *** [/root/CENTOS82-64_K4.18.0_GCC8.3.1/x86_64-native-linuxapp-gcc+debug/a0a4e391698e4d3493eb55745b7f9ff8/dpdk/mk/rte.sdkroot.mk:92: install] Error 2


*Makefile Build Failed #7:
OS: FC32-64
Target: x86_64-native-linuxapp-gcc
dpaa_ethdev.c:(.text.unlikely+0x1251): undefined reference to `dpaa_port_fmc_init'
/usr/bin/ld: /root/FC32-64_K5.6.0_GCC10.0.1/x86_64-native-linuxapp-gcc/a0a4e391698e4d3493eb55745b7f9ff8/dpdk/x86_64-native-linuxapp-gcc/lib/librte_pmd_dpaa.a(dpaa_ethdev.o): in function `dpaa_eth_rx_queue_setup':
dpaa_ethdev.c:(.text.unlikely+0x1faf): undefined reference to `dpaa_port_vsp_update'
collect2: error: ld returned 1 exit status
make[5]: *** [/root/FC32-64_K5.6.0_GCC10.0.1/x86_64-native-linuxapp-gcc/a0a4e391698e4d3493eb55745b7f9ff8/dpdk/mk/rte.app.mk:456: cmdline_test] Error 1
make[4]: *** [/root/FC32-64_K5.6.0_GCC10.0.1/x86_64-native-linuxapp-gcc/a0a4e391698e4d3493eb55745b7f9ff8/dpdk/mk/rte.subdir.mk:37: test-cmdline] Error 2
make[4]: *** Waiting for unfinished jobs....
  CC runtime.o
/usr/bin/ld: /root/FC32-64_K5.6.0_GCC10.0.1/x86_64-native-linuxapp-gcc/a0a4e391698e4d3493eb55745b7f9ff8/dpdk/x86_64-native-linuxapp-gcc/lib/librte_pmd_dpaa.a(dpaa_ethdev.o): in function `rte_dpaa_probe':
--
/usr/bin/ld: /root/FC32-64_K5.6.0_GCC10.0.1/x86_64-native-linuxapp-gcc/a0a4e391698e4d3493eb55745b7f9ff8/dpdk/x86_64-native-linuxapp-gcc/lib/librte_pmd_dpaa.a(dpaa_ethdev.o): in function `dpaa_eth_rx_queue_setup':
dpaa_ethdev.c:(.text.unlikely+0x1faf): undefined reference to `dpaa_port_vsp_update'
  CC main.o
collect2: error: ld returned 1 exit status
make[5]: *** [/root/FC32-64_K5.6.0_GCC10.0.1/x86_64-native-linuxapp-gcc/a0a4e391698e4d3493eb55745b7f9ff8/dpdk/mk/rte.app.mk:456: testsad] Error 1
make[4]: *** [/root/FC32-64_K5.6.0_GCC10.0.1/x86_64-native-linuxapp-gcc/a0a4e391698e4d3493eb55745b7f9ff8/dpdk/mk/rte.subdir.mk:37: test-sad] Error 2
  CC parameters.o
collect2: error: ld returned 1 exit status
make[5]: *** [/root/FC32-64_K5.6.0_GCC10.0.1/x86_64-native-linuxapp-gcc/a0a4e391698e4d3493eb55745b7f9ff8/dpdk/mk/rte.app.mk:456: testacl] Error 1
make[4]: *** [/root/FC32-64_K5.6.0_GCC10.0.1/x86_64-native-linuxapp-gcc/a0a4e391698e4d3493eb55745b7f9ff8/dpdk/mk/rte.subdir.mk:37: test-acl] Error 2
  CC pipeline_stub.o
/usr/bin/ld: /root/FC32-64_K5.6.0_GCC10.0.1/x86_64-native-linuxapp-gcc/a0a4e391698e4d3493eb55745b7f9ff8/dpdk/x86_64-native-linuxapp-gcc/lib/librte_pmd_dpaa.a(dpaa_ethdev.o): in function `rte_dpaa_probe':
dpaa_ethdev.c:(.text.unlikely+0x1251): undefined reference to `dpaa_port_fmc_init'
--
dpaa_ethdev.c:(.text.unlikely+0x1faf): undefined reference to `dpaa_port_vsp_update'
  CC test_prefetch.o
  CC cmdline.o
collect2: error: ld returned 1 exit status
make[5]: *** [/root/FC32-64_K5.6.0_GCC10.0.1/x86_64-native-linuxapp-gcc/a0a4e391698e4d3493eb55745b7f9ff8/dpdk/mk/rte.app.mk:456: dpdk-procinfo] Error 1
make[4]: *** [/root/FC32-64_K5.6.0_GCC10.0.1/x86_64-native-linuxapp-gcc/a0a4e391698e4d3493eb55745b7f9ff8/dpdk/mk/rte.subdir.mk:37: proc-info] Error 2
  CC cmdline_flow.o
collect2: error: ld returned 1 exit status
make[5]: *** [/root/FC32-64_K5.6.0_GCC10.0.1/x86_64-native-linuxapp-gcc/a0a4e391698e4d3493eb55745b7f9ff8/dpdk/mk/rte.app.mk:456: testfib] Error 1
  CC pipeline_hash.o
make[4]: *** [/root/FC32-64_K5.6.0_GCC10.0.1/x86_64-native-linuxapp-gcc/a0a4e391698e4d3493eb55745b7f9ff8/dpdk/mk/rte.subdir.mk:37: test-fib] Error 2
  CC pipeline_lpm.o
  CC test_byteorder.o
  CC cmdline_mtr.o
  CC pipeline_lpm_ipv6.o
  CC test_per_lcore.o
collect2: error: ld returned 1 exit status
make[5]: *** [/root/FC32-64_K5.6.0_GCC10.0.1/x86_64-native-linuxapp-gcc/a0a4e391698e4d3493eb55745b7f9ff8/dpdk/mk/rte.app.mk:456: dpdk-pdump] Error 1
make[4]: *** [/root/FC32-64_K5.6.0_GCC10.0.1/x86_64-native-linuxapp-gcc/a0a4e391698e4d3493eb55745b7f9ff8/dpdk/mk/rte.subdir.mk:37: pdump] Error 2
  CC test_atomic.o
  LD dpdk-test-flow-perf
  CC test_barrier.o
--
dpaa_ethdev.c:(.text.unlikely+0x1faf): undefined reference to `dpaa_port_vsp_update'
  CC test_spinlock.o
  CC macswap.o
collect2: error: ld returned 1 exit status
make[5]: *** [/root/FC32-64_K5.6.0_GCC10.0.1/x86_64-native-linuxapp-gcc/a0a4e391698e4d3493eb55745b7f9ff8/dpdk/mk/rte.app.mk:456: dpdk-test-flow-perf] Error 1
make[4]: *** [/root/FC32-64_K5.6.0_GCC10.0.1/x86_64-native-linuxapp-gcc/a0a4e391698e4d3493eb55745b7f9ff8/dpdk/mk/rte.subdir.mk:37: test-flow-perf] Error 2
  CC flowgen.o
  CC test_ticketlock.o
  CC test_memory.o
--
  CC test_bitops.o
  CC test_reciprocal_division.o
  CC test_reciprocal_division_perf.o
collect2: error: ld returned 1 exit status
make[5]: *** [/root/FC32-64_K5.6.0_GCC10.0.1/x86_64-native-linuxapp-gcc/a0a4e391698e4d3493eb55745b7f9ff8/dpdk/mk/rte.app.mk:456: testpipeline] Error 1
make[4]: *** [/root/FC32-64_K5.6.0_GCC10.0.1/x86_64-native-linuxapp-gcc/a0a4e391698e4d3493eb55745b7f9ff8/dpdk/mk/rte.subdir.mk:37: test-pipeline] Error 2
  CC test_fbarray.o
  CC test_external_mem.o
  CC test_rand_perf.o
--
dpaa_ethdev.c:(.text.unlikely+0x1faf): undefined reference to `dpaa_port_vsp_update'
  CC test_rib.o
  CC test_rib6.o
collect2: error: ld returned 1 exit status
make[5]: *** [/root/FC32-64_K5.6.0_GCC10.0.1/x86_64-native-linuxapp-gcc/a0a4e391698e4d3493eb55745b7f9ff8/dpdk/mk/rte.app.mk:456: testpmd] Error 1
make[4]: *** [/root/FC32-64_K5.6.0_GCC10.0.1/x86_64-native-linuxapp-gcc/a0a4e391698e4d3493eb55745b7f9ff8/dpdk/mk/rte.subdir.mk:37: test-pmd] Error 2
  CC test_fib.o
  CC test_fib6.o
  CC test_fib_perf.o
--
dpaa_ethdev.c:(.text.unlikely+0x1251): undefined reference to `dpaa_port_fmc_init'
/usr/bin/ld: /root/FC32-64_K5.6.0_GCC10.0.1/x86_64-native-linuxapp-gcc/a0a4e391698e4d3493eb55745b7f9ff8/dpdk/x86_64-native-linuxapp-gcc/lib/librte_pmd_dpaa.a(dpaa_ethdev.o): in function `dpaa_eth_rx_queue_setup':
dpaa_ethdev.c:(.text.unlikely+0x1faf): undefined reference to `dpaa_port_vsp_update'
collect2: error: ld returned 1 exit status
make[5]: *** [/root/FC32-64_K5.6.0_GCC10.0.1/x86_64-native-linuxapp-gcc/a0a4e391698e4d3493eb55745b7f9ff8/dpdk/mk/rte.app.mk:456: test] Error 1
make[4]: *** [/root/FC32-64_K5.6.0_GCC10.0.1/x86_64-native-linuxapp-gcc/a0a4e391698e4d3493eb55745b7f9ff8/dpdk/mk/rte.subdir.mk:37: test] Error 2
make[3]: *** [/root/FC32-64_K5.6.0_GCC10.0.1/x86_64-native-linuxapp-gcc/a0a4e391698e4d3493eb55745b7f9ff8/dpdk/mk/rte.sdkbuild.mk:53: app] Error 2
make[2]: *** [/root/FC32-64_K5.6.0_GCC10.0.1/x86_64-native-linuxapp-gcc/a0a4e391698e4d3493eb55745b7f9ff8/dpdk/mk/rte.sdkroot.mk:115: all] Error 2
make[1]: *** [/root/FC32-64_K5.6.0_GCC10.0.1/x86_64-native-linuxapp-gcc/a0a4e391698e4d3493eb55745b7f9ff8/dpdk/mk/rte.sdkinstall.mk:61: pre_install] Error 2
make: *** [/root/FC32-64_K5.6.0_GCC10.0.1/x86_64-native-linuxapp-gcc/a0a4e391698e4d3493eb55745b7f9ff8/dpdk/mk/rte.sdkroot.mk:92: install] Error 2


*Makefile Build Failed #8:
OS: FC32-64
Target: x86_64-native-linuxapp-clang
/usr/bin/ld: /root/FC32-64_K5.6.0_Clang10.0.0/x86_64-native-linuxapp-clang/a0a4e391698e4d3493eb55745b7f9ff8/dpdk/x86_64-native-linuxapp-clang/lib/librte_pmd_dpaa.a(dpaa_ethdev.o): in function `rte_dpaa_probe':
dpaa_ethdev.c:(.text+0x2469): undefined reference to `dpaa_port_fmc_init'
  CC flow_gen.o
clang-10: error: linker command failed with exit code 1 (use -v to see invocation)
make[5]: *** [/root/FC32-64_K5.6.0_Clang10.0.0/x86_64-native-linuxapp-clang/a0a4e391698e4d3493eb55745b7f9ff8/dpdk/mk/rte.app.mk:456: cmdline_test] Error 1
make[4]: *** [/root/FC32-64_K5.6.0_Clang10.0.0/x86_64-native-linuxapp-clang/a0a4e391698e4d3493eb55745b7f9ff8/dpdk/mk/rte.subdir.mk:37: test-cmdline] Error 2
make[4]: *** Waiting for unfinished jobs....
  CC resource.o
  CC parameters.o
--
  LD testfib
  CC init.o
  CC test_byteorder.o
clang-10: error: linker command failed with exit code 1 (use -v to see invocation)
make[5]: *** [/root/FC32-64_K5.6.0_Clang10.0.0/x86_64-native-linuxapp-clang/a0a4e391698e4d3493eb55745b7f9ff8/dpdk/mk/rte.app.mk:456: dpdk-procinfo] Error 1
make[4]: *** [/root/FC32-64_K5.6.0_Clang10.0.0/x86_64-native-linuxapp-clang/a0a4e391698e4d3493eb55745b7f9ff8/dpdk/mk/rte.subdir.mk:37: proc-info] Error 2
/usr/bin/ld: /root/FC32-64_K5.6.0_Clang10.0.0/x86_64-native-linuxapp-clang/a0a4e391698e4d3493eb55745b7f9ff8/dpdk/x86_64-native-linuxapp-clang/lib/librte_pmd_dpaa.a(dpaa_ethdev.o): in function `dpaa_eth_rx_queue_setup':
dpaa_ethdev.c:(.text+0x1535): undefined reference to `dpaa_port_vsp_update'
/usr/bin/ld: /root/FC32-64_K5.6.0_Clang10.0.0/x86_64-native-linuxapp-clang/a0a4e391698e4d3493eb55745b7f9ff8/dpdk/x86_64-native-linuxapp-clang/lib/librte_pmd_dpaa.a(dpaa_ethdev.o): in function `rte_dpaa_probe':
dpaa_ethdev.c:(.text+0x2469): undefined reference to `dpaa_port_fmc_init'
  CC test_per_lcore.o
clang-10: error: linker command failed with exit code 1 (use -v to see invocation)
make[5]: *** [/root/FC32-64_K5.6.0_Clang10.0.0/x86_64-native-linuxapp-clang/a0a4e391698e4d3493eb55745b7f9ff8/dpdk/mk/rte.app.mk:456: testacl] Error 1
make[4]: *** [/root/FC32-64_K5.6.0_Clang10.0.0/x86_64-native-linuxapp-clang/a0a4e391698e4d3493eb55745b7f9ff8/dpdk/mk/rte.subdir.mk:37: test-acl] Error 2
  CC test_atomic.o
  CC cmdline.o
clang-10: error: linker command failed with exit code 1 (use -v to see invocation)
make[5]: *** [/root/FC32-64_K5.6.0_Clang10.0.0/x86_64-native-linuxapp-clang/a0a4e391698e4d3493eb55745b7f9ff8/dpdk/mk/rte.app.mk:456: testsad] Error 1
make[4]: *** [/root/FC32-64_K5.6.0_Clang10.0.0/x86_64-native-linuxapp-clang/a0a4e391698e4d3493eb55745b7f9ff8/dpdk/mk/rte.subdir.mk:37: test-sad] Error 2
  CC test_barrier.o
  CC items_gen.o
/usr/bin/ld: /root/FC32-64_K5.6.0_Clang10.0.0/x86_64-native-linuxapp-clang/a0a4e391698e4d3493eb55745b7f9ff8/dpdk/x86_64-native-linuxapp-clang/lib/librte_pmd_dpaa.a(dpaa_ethdev.o): in function `dpaa_eth_rx_queue_setup':
--
/usr/bin/ld: /root/FC32-64_K5.6.0_Clang10.0.0/x86_64-native-linuxapp-clang/a0a4e391698e4d3493eb55745b7f9ff8/dpdk/x86_64-native-linuxapp-clang/lib/librte_pmd_dpaa.a(dpaa_ethdev.o): in function `rte_dpaa_probe':
dpaa_ethdev.c:(.text+0x2469): undefined reference to `dpaa_port_fmc_init'
  CC main.o
clang-10: error: linker command failed with exit code 1 (use -v to see invocation)
make[5]: *** [/root/FC32-64_K5.6.0_Clang10.0.0/x86_64-native-linuxapp-clang/a0a4e391698e4d3493eb55745b7f9ff8/dpdk/mk/rte.app.mk:456: dpdk-pdump] Error 1
make[4]: *** [/root/FC32-64_K5.6.0_Clang10.0.0/x86_64-native-linuxapp-clang/a0a4e391698e4d3493eb55745b7f9ff8/dpdk/mk/rte.subdir.mk:37: pdump] Error 2
  CC test_malloc.o
clang-10: error: linker command failed with exit code 1 (use -v to see invocation)
make[5]: *** [/root/FC32-64_K5.6.0_Clang10.0.0/x86_64-native-linuxapp-clang/a0a4e391698e4d3493eb55745b7f9ff8/dpdk/mk/rte.app.mk:456: testfib] Error 1
make[4]: *** [/root/FC32-64_K5.6.0_Clang10.0.0/x86_64-native-linuxapp-clang/a0a4e391698e4d3493eb55745b7f9ff8/dpdk/mk/rte.subdir.mk:37: test-fib] Error 2
  CC test_cycles.o
  CC cmdline_flow.o
  CC pipeline_stub.o
--
  CC test_reciprocal_division_perf.o
  CC iofwd.o
  CC macfwd.o
clang-10: error: linker command failed with exit code 1 (use -v to see invocation)
make[5]: *** [/root/FC32-64_K5.6.0_Clang10.0.0/x86_64-native-linuxapp-clang/a0a4e391698e4d3493eb55745b7f9ff8/dpdk/mk/rte.app.mk:456: dpdk-test-flow-perf] Error 1
make[4]: *** [/root/FC32-64_K5.6.0_Clang10.0.0/x86_64-native-linuxapp-clang/a0a4e391698e4d3493eb55745b7f9ff8/dpdk/mk/rte.subdir.mk:37: test-flow-perf] Error 2
  CC macswap.o
  CC flowgen.o
  CC test_fbarray.o
--
dpaa_ethdev.c:(.text+0x1535): undefined reference to `dpaa_port_vsp_update'
/usr/bin/ld: /root/FC32-64_K5.6.0_Clang10.0.0/x86_64-native-linuxapp-clang/a0a4e391698e4d3493eb55745b7f9ff8/dpdk/x86_64-native-linuxapp-clang/lib/librte_pmd_dpaa.a(dpaa_ethdev.o): in function `rte_dpaa_probe':
dpaa_ethdev.c:(.text+0x2469): undefined reference to `dpaa_port_fmc_init'
clang-10: error: linker command failed with exit code 1 (use -v to see invocation)
make[5]: *** [/root/FC32-64_K5.6.0_Clang10.0.0/x86_64-native-linuxapp-clang/a0a4e391698e4d3493eb55745b7f9ff8/dpdk/mk/rte.app.mk:456: testpipeline] Error 1
make[4]: *** [/root/FC32-64_K5.6.0_Clang10.0.0/x86_64-native-linuxapp-clang/a0a4e391698e4d3493eb55745b7f9ff8/dpdk/mk/rte.subdir.mk:37: test-pipeline] Error 2
  CC test_ring_st_peek_stress.o
  CC bpf_cmd.o
  CC util.o
--
/usr/bin/ld: /root/FC32-64_K5.6.0_Clang10.0.0/x86_64-native-linuxapp-clang/a0a4e391698e4d3493eb55745b7f9ff8/dpdk/x86_64-native-linuxapp-clang/lib/librte_pmd_dpaa.a(dpaa_ethdev.o): in function `rte_dpaa_probe':
dpaa_ethdev.c:(.text+0x2469): undefined reference to `dpaa_port_fmc_init'
  CC test_hash.o
clang-10: error: linker command failed with exit code 1 (use -v to see invocation)
make[5]: *** [/root/FC32-64_K5.6.0_Clang10.0.0/x86_64-native-linuxapp-clang/a0a4e391698e4d3493eb55745b7f9ff8/dpdk/mk/rte.app.mk:456: testpmd] Error 1
make[4]: *** [/root/FC32-64_K5.6.0_Clang10.0.0/x86_64-native-linuxapp-clang/a0a4e391698e4d3493eb55745b7f9ff8/dpdk/mk/rte.subdir.mk:37: test-pmd] Error 2
  CC test_thash.o
  CC test_hash_perf.o
  CC test_hash_functions.o
--
dpaa_ethdev.c:(.text+0x1535): undefined reference to `dpaa_port_vsp_update'
/usr/bin/ld: /root/FC32-64_K5.6.0_Clang10.0.0/x86_64-native-linuxapp-clang/a0a4e391698e4d3493eb55745b7f9ff8/dpdk/x86_64-native-linuxapp-clang/lib/librte_pmd_dpaa.a(dpaa_ethdev.o): in function `rte_dpaa_probe':
dpaa_ethdev.c:(.text+0x2469): undefined reference to `dpaa_port_fmc_init'
clang-10: error: linker command failed with exit code 1 (use -v to see invocation)
make[5]: *** [/root/FC32-64_K5.6.0_Clang10.0.0/x86_64-native-linuxapp-clang/a0a4e391698e4d3493eb55745b7f9ff8/dpdk/mk/rte.app.mk:456: test] Error 1
make[4]: *** [/root/FC32-64_K5.6.0_Clang10.0.0/x86_64-native-linuxapp-clang/a0a4e391698e4d3493eb55745b7f9ff8/dpdk/mk/rte.subdir.mk:37: test] Error 2
make[3]: *** [/root/FC32-64_K5.6.0_Clang10.0.0/x86_64-native-linuxapp-clang/a0a4e391698e4d3493eb55745b7f9ff8/dpdk/mk/rte.sdkbuild.mk:53: app] Error 2
make[2]: *** [/root/FC32-64_K5.6.0_Clang10.0.0/x86_64-native-linuxapp-clang/a0a4e391698e4d3493eb55745b7f9ff8/dpdk/mk/rte.sdkroot.mk:115: all] Error 2
make[1]: *** [/root/FC32-64_K5.6.0_Clang10.0.0/x86_64-native-linuxapp-clang/a0a4e391698e4d3493eb55745b7f9ff8/dpdk/mk/rte.sdkinstall.mk:61: pre_install] Error 2
make: *** [/root/FC32-64_K5.6.0_Clang10.0.0/x86_64-native-linuxapp-clang/a0a4e391698e4d3493eb55745b7f9ff8/dpdk/mk/rte.sdkroot.mk:92: install] Error 2


*Makefile Build Failed #9:
OS: RHEL82-64
Target: x86_64-native-linuxapp-gcc
dpaa_ethdev.c:(.text.unlikely+0x126e): undefined reference to `dpaa_port_vsp_update'
/root/RHEL82-64_K4.18.0_GCC8.3.1/x86_64-native-linuxapp-gcc/a0a4e391698e4d3493eb55745b7f9ff8/dpdk/x86_64-native-linuxapp-gcc/lib/librte_pmd_dpaa.a(dpaa_ethdev.o): In function `rte_dpaa_probe':
dpaa_ethdev.c:(.text.unlikely+0x1959): undefined reference to `dpaa_port_fmc_init'
collect2: error: ld returned 1 exit status
make[5]: *** [/root/RHEL82-64_K4.18.0_GCC8.3.1/x86_64-native-linuxapp-gcc/a0a4e391698e4d3493eb55745b7f9ff8/dpdk/mk/rte.app.mk:456: testacl] Error 1
make[4]: *** [/root/RHEL82-64_K4.18.0_GCC8.3.1/x86_64-native-linuxapp-gcc/a0a4e391698e4d3493eb55745b7f9ff8/dpdk/mk/rte.subdir.mk:37: test-acl] Error 2
make[4]: *** Waiting for unfinished jobs....
  CC runtime.o
/root/RHEL82-64_K4.18.0_GCC8.3.1/x86_64-native-linuxapp-gcc/a0a4e391698e4d3493eb55745b7f9ff8/dpdk/x86_64-native-linuxapp-gcc/lib/librte_pmd_dpaa.a(dpaa_ethdev.o): In function `dpaa_eth_rx_queue_setup':
dpaa_ethdev.c:(.text.unlikely+0x126e): undefined reference to `dpaa_port_vsp_update'
/root/RHEL82-64_K4.18.0_GCC8.3.1/x86_64-native-linuxapp-gcc/a0a4e391698e4d3493eb55745b7f9ff8/dpdk/x86_64-native-linuxapp-gcc/lib/librte_pmd_dpaa.a(dpaa_ethdev.o): In function `rte_dpaa_probe':
dpaa_ethdev.c:(.text.unlikely+0x1959): undefined reference to `dpaa_port_fmc_init'
collect2: error: ld returned 1 exit status
make[5]: *** [/root/RHEL82-64_K4.18.0_GCC8.3.1/x86_64-native-linuxapp-gcc/a0a4e391698e4d3493eb55745b7f9ff8/dpdk/mk/rte.app.mk:456: dpdk-procinfo] Error 1
make[4]: *** [/root/RHEL82-64_K4.18.0_GCC8.3.1/x86_64-native-linuxapp-gcc/a0a4e391698e4d3493eb55745b7f9ff8/dpdk/mk/rte.subdir.mk:37: proc-info] Error 2
/root/RHEL82-64_K4.18.0_GCC8.3.1/x86_64-native-linuxapp-gcc/a0a4e391698e4d3493eb55745b7f9ff8/dpdk/x86_64-native-linuxapp-gcc/lib/librte_pmd_dpaa.a(dpaa_ethdev.o): In function `dpaa_eth_rx_queue_setup':
dpaa_ethdev.c:(.text.unlikely+0x126e): undefined reference to `dpaa_port_vsp_update'
/root/RHEL82-64_K4.18.0_GCC8.3.1/x86_64-native-linuxapp-gcc/a0a4e391698e4d3493eb55745b7f9ff8/dpdk/x86_64-native-linuxapp-gcc/lib/librte_pmd_dpaa.a(dpaa_ethdev.o): In function `rte_dpaa_probe':
dpaa_ethdev.c:(.text.unlikely+0x1959): undefined reference to `dpaa_port_fmc_init'
collect2: error: ld returned 1 exit status
  CC pipeline_stub.o
make[5]: *** [/root/RHEL82-64_K4.18.0_GCC8.3.1/x86_64-native-linuxapp-gcc/a0a4e391698e4d3493eb55745b7f9ff8/dpdk/mk/rte.app.mk:456: cmdline_test] Error 1
make[4]: *** [/root/RHEL82-64_K4.18.0_GCC8.3.1/x86_64-native-linuxapp-gcc/a0a4e391698e4d3493eb55745b7f9ff8/dpdk/mk/rte.subdir.mk:37: test-cmdline] Error 2
  CC test_resource.o
  CC test_prefetch.o
  CC main.o
--
dpaa_ethdev.c:(.text.unlikely+0x126e): undefined reference to `dpaa_port_vsp_update'
/root/RHEL82-64_K4.18.0_GCC8.3.1/x86_64-native-linuxapp-gcc/a0a4e391698e4d3493eb55745b7f9ff8/dpdk/x86_64-native-linuxapp-gcc/lib/librte_pmd_dpaa.a(dpaa_ethdev.o): In function `rte_dpaa_probe':
dpaa_ethdev.c:(.text.unlikely+0x1959): undefined reference to `dpaa_port_fmc_init'
collect2: error: ld returned 1 exit status
make[5]: *** [/root/RHEL82-64_K4.18.0_GCC8.3.1/x86_64-native-linuxapp-gcc/a0a4e391698e4d3493eb55745b7f9ff8/dpdk/mk/rte.app.mk:456: testsad] Error 1
make[4]: *** [/root/RHEL82-64_K4.18.0_GCC8.3.1/x86_64-native-linuxapp-gcc/a0a4e391698e4d3493eb55745b7f9ff8/dpdk/mk/rte.subdir.mk:37: test-sad] Error 2
  CC pipeline_hash.o
  CC test_atomic.o
  CC pipeline_lpm.o
--
dpaa_ethdev.c:(.text.unlikely+0x126e): undefined reference to `dpaa_port_vsp_update'
/root/RHEL82-64_K4.18.0_GCC8.3.1/x86_64-native-linuxapp-gcc/a0a4e391698e4d3493eb55745b7f9ff8/dpdk/x86_64-native-linuxapp-gcc/lib/librte_pmd_dpaa.a(dpaa_ethdev.o): In function `rte_dpaa_probe':
dpaa_ethdev.c:(.text.unlikely+0x1959): undefined reference to `dpaa_port_fmc_init'
collect2: error: ld returned 1 exit status
make[5]: *** [/root/RHEL82-64_K4.18.0_GCC8.3.1/x86_64-native-linuxapp-gcc/a0a4e391698e4d3493eb55745b7f9ff8/dpdk/mk/rte.app.mk:456: dpdk-pdump] Error 1
make[4]: *** [/root/RHEL82-64_K4.18.0_GCC8.3.1/x86_64-native-linuxapp-gcc/a0a4e391698e4d3493eb55745b7f9ff8/dpdk/mk/rte.subdir.mk:37: pdump] Error 2
  CC pipeline_acl.o
  CC test_malloc.o
/root/RHEL82-64_K4.18.0_GCC8.3.1/x86_64-native-linuxapp-gcc/a0a4e391698e4d3493eb55745b7f9ff8/dpdk/x86_64-native-linuxapp-gcc/lib/librte_pmd_dpaa.a(dpaa_ethdev.o): In function `dpaa_eth_rx_queue_setup':
dpaa_ethdev.c:(.text.unlikely+0x126e): undefined reference to `dpaa_port_vsp_update'
/root/RHEL82-64_K4.18.0_GCC8.3.1/x86_64-native-linuxapp-gcc/a0a4e391698e4d3493eb55745b7f9ff8/dpdk/x86_64-native-linuxapp-gcc/lib/librte_pmd_dpaa.a(dpaa_ethdev.o): In function `rte_dpaa_probe':
dpaa_ethdev.c:(.text.unlikely+0x1959): undefined reference to `dpaa_port_fmc_init'
collect2: error: ld returned 1 exit status
make[5]: *** [/root/RHEL82-64_K4.18.0_GCC8.3.1/x86_64-native-linuxapp-gcc/a0a4e391698e4d3493eb55745b7f9ff8/dpdk/mk/rte.app.mk:456: testfib] Error 1
make[4]: *** [/root/RHEL82-64_K4.18.0_GCC8.3.1/x86_64-native-linuxapp-gcc/a0a4e391698e4d3493eb55745b7f9ff8/dpdk/mk/rte.subdir.mk:37: test-fib] Error 2
  CC test_cycles.o
  CC test_mcslock.o
  CC test_spinlock.o
--
dpaa_ethdev.c:(.text.unlikely+0x126e): undefined reference to `dpaa_port_vsp_update'
/root/RHEL82-64_K4.18.0_GCC8.3.1/x86_64-native-linuxapp-gcc/a0a4e391698e4d3493eb55745b7f9ff8/dpdk/x86_64-native-linuxapp-gcc/lib/librte_pmd_dpaa.a(dpaa_ethdev.o): In function `rte_dpaa_probe':
dpaa_ethdev.c:(.text.unlikely+0x1959): undefined reference to `dpaa_port_fmc_init'
collect2: error: ld returned 1 exit status
make[5]: *** [/root/RHEL82-64_K4.18.0_GCC8.3.1/x86_64-native-linuxapp-gcc/a0a4e391698e4d3493eb55745b7f9ff8/dpdk/mk/rte.app.mk:456: testpipeline] Error 1
make[4]: *** [/root/RHEL82-64_K4.18.0_GCC8.3.1/x86_64-native-linuxapp-gcc/a0a4e391698e4d3493eb55745b7f9ff8/dpdk/mk/rte.subdir.mk:37: test-pipeline] Error 2
  CC test_ring_mt_peek_stress.o
  CC config.o
  CC iofwd.o
--
dpaa_ethdev.c:(.text.unlikely+0x126e): undefined reference to `dpaa_port_vsp_update'
/root/RHEL82-64_K4.18.0_GCC8.3.1/x86_64-native-linuxapp-gcc/a0a4e391698e4d3493eb55745b7f9ff8/dpdk/x86_64-native-linuxapp-gcc/lib/librte_pmd_dpaa.a(dpaa_ethdev.o): In function `rte_dpaa_probe':
dpaa_ethdev.c:(.text.unlikely+0x1959): undefined reference to `dpaa_port_fmc_init'
collect2: error: ld returned 1 exit status
make[5]: *** [/root/RHEL82-64_K4.18.0_GCC8.3.1/x86_64-native-linuxapp-gcc/a0a4e391698e4d3493eb55745b7f9ff8/dpdk/mk/rte.app.mk:456: dpdk-test-flow-perf] Error 1
make[4]: *** [/root/RHEL82-64_K4.18.0_GCC8.3.1/x86_64-native-linuxapp-gcc/a0a4e391698e4d3493eb55745b7f9ff8/dpdk/mk/rte.subdir.mk:37: test-flow-perf] Error 2
  CC macfwd.o
  CC test_ring_st_peek_stress.o
  CC macswap.o
--
dpaa_ethdev.c:(.text.unlikely+0x126e): undefined reference to `dpaa_port_vsp_update'
/root/RHEL82-64_K4.18.0_GCC8.3.1/x86_64-native-linuxapp-gcc/a0a4e391698e4d3493eb55745b7f9ff8/dpdk/x86_64-native-linuxapp-gcc/lib/librte_pmd_dpaa.a(dpaa_ethdev.o): In function `rte_dpaa_probe':
dpaa_ethdev.c:(.text.unlikely+0x1959): undefined reference to `dpaa_port_fmc_init'
collect2: error: ld returned 1 exit status
make[5]: *** [/root/RHEL82-64_K4.18.0_GCC8.3.1/x86_64-native-linuxapp-gcc/a0a4e391698e4d3493eb55745b7f9ff8/dpdk/mk/rte.app.mk:456: testpmd] Error 1
make[4]: *** [/root/RHEL82-64_K4.18.0_GCC8.3.1/x86_64-native-linuxapp-gcc/a0a4e391698e4d3493eb55745b7f9ff8/dpdk/mk/rte.subdir.mk:37: test-pmd] Error 2
  CC test_thash.o
  CC test_hash_perf.o
  CC test_hash_functions.o
--
dpaa_ethdev.c:(.text.unlikely+0x126e): undefined reference to `dpaa_port_vsp_update'
/root/RHEL82-64_K4.18.0_GCC8.3.1/x86_64-native-linuxapp-gcc/a0a4e391698e4d3493eb55745b7f9ff8/dpdk/x86_64-native-linuxapp-gcc/lib/librte_pmd_dpaa.a(dpaa_ethdev.o): In function `rte_dpaa_probe':
dpaa_ethdev.c:(.text.unlikely+0x1959): undefined reference to `dpaa_port_fmc_init'
collect2: error: ld returned 1 exit status
make[5]: *** [/root/RHEL82-64_K4.18.0_GCC8.3.1/x86_64-native-linuxapp-gcc/a0a4e391698e4d3493eb55745b7f9ff8/dpdk/mk/rte.app.mk:456: test] Error 1
make[4]: *** [/root/RHEL82-64_K4.18.0_GCC8.3.1/x86_64-native-linuxapp-gcc/a0a4e391698e4d3493eb55745b7f9ff8/dpdk/mk/rte.subdir.mk:37: test] Error 2
make[3]: *** [/root/RHEL82-64_K4.18.0_GCC8.3.1/x86_64-native-linuxapp-gcc/a0a4e391698e4d3493eb55745b7f9ff8/dpdk/mk/rte.sdkbuild.mk:53: app] Error 2
make[2]: *** [/root/RHEL82-64_K4.18.0_GCC8.3.1/x86_64-native-linuxapp-gcc/a0a4e391698e4d3493eb55745b7f9ff8/dpdk/mk/rte.sdkroot.mk:115: all] Error 2
make[1]: *** [/root/RHEL82-64_K4.18.0_GCC8.3.1/x86_64-native-linuxapp-gcc/a0a4e391698e4d3493eb55745b7f9ff8/dpdk/mk/rte.sdkinstall.mk:61: pre_install] Error 2
make: *** [/root/RHEL82-64_K4.18.0_GCC8.3.1/x86_64-native-linuxapp-gcc/a0a4e391698e4d3493eb55745b7f9ff8/dpdk/mk/rte.sdkroot.mk:92: install] Error 2


*Makefile Build Failed #10:
OS: SUSE15-64
Target: x86_64-native-linuxapp-clang
/root/SUSE15-64_K4.12.14_Clang5.0.1/x86_64-native-linuxapp-clang/a0a4e391698e4d3493eb55745b7f9ff8/dpdk/drivers/net/dpaa/dpaa_ethdev.c:(.text+0x2428): undefined reference to `dpaa_port_fmc_init'
  CC init.o
  LD testfib
clang-5.0.1: error: linker command failed with exit code 1 (use -v to see invocation)
make[5]: *** [/root/SUSE15-64_K4.12.14_Clang5.0.1/x86_64-native-linuxapp-clang/a0a4e391698e4d3493eb55745b7f9ff8/dpdk/mk/rte.app.mk:456: dpdk-procinfo] Error 1
make[4]: *** [/root/SUSE15-64_K4.12.14_Clang5.0.1/x86_64-native-linuxapp-clang/a0a4e391698e4d3493eb55745b7f9ff8/dpdk/mk/rte.subdir.mk:35: proc-info] Error 2
make[4]: *** Waiting for unfinished jobs....
/root/SUSE15-64_K4.12.14_Clang5.0.1/x86_64-native-linuxapp-clang/a0a4e391698e4d3493eb55745b7f9ff8/dpdk/x86_64-native-linuxapp-clang/lib/librte_pmd_dpaa.a(dpaa_ethdev.o): In function `dpaa_eth_rx_queue_setup':
/root/SUSE15-64_K4.12.14_Clang5.0.1/x86_64-native-linuxapp-clang/a0a4e391698e4d3493eb55745b7f9ff8/dpdk/drivers/net/dpaa/dpaa_ethdev.c:(.text+0x14e0): undefined reference to `dpaa_port_vsp_update'
/root/SUSE15-64_K4.12.14_Clang5.0.1/x86_64-native-linuxapp-clang/a0a4e391698e4d3493eb55745b7f9ff8/dpdk/x86_64-native-linuxapp-clang/lib/librte_pmd_dpaa.a(dpaa_ethdev.o): In function `rte_dpaa_probe':
/root/SUSE15-64_K4.12.14_Clang5.0.1/x86_64-native-linuxapp-clang/a0a4e391698e4d3493eb55745b7f9ff8/dpdk/drivers/net/dpaa/dpaa_ethdev.c:(.text+0x2428): undefined reference to `dpaa_port_fmc_init'
  CC items_gen.o
clang-5.0.1: error: linker command failed with exit code 1 (use -v to see invocation)
make[5]: *** [/root/SUSE15-64_K4.12.14_Clang5.0.1/x86_64-native-linuxapp-clang/a0a4e391698e4d3493eb55745b7f9ff8/dpdk/mk/rte.app.mk:456: cmdline_test] Error 1
make[4]: *** [/root/SUSE15-64_K4.12.14_Clang5.0.1/x86_64-native-linuxapp-clang/a0a4e391698e4d3493eb55745b7f9ff8/dpdk/mk/rte.subdir.mk:35: test-cmdline] Error 2
  CC test_resource.o
  CC main.o
/root/SUSE15-64_K4.12.14_Clang5.0.1/x86_64-native-linuxapp-clang/a0a4e391698e4d3493eb55745b7f9ff8/dpdk/x86_64-native-linuxapp-clang/lib/librte_pmd_dpaa.a(dpaa_ethdev.o): In function `dpaa_eth_rx_queue_setup':
/root/SUSE15-64_K4.12.14_Clang5.0.1/x86_64-native-linuxapp-clang/a0a4e391698e4d3493eb55745b7f9ff8/dpdk/drivers/net/dpaa/dpaa_ethdev.c:(.text+0x14e0): undefined reference to `dpaa_port_vsp_update'
/root/SUSE15-64_K4.12.14_Clang5.0.1/x86_64-native-linuxapp-clang/a0a4e391698e4d3493eb55745b7f9ff8/dpdk/x86_64-native-linuxapp-clang/lib/librte_pmd_dpaa.a(dpaa_ethdev.o): In function `rte_dpaa_probe':
/root/SUSE15-64_K4.12.14_Clang5.0.1/x86_64-native-linuxapp-clang/a0a4e391698e4d3493eb55745b7f9ff8/dpdk/drivers/net/dpaa/dpaa_ethdev.c:(.text+0x2428): undefined reference to `dpaa_port_fmc_init'
clang-5.0.1: error: linker command failed with exit code 1 (use -v to see invocation)
make[5]: *** [/root/SUSE15-64_K4.12.14_Clang5.0.1/x86_64-native-linuxapp-clang/a0a4e391698e4d3493eb55745b7f9ff8/dpdk/mk/rte.app.mk:456: testsad] Error 1
make[4]: *** [/root/SUSE15-64_K4.12.14_Clang5.0.1/x86_64-native-linuxapp-clang/a0a4e391698e4d3493eb55745b7f9ff8/dpdk/mk/rte.subdir.mk:35: test-sad] Error 2
  CC parameters.o
  CC runtime.o
clang-5.0.1: error: linker command failed with exit code 1 (use -v to see invocation)
make[5]: *** [/root/SUSE15-64_K4.12.14_Clang5.0.1/x86_64-native-linuxapp-clang/a0a4e391698e4d3493eb55745b7f9ff8/dpdk/mk/rte.app.mk:456: dpdk-pdump] Error 1
make[4]: *** [/root/SUSE15-64_K4.12.14_Clang5.0.1/x86_64-native-linuxapp-clang/a0a4e391698e4d3493eb55745b7f9ff8/dpdk/mk/rte.subdir.mk:35: pdump] Error 2
  CC pipeline_stub.o
clang-5.0.1: error: linker command failed with exit code 1 (use -v to see invocation)
make[5]: *** [/root/SUSE15-64_K4.12.14_Clang5.0.1/x86_64-native-linuxapp-clang/a0a4e391698e4d3493eb55745b7f9ff8/dpdk/mk/rte.app.mk:456: testacl] Error 1
make[4]: *** [/root/SUSE15-64_K4.12.14_Clang5.0.1/x86_64-native-linuxapp-clang/a0a4e391698e4d3493eb55745b7f9ff8/dpdk/mk/rte.subdir.mk:35: test-acl] Error 2
  CC cmdline.o
  CC test_prefetch.o
/root/SUSE15-64_K4.12.14_Clang5.0.1/x86_64-native-linuxapp-clang/a0a4e391698e4d3493eb55745b7f9ff8/dpdk/x86_64-native-linuxapp-clang/lib/librte_pmd_dpaa.a(dpaa_ethdev.o): In function `dpaa_eth_rx_queue_setup':
--
/root/SUSE15-64_K4.12.14_Clang5.0.1/x86_64-native-linuxapp-clang/a0a4e391698e4d3493eb55745b7f9ff8/dpdk/drivers/net/dpaa/dpaa_ethdev.c:(.text+0x2428): undefined reference to `dpaa_port_fmc_init'
  CC test_byteorder.o
  CC cmdline_flow.o
clang-5.0.1: error: linker command failed with exit code 1 (use -v to see invocation)
make[5]: *** [/root/SUSE15-64_K4.12.14_Clang5.0.1/x86_64-native-linuxapp-clang/a0a4e391698e4d3493eb55745b7f9ff8/dpdk/mk/rte.app.mk:456: testfib] Error 1
make[4]: *** [/root/SUSE15-64_K4.12.14_Clang5.0.1/x86_64-native-linuxapp-clang/a0a4e391698e4d3493eb55745b7f9ff8/dpdk/mk/rte.subdir.mk:35: test-fib] Error 2
  CC test_per_lcore.o
  CC pipeline_hash.o
  CC cmdline_mtr.o
--
  CC flowgen.o
  CC test_ticketlock.o
  CC rxonly.o
clang-5.0.1: error: linker command failed with exit code 1 (use -v to see invocation)
make[5]: *** [/root/SUSE15-64_K4.12.14_Clang5.0.1/x86_64-native-linuxapp-clang/a0a4e391698e4d3493eb55745b7f9ff8/dpdk/mk/rte.app.mk:456: dpdk-test-flow-perf] Error 1
make[4]: *** [/root/SUSE15-64_K4.12.14_Clang5.0.1/x86_64-native-linuxapp-clang/a0a4e391698e4d3493eb55745b7f9ff8/dpdk/mk/rte.subdir.mk:35: test-flow-perf] Error 2
  CC txonly.o
  CC test_memory.o
  CC test_memzone.o
--
/root/SUSE15-64_K4.12.14_Clang5.0.1/x86_64-native-linuxapp-clang/a0a4e391698e4d3493eb55745b7f9ff8/dpdk/drivers/net/dpaa/dpaa_ethdev.c:(.text+0x14e0): undefined reference to `dpaa_port_vsp_update'
/root/SUSE15-64_K4.12.14_Clang5.0.1/x86_64-native-linuxapp-clang/a0a4e391698e4d3493eb55745b7f9ff8/dpdk/x86_64-native-linuxapp-clang/lib/librte_pmd_dpaa.a(dpaa_ethdev.o): In function `rte_dpaa_probe':
/root/SUSE15-64_K4.12.14_Clang5.0.1/x86_64-native-linuxapp-clang/a0a4e391698e4d3493eb55745b7f9ff8/dpdk/drivers/net/dpaa/dpaa_ethdev.c:(.text+0x2428): undefined reference to `dpaa_port_fmc_init'
clang-5.0.1: error: linker command failed with exit code 1 (use -v to see invocation)
make[5]: *** [/root/SUSE15-64_K4.12.14_Clang5.0.1/x86_64-native-linuxapp-clang/a0a4e391698e4d3493eb55745b7f9ff8/dpdk/mk/rte.app.mk:456: testpipeline] Error 1
make[4]: *** [/root/SUSE15-64_K4.12.14_Clang5.0.1/x86_64-native-linuxapp-clang/a0a4e391698e4d3493eb55745b7f9ff8/dpdk/mk/rte.subdir.mk:35: test-pipeline] Error 2
  CC test_bitmap.o
  CC csumonly.o
  CC test_bitops.o
--
  CC test_mempool.o
  CC test_mempool_perf.o
  CC test_mbuf.o
clang-5.0.1: error: linker command failed with exit code 1 (use -v to see invocation)
make[5]: *** [/root/SUSE15-64_K4.12.14_Clang5.0.1/x86_64-native-linuxapp-clang/a0a4e391698e4d3493eb55745b7f9ff8/dpdk/mk/rte.app.mk:456: testpmd] Error 1
make[4]: *** [/root/SUSE15-64_K4.12.14_Clang5.0.1/x86_64-native-linuxapp-clang/a0a4e391698e4d3493eb55745b7f9ff8/dpdk/mk/rte.subdir.mk:35: test-pmd] Error 2
  CC test_logs.o
  CC test_memcpy.o
  CC test_memcpy_perf.o
--
/root/SUSE15-64_K4.12.14_Clang5.0.1/x86_64-native-linuxapp-clang/a0a4e391698e4d3493eb55745b7f9ff8/dpdk/drivers/net/dpaa/dpaa_ethdev.c:(.text+0x14e0): undefined reference to `dpaa_port_vsp_update'
/root/SUSE15-64_K4.12.14_Clang5.0.1/x86_64-native-linuxapp-clang/a0a4e391698e4d3493eb55745b7f9ff8/dpdk/x86_64-native-linuxapp-clang/lib/librte_pmd_dpaa.a(dpaa_ethdev.o): In function `rte_dpaa_probe':
/root/SUSE15-64_K4.12.14_Clang5.0.1/x86_64-native-linuxapp-clang/a0a4e391698e4d3493eb55745b7f9ff8/dpdk/drivers/net/dpaa/dpaa_ethdev.c:(.text+0x2428): undefined reference to `dpaa_port_fmc_init'
clang-5.0.1: error: linker command failed with exit code 1 (use -v to see invocation)
make[5]: *** [/root/SUSE15-64_K4.12.14_Clang5.0.1/x86_64-native-linuxapp-clang/a0a4e391698e4d3493eb55745b7f9ff8/dpdk/mk/rte.app.mk:456: test] Error 1
make[4]: *** [/root/SUSE15-64_K4.12.14_Clang5.0.1/x86_64-native-linuxapp-clang/a0a4e391698e4d3493eb55745b7f9ff8/dpdk/mk/rte.subdir.mk:35: test] Error 2
make[3]: *** [/root/SUSE15-64_K4.12.14_Clang5.0.1/x86_64-native-linuxapp-clang/a0a4e391698e4d3493eb55745b7f9ff8/dpdk/mk/rte.sdkbuild.mk:53: app] Error 2
make[2]: *** [/root/SUSE15-64_K4.12.14_Clang5.0.1/x86_64-native-linuxapp-clang/a0a4e391698e4d3493eb55745b7f9ff8/dpdk/mk/rte.sdkroot.mk:115: all] Error 2
make[1]: *** [/root/SUSE15-64_K4.12.14_Clang5.0.1/x86_64-native-linuxapp-clang/a0a4e391698e4d3493eb55745b7f9ff8/dpdk/mk/rte.sdkinstall.mk:61: pre_install] Error 2
make: *** [/root/SUSE15-64_K4.12.14_Clang5.0.1/x86_64-native-linuxapp-clang/a0a4e391698e4d3493eb55745b7f9ff8/dpdk/mk/rte.sdkroot.mk:92: install] Error 2


*Makefile Build Failed #11:
OS: SUSE15-64
Target: x86_64-native-linuxapp-gcc
dpaa_ethdev.c:(.text+0x14cb): undefined reference to `dpaa_port_vsp_update'
/root/SUSE15-64_K4.12.14_GCC7.3.1/x86_64-native-linuxapp-gcc/a0a4e391698e4d3493eb55745b7f9ff8/dpdk/x86_64-native-linuxapp-gcc/lib/librte_pmd_dpaa.a(dpaa_ethdev.o): In function `rte_dpaa_probe':
dpaa_ethdev.c:(.text+0x27eb): undefined reference to `dpaa_port_fmc_init'
collect2: error: ld returned 1 exit status
make[5]: *** [/root/SUSE15-64_K4.12.14_GCC7.3.1/x86_64-native-linuxapp-gcc/a0a4e391698e4d3493eb55745b7f9ff8/dpdk/mk/rte.app.mk:456: cmdline_test] Error 1
make[4]: *** [/root/SUSE15-64_K4.12.14_GCC7.3.1/x86_64-native-linuxapp-gcc/a0a4e391698e4d3493eb55745b7f9ff8/dpdk/mk/rte.subdir.mk:35: test-cmdline] Error 2
make[4]: *** Waiting for unfinished jobs....
  CC test_prefetch.o
  CC main.o
--
dpaa_ethdev.c:(.text+0x14cb): undefined reference to `dpaa_port_vsp_update'
/root/SUSE15-64_K4.12.14_GCC7.3.1/x86_64-native-linuxapp-gcc/a0a4e391698e4d3493eb55745b7f9ff8/dpdk/x86_64-native-linuxapp-gcc/lib/librte_pmd_dpaa.a(dpaa_ethdev.o): In function `rte_dpaa_probe':
dpaa_ethdev.c:(.text+0x27eb): undefined reference to `dpaa_port_fmc_init'
collect2: error: ld returned 1 exit status
make[5]: *** [/root/SUSE15-64_K4.12.14_GCC7.3.1/x86_64-native-linuxapp-gcc/a0a4e391698e4d3493eb55745b7f9ff8/dpdk/mk/rte.app.mk:456: dpdk-procinfo] Error 1
make[4]: *** [/root/SUSE15-64_K4.12.14_GCC7.3.1/x86_64-native-linuxapp-gcc/a0a4e391698e4d3493eb55745b7f9ff8/dpdk/mk/rte.subdir.mk:35: proc-info] Error 2
  CC test_barrier.o
  CC test_atomic.o
/root/SUSE15-64_K4.12.14_GCC7.3.1/x86_64-native-linuxapp-gcc/a0a4e391698e4d3493eb55745b7f9ff8/dpdk/x86_64-native-linuxapp-gcc/lib/librte_pmd_dpaa.a(dpaa_ethdev.o): In function `dpaa_eth_rx_queue_setup':
dpaa_ethdev.c:(.text+0x14cb): undefined reference to `dpaa_port_vsp_update'
/root/SUSE15-64_K4.12.14_GCC7.3.1/x86_64-native-linuxapp-gcc/a0a4e391698e4d3493eb55745b7f9ff8/dpdk/x86_64-native-linuxapp-gcc/lib/librte_pmd_dpaa.a(dpaa_ethdev.o): In function `rte_dpaa_probe':
dpaa_ethdev.c:(.text+0x27eb): undefined reference to `dpaa_port_fmc_init'
collect2: error: ld returned 1 exit status
make[5]: *** [/root/SUSE15-64_K4.12.14_GCC7.3.1/x86_64-native-linuxapp-gcc/a0a4e391698e4d3493eb55745b7f9ff8/dpdk/mk/rte.app.mk:456: testsad] Error 1
make[4]: *** [/root/SUSE15-64_K4.12.14_GCC7.3.1/x86_64-native-linuxapp-gcc/a0a4e391698e4d3493eb55745b7f9ff8/dpdk/mk/rte.subdir.mk:35: test-sad] Error 2
  CC test_malloc.o
  CC test_cycles.o
  CC runtime.o
--
dpaa_ethdev.c:(.text+0x14cb): undefined reference to `dpaa_port_vsp_update'
/root/SUSE15-64_K4.12.14_GCC7.3.1/x86_64-native-linuxapp-gcc/a0a4e391698e4d3493eb55745b7f9ff8/dpdk/x86_64-native-linuxapp-gcc/lib/librte_pmd_dpaa.a(dpaa_ethdev.o): In function `rte_dpaa_probe':
dpaa_ethdev.c:(.text+0x27eb): undefined reference to `dpaa_port_fmc_init'
collect2: error: ld returned 1 exit status
make[5]: *** [/root/SUSE15-64_K4.12.14_GCC7.3.1/x86_64-native-linuxapp-gcc/a0a4e391698e4d3493eb55745b7f9ff8/dpdk/mk/rte.app.mk:456: dpdk-pdump] Error 1
make[4]: *** [/root/SUSE15-64_K4.12.14_GCC7.3.1/x86_64-native-linuxapp-gcc/a0a4e391698e4d3493eb55745b7f9ff8/dpdk/mk/rte.subdir.mk:35: pdump] Error 2
  CC parameters.o
  CC pipeline_stub.o
  CC test_mcslock.o
--
dpaa_ethdev.c:(.text+0x14cb): undefined reference to `dpaa_port_vsp_update'
/root/SUSE15-64_K4.12.14_GCC7.3.1/x86_64-native-linuxapp-gcc/a0a4e391698e4d3493eb55745b7f9ff8/dpdk/x86_64-native-linuxapp-gcc/lib/librte_pmd_dpaa.a(dpaa_ethdev.o): In function `rte_dpaa_probe':
dpaa_ethdev.c:(.text+0x27eb): undefined reference to `dpaa_port_fmc_init'
collect2: error: ld returned 1 exit status
make[5]: *** [/root/SUSE15-64_K4.12.14_GCC7.3.1/x86_64-native-linuxapp-gcc/a0a4e391698e4d3493eb55745b7f9ff8/dpdk/mk/rte.app.mk:456: testacl] Error 1
  CC test_spinlock.o
make[4]: *** [/root/SUSE15-64_K4.12.14_GCC7.3.1/x86_64-native-linuxapp-gcc/a0a4e391698e4d3493eb55745b7f9ff8/dpdk/mk/rte.subdir.mk:35: test-acl] Error 2
  CC test_ticketlock.o
  CC test_memory.o
  CC test_memzone.o
--
dpaa_ethdev.c:(.text+0x14cb): undefined reference to `dpaa_port_vsp_update'
/root/SUSE15-64_K4.12.14_GCC7.3.1/x86_64-native-linuxapp-gcc/a0a4e391698e4d3493eb55745b7f9ff8/dpdk/x86_64-native-linuxapp-gcc/lib/librte_pmd_dpaa.a(dpaa_ethdev.o): In function `rte_dpaa_probe':
dpaa_ethdev.c:(.text+0x27eb): undefined reference to `dpaa_port_fmc_init'
collect2: error: ld returned 1 exit status
make[5]: *** [/root/SUSE15-64_K4.12.14_GCC7.3.1/x86_64-native-linuxapp-gcc/a0a4e391698e4d3493eb55745b7f9ff8/dpdk/mk/rte.app.mk:456: testfib] Error 1
make[4]: *** [/root/SUSE15-64_K4.12.14_GCC7.3.1/x86_64-native-linuxapp-gcc/a0a4e391698e4d3493eb55745b7f9ff8/dpdk/mk/rte.subdir.mk:35: test-fib] Error 2
  LD dpdk-test-flow-perf
  CC cmdline_flow.o
  CC test_bitops.o
--
dpaa_ethdev.c:(.text+0x14cb): undefined reference to `dpaa_port_vsp_update'
/root/SUSE15-64_K4.12.14_GCC7.3.1/x86_64-native-linuxapp-gcc/a0a4e391698e4d3493eb55745b7f9ff8/dpdk/x86_64-native-linuxapp-gcc/lib/librte_pmd_dpaa.a(dpaa_ethdev.o): In function `rte_dpaa_probe':
dpaa_ethdev.c:(.text+0x27eb): undefined reference to `dpaa_port_fmc_init'
collect2: error: ld returned 1 exit status
make[5]: *** [/root/SUSE15-64_K4.12.14_GCC7.3.1/x86_64-native-linuxapp-gcc/a0a4e391698e4d3493eb55745b7f9ff8/dpdk/mk/rte.app.mk:456: dpdk-test-flow-perf] Error 1
make[4]: *** [/root/SUSE15-64_K4.12.14_GCC7.3.1/x86_64-native-linuxapp-gcc/a0a4e391698e4d3493eb55745b7f9ff8/dpdk/mk/rte.subdir.mk:35: test-flow-perf] Error 2
  CC test_ring_rts_stress.o
  LD testpipeline
  CC test_ring_st_peek_stress.o
--
dpaa_ethdev.c:(.text+0x14cb): undefined reference to `dpaa_port_vsp_update'
/root/SUSE15-64_K4.12.14_GCC7.3.1/x86_64-native-linuxapp-gcc/a0a4e391698e4d3493eb55745b7f9ff8/dpdk/x86_64-native-linuxapp-gcc/lib/librte_pmd_dpaa.a(dpaa_ethdev.o): In function `rte_dpaa_probe':
dpaa_ethdev.c:(.text+0x27eb): undefined reference to `dpaa_port_fmc_init'
collect2: error: ld returned 1 exit status
make[5]: *** [/root/SUSE15-64_K4.12.14_GCC7.3.1/x86_64-native-linuxapp-gcc/a0a4e391698e4d3493eb55745b7f9ff8/dpdk/mk/rte.app.mk:456: testpipeline] Error 1
make[4]: *** [/root/SUSE15-64_K4.12.14_GCC7.3.1/x86_64-native-linuxapp-gcc/a0a4e391698e4d3493eb55745b7f9ff8/dpdk/mk/rte.subdir.mk:35: test-pipeline] Error 2
  CC test_table_ports.o
  CC test_table_combined.o
  CC macfwd.o
--
dpaa_ethdev.c:(.text+0x14cb): undefined reference to `dpaa_port_vsp_update'
/root/SUSE15-64_K4.12.14_GCC7.3.1/x86_64-native-linuxapp-gcc/a0a4e391698e4d3493eb55745b7f9ff8/dpdk/x86_64-native-linuxapp-gcc/lib/librte_pmd_dpaa.a(dpaa_ethdev.o): In function `rte_dpaa_probe':
dpaa_ethdev.c:(.text+0x27eb): undefined reference to `dpaa_port_fmc_init'
collect2: error: ld returned 1 exit status
make[5]: *** [/root/SUSE15-64_K4.12.14_GCC7.3.1/x86_64-native-linuxapp-gcc/a0a4e391698e4d3493eb55745b7f9ff8/dpdk/mk/rte.app.mk:456: testpmd] Error 1
make[4]: *** [/root/SUSE15-64_K4.12.14_GCC7.3.1/x86_64-native-linuxapp-gcc/a0a4e391698e4d3493eb55745b7f9ff8/dpdk/mk/rte.subdir.mk:35: test-pmd] Error 2
  CC test_cmdline.o
  CC test_cmdline_num.o
  CC test_cmdline_etheraddr.o
--
dpaa_ethdev.c:(.text+0x14cb): undefined reference to `dpaa_port_vsp_update'
/root/SUSE15-64_K4.12.14_GCC7.3.1/x86_64-native-linuxapp-gcc/a0a4e391698e4d3493eb55745b7f9ff8/dpdk/x86_64-native-linuxapp-gcc/lib/librte_pmd_dpaa.a(dpaa_ethdev.o): In function `rte_dpaa_probe':
dpaa_ethdev.c:(.text+0x27eb): undefined reference to `dpaa_port_fmc_init'
collect2: error: ld returned 1 exit status
make[5]: *** [/root/SUSE15-64_K4.12.14_GCC7.3.1/x86_64-native-linuxapp-gcc/a0a4e391698e4d3493eb55745b7f9ff8/dpdk/mk/rte.app.mk:456: test] Error 1
make[4]: *** [/root/SUSE15-64_K4.12.14_GCC7.3.1/x86_64-native-linuxapp-gcc/a0a4e391698e4d3493eb55745b7f9ff8/dpdk/mk/rte.subdir.mk:35: test] Error 2
make[3]: *** [/root/SUSE15-64_K4.12.14_GCC7.3.1/x86_64-native-linuxapp-gcc/a0a4e391698e4d3493eb55745b7f9ff8/dpdk/mk/rte.sdkbuild.mk:53: app] Error 2
make[2]: *** [/root/SUSE15-64_K4.12.14_GCC7.3.1/x86_64-native-linuxapp-gcc/a0a4e391698e4d3493eb55745b7f9ff8/dpdk/mk/rte.sdkroot.mk:115: all] Error 2
make[1]: *** [/root/SUSE15-64_K4.12.14_GCC7.3.1/x86_64-native-linuxapp-gcc/a0a4e391698e4d3493eb55745b7f9ff8/dpdk/mk/rte.sdkinstall.mk:61: pre_install] Error 2
make: *** [/root/SUSE15-64_K4.12.14_GCC7.3.1/x86_64-native-linuxapp-gcc/a0a4e391698e4d3493eb55745b7f9ff8/dpdk/mk/rte.sdkroot.mk:92: install] Error 2


*Makefile Build Failed #12:
OS: UB1804-64
Target: x86_64-native-linuxapp-gcc
dpaa_ethdev.c:(.text+0x165f): undefined reference to `dpaa_port_vsp_update'
/root/UB1804-64_K4.15.0_GCC7.3.0/x86_64-native-linuxapp-gcc/a0a4e391698e4d3493eb55745b7f9ff8/dpdk/x86_64-native-linuxapp-gcc/lib/librte_pmd_dpaa.a(dpaa_ethdev.o): In function `rte_dpaa_probe':
dpaa_ethdev.c:(.text+0x2ba6): undefined reference to `dpaa_port_fmc_init'
collect2: error: ld returned 1 exit status
/root/UB1804-64_K4.15.0_GCC7.3.0/x86_64-native-linuxapp-gcc/a0a4e391698e4d3493eb55745b7f9ff8/dpdk/mk/rte.app.mk:454: recipe for target 'cmdline_test' failed
make[5]: *** [cmdline_test] Error 1
/root/UB1804-64_K4.15.0_GCC7.3.0/x86_64-native-linuxapp-gcc/a0a4e391698e4d3493eb55745b7f9ff8/dpdk/mk/rte.subdir.mk:35: recipe for target 'test-cmdline' failed
make[4]: *** [test-cmdline] Error 2
make[4]: *** Waiting for unfinished jobs....
  CC test_byteorder.o
/root/UB1804-64_K4.15.0_GCC7.3.0/x86_64-native-linuxapp-gcc/a0a4e391698e4d3493eb55745b7f9ff8/dpdk/x86_64-native-linuxapp-gcc/lib/librte_pmd_dpaa.a(dpaa_ethdev.o): In function `dpaa_eth_rx_queue_setup':
dpaa_ethdev.c:(.text+0x165f): undefined reference to `dpaa_port_vsp_update'
/root/UB1804-64_K4.15.0_GCC7.3.0/x86_64-native-linuxapp-gcc/a0a4e391698e4d3493eb55745b7f9ff8/dpdk/x86_64-native-linuxapp-gcc/lib/librte_pmd_dpaa.a(dpaa_ethdev.o): In function `rte_dpaa_probe':
dpaa_ethdev.c:(.text+0x2ba6): undefined reference to `dpaa_port_fmc_init'
collect2: error: ld returned 1 exit status
/root/UB1804-64_K4.15.0_GCC7.3.0/x86_64-native-linuxapp-gcc/a0a4e391698e4d3493eb55745b7f9ff8/dpdk/mk/rte.app.mk:454: recipe for target 'testacl' failed
make[5]: *** [testacl] Error 1
/root/UB1804-64_K4.15.0_GCC7.3.0/x86_64-native-linuxapp-gcc/a0a4e391698e4d3493eb55745b7f9ff8/dpdk/mk/rte.subdir.mk:35: recipe for target 'test-acl' failed
make[4]: *** [test-acl] Error 2
  CC test_per_lcore.o
  CC parameters.o
/root/UB1804-64_K4.15.0_GCC7.3.0/x86_64-native-linuxapp-gcc/a0a4e391698e4d3493eb55745b7f9ff8/dpdk/x86_64-native-linuxapp-gcc/lib/librte_pmd_dpaa.a(dpaa_ethdev.o): In function `dpaa_eth_rx_queue_setup':
dpaa_ethdev.c:(.text+0x165f): undefined reference to `dpaa_port_vsp_update'
/root/UB1804-64_K4.15.0_GCC7.3.0/x86_64-native-linuxapp-gcc/a0a4e391698e4d3493eb55745b7f9ff8/dpdk/x86_64-native-linuxapp-gcc/lib/librte_pmd_dpaa.a(dpaa_ethdev.o): In function `rte_dpaa_probe':
dpaa_ethdev.c:(.text+0x2ba6): undefined reference to `dpaa_port_fmc_init'
collect2: error: ld returned 1 exit status
/root/UB1804-64_K4.15.0_GCC7.3.0/x86_64-native-linuxapp-gcc/a0a4e391698e4d3493eb55745b7f9ff8/dpdk/mk/rte.app.mk:454: recipe for target 'dpdk-procinfo' failed
make[5]: *** [dpdk-procinfo] Error 1
/root/UB1804-64_K4.15.0_GCC7.3.0/x86_64-native-linuxapp-gcc/a0a4e391698e4d3493eb55745b7f9ff8/dpdk/mk/rte.subdir.mk:35: recipe for target 'proc-info' failed
make[4]: *** [proc-info] Error 2
/root/UB1804-64_K4.15.0_GCC7.3.0/x86_64-native-linuxapp-gcc/a0a4e391698e4d3493eb55745b7f9ff8/dpdk/x86_64-native-linuxapp-gcc/lib/librte_pmd_dpaa.a(dpaa_ethdev.o): In function `dpaa_eth_rx_queue_setup':
dpaa_ethdev.c:(.text+0x165f): undefined reference to `dpaa_port_vsp_update'
/root/UB1804-64_K4.15.0_GCC7.3.0/x86_64-native-linuxapp-gcc/a0a4e391698e4d3493eb55745b7f9ff8/dpdk/x86_64-native-linuxapp-gcc/lib/librte_pmd_dpaa.a(dpaa_ethdev.o): In function `rte_dpaa_probe':
dpaa_ethdev.c:(.text+0x2ba6): undefined reference to `dpaa_port_fmc_init'
collect2: error: ld returned 1 exit status
  CC cmdline.o
/root/UB1804-64_K4.15.0_GCC7.3.0/x86_64-native-linuxapp-gcc/a0a4e391698e4d3493eb55745b7f9ff8/dpdk/mk/rte.app.mk:454: recipe for target 'testsad' failed
make[5]: *** [testsad] Error 1
/root/UB1804-64_K4.15.0_GCC7.3.0/x86_64-native-linuxapp-gcc/a0a4e391698e4d3493eb55745b7f9ff8/dpdk/mk/rte.subdir.mk:35: recipe for target 'test-sad' failed
make[4]: *** [test-sad] Error 2
  CC cmdline_flow.o
  CC test_atomic.o
  CC test_barrier.o
--
/root/UB1804-64_K4.15.0_GCC7.3.0/x86_64-native-linuxapp-gcc/a0a4e391698e4d3493eb55745b7f9ff8/dpdk/x86_64-native-linuxapp-gcc/lib/librte_pmd_dpaa.a(dpaa_ethdev.o): In function `rte_dpaa_probe':
dpaa_ethdev.c:(.text+0x2ba6): undefined reference to `dpaa_port_fmc_init'
  CC test_malloc.o
collect2: error: ld returned 1 exit status
/root/UB1804-64_K4.15.0_GCC7.3.0/x86_64-native-linuxapp-gcc/a0a4e391698e4d3493eb55745b7f9ff8/dpdk/mk/rte.app.mk:454: recipe for target 'dpdk-pdump' failed
make[5]: *** [dpdk-pdump] Error 1
/root/UB1804-64_K4.15.0_GCC7.3.0/x86_64-native-linuxapp-gcc/a0a4e391698e4d3493eb55745b7f9ff8/dpdk/mk/rte.subdir.mk:35: recipe for target 'pdump' failed
make[4]: *** [pdump] Error 2
  CC cmdline_mtr.o
  CC cmdline_tm.o
  CC pipeline_stub.o
--
dpaa_ethdev.c:(.text+0x165f): undefined reference to `dpaa_port_vsp_update'
/root/UB1804-64_K4.15.0_GCC7.3.0/x86_64-native-linuxapp-gcc/a0a4e391698e4d3493eb55745b7f9ff8/dpdk/x86_64-native-linuxapp-gcc/lib/librte_pmd_dpaa.a(dpaa_ethdev.o): In function `rte_dpaa_probe':
dpaa_ethdev.c:(.text+0x2ba6): undefined reference to `dpaa_port_fmc_init'
collect2: error: ld returned 1 exit status
/root/UB1804-64_K4.15.0_GCC7.3.0/x86_64-native-linuxapp-gcc/a0a4e391698e4d3493eb55745b7f9ff8/dpdk/mk/rte.app.mk:454: recipe for target 'testfib' failed
make[5]: *** [testfib] Error 1
/root/UB1804-64_K4.15.0_GCC7.3.0/x86_64-native-linuxapp-gcc/a0a4e391698e4d3493eb55745b7f9ff8/dpdk/mk/rte.subdir.mk:35: recipe for target 'test-fib' failed
make[4]: *** [test-fib] Error 2
  CC test_memory.o
  CC iofwd.o
  CC test_memzone.o
--
/root/UB1804-64_K4.15.0_GCC7.3.0/x86_64-native-linuxapp-gcc/a0a4e391698e4d3493eb55745b7f9ff8/dpdk/x86_64-native-linuxapp-gcc/lib/librte_pmd_dpaa.a(dpaa_ethdev.o): In function `rte_dpaa_probe':
dpaa_ethdev.c:(.text+0x2ba6): undefined reference to `dpaa_port_fmc_init'
  CC pipeline_lpm_ipv6.o
collect2: error: ld returned 1 exit status
/root/UB1804-64_K4.15.0_GCC7.3.0/x86_64-native-linuxapp-gcc/a0a4e391698e4d3493eb55745b7f9ff8/dpdk/mk/rte.app.mk:454: recipe for target 'dpdk-test-flow-perf' failed
make[5]: *** [dpdk-test-flow-perf] Error 1
/root/UB1804-64_K4.15.0_GCC7.3.0/x86_64-native-linuxapp-gcc/a0a4e391698e4d3493eb55745b7f9ff8/dpdk/mk/rte.subdir.mk:35: recipe for target 'test-flow-perf' failed
make[4]: *** [test-flow-perf] Error 2
  CC rxonly.o
  CC test_ring_hts_stress.o
  CC test_ring_perf.o
--
dpaa_ethdev.c:(.text+0x165f): undefined reference to `dpaa_port_vsp_update'
/root/UB1804-64_K4.15.0_GCC7.3.0/x86_64-native-linuxapp-gcc/a0a4e391698e4d3493eb55745b7f9ff8/dpdk/x86_64-native-linuxapp-gcc/lib/librte_pmd_dpaa.a(dpaa_ethdev.o): In function `rte_dpaa_probe':
dpaa_ethdev.c:(.text+0x2ba6): undefined reference to `dpaa_port_fmc_init'
collect2: error: ld returned 1 exit status
/root/UB1804-64_K4.15.0_GCC7.3.0/x86_64-native-linuxapp-gcc/a0a4e391698e4d3493eb55745b7f9ff8/dpdk/mk/rte.app.mk:454: recipe for target 'testpipeline' failed
make[5]: *** [testpipeline] Error 1
/root/UB1804-64_K4.15.0_GCC7.3.0/x86_64-native-linuxapp-gcc/a0a4e391698e4d3493eb55745b7f9ff8/dpdk/mk/rte.subdir.mk:35: recipe for target 'test-pipeline' failed
make[4]: *** [test-pipeline] Error 2
  CC test_table_ports.o
  CC test_table_combined.o
  CC test_flow_classify.o
--
dpaa_ethdev.c:(.text+0x165f): undefined reference to `dpaa_port_vsp_update'
/root/UB1804-64_K4.15.0_GCC7.3.0/x86_64-native-linuxapp-gcc/a0a4e391698e4d3493eb55745b7f9ff8/dpdk/x86_64-native-linuxapp-gcc/lib/librte_pmd_dpaa.a(dpaa_ethdev.o): In function `rte_dpaa_probe':
dpaa_ethdev.c:(.text+0x2ba6): undefined reference to `dpaa_port_fmc_init'
collect2: error: ld returned 1 exit status
/root/UB1804-64_K4.15.0_GCC7.3.0/x86_64-native-linuxapp-gcc/a0a4e391698e4d3493eb55745b7f9ff8/dpdk/mk/rte.app.mk:454: recipe for target 'testpmd' failed
make[5]: *** [testpmd] Error 1
/root/UB1804-64_K4.15.0_GCC7.3.0/x86_64-native-linuxapp-gcc/a0a4e391698e4d3493eb55745b7f9ff8/dpdk/mk/rte.subdir.mk:35: recipe for target 'test-pmd' failed
make[4]: *** [test-pmd] Error 2
  CC test_hash_readwrite.o
  CC test_hash_readwrite_lf_perf.o
  CC test_rib.o
--
dpaa_ethdev.c:(.text+0x165f): undefined reference to `dpaa_port_vsp_update'
/root/UB1804-64_K4.15.0_GCC7.3.0/x86_64-native-linuxapp-gcc/a0a4e391698e4d3493eb55745b7f9ff8/dpdk/x86_64-native-linuxapp-gcc/lib/librte_pmd_dpaa.a(dpaa_ethdev.o): In function `rte_dpaa_probe':
dpaa_ethdev.c:(.text+0x2ba6): undefined reference to `dpaa_port_fmc_init'
collect2: error: ld returned 1 exit status
/root/UB1804-64_K4.15.0_GCC7.3.0/x86_64-native-linuxapp-gcc/a0a4e391698e4d3493eb55745b7f9ff8/dpdk/mk/rte.app.mk:454: recipe for target 'test' failed
make[5]: *** [test] Error 1
/root/UB1804-64_K4.15.0_GCC7.3.0/x86_64-native-linuxapp-gcc/a0a4e391698e4d3493eb55745b7f9ff8/dpdk/mk/rte.subdir.mk:35: recipe for target 'test' failed
make[4]: *** [test] Error 2
/root/UB1804-64_K4.15.0_GCC7.3.0/x86_64-native-linuxapp-gcc/a0a4e391698e4d3493eb55745b7f9ff8/dpdk/mk/rte.sdkbuild.mk:51: recipe for target 'app' failed
make[3]: *** [app] Error 2
/root/UB1804-64_K4.15.0_GCC7.3.0/x86_64-native-linuxapp-gcc/a0a4e391698e4d3493eb55745b7f9ff8/dpdk/mk/rte.sdkroot.mk:113: recipe for target 'all' failed
make[2]: *** [all] Error 2
/root/UB1804-64_K4.15.0_GCC7.3.0/x86_64-native-linuxapp-gcc/a0a4e391698e4d3493eb55745b7f9ff8/dpdk/mk/rte.sdkinstall.mk:60: recipe for target 'pre_install' failed
make[1]: *** [pre_install] Error 2
/root/UB1804-64_K4.15.0_GCC7.3.0/x86_64-native-linuxapp-gcc/a0a4e391698e4d3493eb55745b7f9ff8/dpdk/mk/rte.sdkroot.mk:92: recipe for target 'install' failed
make: *** [install] Error 2


*Makefile Build Failed #13:
OS: UB2004-32
Target: i686-native-linuxapp-gcc
dpaa_ethdev.c:(.text.unlikely+0x1625): undefined reference to `dpaa_port_vsp_update'
/usr/bin/ld: /root/UB2004-32_K4.15.0_GCC9.3.0/i686-native-linuxapp-gcc/a0a4e391698e4d3493eb55745b7f9ff8/dpdk/i686-native-linuxapp-gcc/lib/librte_pmd_dpaa.a(dpaa_ethdev.o): in function `rte_dpaa_probe':
dpaa_ethdev.c:(.text.unlikely+0x1e16): undefined reference to `dpaa_port_fmc_init'
collect2: error: ld returned 1 exit status
make[5]: *** [/root/UB2004-32_K4.15.0_GCC9.3.0/i686-native-linuxapp-gcc/a0a4e391698e4d3493eb55745b7f9ff8/dpdk/mk/rte.app.mk:456: dpdk-procinfo] Error 1
make[4]: *** [/root/UB2004-32_K4.15.0_GCC9.3.0/i686-native-linuxapp-gcc/a0a4e391698e4d3493eb55745b7f9ff8/dpdk/mk/rte.subdir.mk:37: proc-info] Error 2
make[4]: *** Waiting for unfinished jobs....
  CC main.o
  CC test_atomic.o
--
dpaa_ethdev.c:(.text.unlikely+0x1625): undefined reference to `dpaa_port_vsp_update'
/usr/bin/ld: /root/UB2004-32_K4.15.0_GCC9.3.0/i686-native-linuxapp-gcc/a0a4e391698e4d3493eb55745b7f9ff8/dpdk/i686-native-linuxapp-gcc/lib/librte_pmd_dpaa.a(dpaa_ethdev.o): in function `rte_dpaa_probe':
dpaa_ethdev.c:(.text.unlikely+0x1e16): undefined reference to `dpaa_port_fmc_init'
collect2: error: ld returned 1 exit status
  CC test_barrier.o
make[5]: *** [/root/UB2004-32_K4.15.0_GCC9.3.0/i686-native-linuxapp-gcc/a0a4e391698e4d3493eb55745b7f9ff8/dpdk/mk/rte.app.mk:456: cmdline_test] Error 1
make[4]: *** [/root/UB2004-32_K4.15.0_GCC9.3.0/i686-native-linuxapp-gcc/a0a4e391698e4d3493eb55745b7f9ff8/dpdk/mk/rte.subdir.mk:37: test-cmdline] Error 2
  CC test_malloc.o
/usr/bin/ld: /root/UB2004-32_K4.15.0_GCC9.3.0/i686-native-linuxapp-gcc/a0a4e391698e4d3493eb55745b7f9ff8/dpdk/i686-native-linuxapp-gcc/lib/librte_pmd_dpaa.a(dpaa_ethdev.o): in function `dpaa_eth_rx_queue_setup':
dpaa_ethdev.c:(.text.unlikely+0x1625): undefined reference to `dpaa_port_vsp_update'
/usr/bin/ld: /root/UB2004-32_K4.15.0_GCC9.3.0/i686-native-linuxapp-gcc/a0a4e391698e4d3493eb55745b7f9ff8/dpdk/i686-native-linuxapp-gcc/lib/librte_pmd_dpaa.a(dpaa_ethdev.o): in function `rte_dpaa_probe':
dpaa_ethdev.c:(.text.unlikely+0x1e16): undefined reference to `dpaa_port_fmc_init'
collect2: error: ld returned 1 exit status
make[5]: *** [/root/UB2004-32_K4.15.0_GCC9.3.0/i686-native-linuxapp-gcc/a0a4e391698e4d3493eb55745b7f9ff8/dpdk/mk/rte.app.mk:456: testacl] Error 1
make[4]: *** [/root/UB2004-32_K4.15.0_GCC9.3.0/i686-native-linuxapp-gcc/a0a4e391698e4d3493eb55745b7f9ff8/dpdk/mk/rte.subdir.mk:37: test-acl] Error 2
  CC test_cycles.o
  CC test_mcslock.o
/usr/bin/ld: /root/UB2004-32_K4.15.0_GCC9.3.0/i686-native-linuxapp-gcc/a0a4e391698e4d3493eb55745b7f9ff8/dpdk/i686-native-linuxapp-gcc/lib/librte_pmd_dpaa.a(dpaa_ethdev.o): in function `dpaa_eth_rx_queue_setup':
dpaa_ethdev.c:(.text.unlikely+0x1625): undefined reference to `dpaa_port_vsp_update'
/usr/bin/ld: /root/UB2004-32_K4.15.0_GCC9.3.0/i686-native-linuxapp-gcc/a0a4e391698e4d3493eb55745b7f9ff8/dpdk/i686-native-linuxapp-gcc/lib/librte_pmd_dpaa.a(dpaa_ethdev.o): in function `rte_dpaa_probe':
dpaa_ethdev.c:(.text.unlikely+0x1e16): undefined reference to `dpaa_port_fmc_init'
collect2: error: ld returned 1 exit status
make[5]: *** [/root/UB2004-32_K4.15.0_GCC9.3.0/i686-native-linuxapp-gcc/a0a4e391698e4d3493eb55745b7f9ff8/dpdk/mk/rte.app.mk:456: testsad] Error 1
make[4]: *** [/root/UB2004-32_K4.15.0_GCC9.3.0/i686-native-linuxapp-gcc/a0a4e391698e4d3493eb55745b7f9ff8/dpdk/mk/rte.subdir.mk:37: test-sad] Error 2
  CC runtime.o
  CC test_spinlock.o
  CC test_ticketlock.o
--
dpaa_ethdev.c:(.text.unlikely+0x1625): undefined reference to `dpaa_port_vsp_update'
/usr/bin/ld: /root/UB2004-32_K4.15.0_GCC9.3.0/i686-native-linuxapp-gcc/a0a4e391698e4d3493eb55745b7f9ff8/dpdk/i686-native-linuxapp-gcc/lib/librte_pmd_dpaa.a(dpaa_ethdev.o): in function `rte_dpaa_probe':
dpaa_ethdev.c:(.text.unlikely+0x1e16): undefined reference to `dpaa_port_fmc_init'
collect2: error: ld returned 1 exit status
make[5]: *** [/root/UB2004-32_K4.15.0_GCC9.3.0/i686-native-linuxapp-gcc/a0a4e391698e4d3493eb55745b7f9ff8/dpdk/mk/rte.app.mk:456: dpdk-pdump] Error 1
make[4]: *** [/root/UB2004-32_K4.15.0_GCC9.3.0/i686-native-linuxapp-gcc/a0a4e391698e4d3493eb55745b7f9ff8/dpdk/mk/rte.subdir.mk:37: pdump] Error 2
  CC parameters.o
  CC pipeline_hash.o
  CC test_memory.o
--
dpaa_ethdev.c:(.text.unlikely+0x1625): undefined reference to `dpaa_port_vsp_update'
/usr/bin/ld: /root/UB2004-32_K4.15.0_GCC9.3.0/i686-native-linuxapp-gcc/a0a4e391698e4d3493eb55745b7f9ff8/dpdk/i686-native-linuxapp-gcc/lib/librte_pmd_dpaa.a(dpaa_ethdev.o): in function `rte_dpaa_probe':
dpaa_ethdev.c:(.text.unlikely+0x1e16): undefined reference to `dpaa_port_fmc_init'
collect2: error: ld returned 1 exit status
make[5]: *** [/root/UB2004-32_K4.15.0_GCC9.3.0/i686-native-linuxapp-gcc/a0a4e391698e4d3493eb55745b7f9ff8/dpdk/mk/rte.app.mk:456: testfib] Error 1
make[4]: *** [/root/UB2004-32_K4.15.0_GCC9.3.0/i686-native-linuxapp-gcc/a0a4e391698e4d3493eb55745b7f9ff8/dpdk/mk/rte.subdir.mk:37: test-fib] Error 2
  CC cmdline_flow.o
  CC cmdline_mtr.o
  CC test_rand_perf.o
--
dpaa_ethdev.c:(.text.unlikely+0x1625): undefined reference to `dpaa_port_vsp_update'
/usr/bin/ld: /root/UB2004-32_K4.15.0_GCC9.3.0/i686-native-linuxapp-gcc/a0a4e391698e4d3493eb55745b7f9ff8/dpdk/i686-native-linuxapp-gcc/lib/librte_pmd_dpaa.a(dpaa_ethdev.o): in function `rte_dpaa_probe':
dpaa_ethdev.c:(.text.unlikely+0x1e16): undefined reference to `dpaa_port_fmc_init'
collect2: error: ld returned 1 exit status
make[5]: *** [/root/UB2004-32_K4.15.0_GCC9.3.0/i686-native-linuxapp-gcc/a0a4e391698e4d3493eb55745b7f9ff8/dpdk/mk/rte.app.mk:456: dpdk-test-flow-perf] Error 1
make[4]: *** [/root/UB2004-32_K4.15.0_GCC9.3.0/i686-native-linuxapp-gcc/a0a4e391698e4d3493eb55745b7f9ff8/dpdk/mk/rte.subdir.mk:37: test-flow-perf] Error 2
  CC test_ring_mpmc_stress.o
  CC cmdline_tm.o
  CC test_ring_hts_stress.o
--
dpaa_ethdev.c:(.text.unlikely+0x1625): undefined reference to `dpaa_port_vsp_update'
/usr/bin/ld: /root/UB2004-32_K4.15.0_GCC9.3.0/i686-native-linuxapp-gcc/a0a4e391698e4d3493eb55745b7f9ff8/dpdk/i686-native-linuxapp-gcc/lib/librte_pmd_dpaa.a(dpaa_ethdev.o): in function `rte_dpaa_probe':
dpaa_ethdev.c:(.text.unlikely+0x1e16): undefined reference to `dpaa_port_fmc_init'
collect2: error: ld returned 1 exit status
make[5]: *** [/root/UB2004-32_K4.15.0_GCC9.3.0/i686-native-linuxapp-gcc/a0a4e391698e4d3493eb55745b7f9ff8/dpdk/mk/rte.app.mk:456: testpipeline] Error 1
make[4]: *** [/root/UB2004-32_K4.15.0_GCC9.3.0/i686-native-linuxapp-gcc/a0a4e391698e4d3493eb55745b7f9ff8/dpdk/mk/rte.subdir.mk:37: test-pipeline] Error 2
  CC rxonly.o
  CC txonly.o
  CC csumonly.o
--
dpaa_ethdev.c:(.text.unlikely+0x1625): undefined reference to `dpaa_port_vsp_update'
/usr/bin/ld: /root/UB2004-32_K4.15.0_GCC9.3.0/i686-native-linuxapp-gcc/a0a4e391698e4d3493eb55745b7f9ff8/dpdk/i686-native-linuxapp-gcc/lib/librte_pmd_dpaa.a(dpaa_ethdev.o): in function `rte_dpaa_probe':
dpaa_ethdev.c:(.text.unlikely+0x1e16): undefined reference to `dpaa_port_fmc_init'
collect2: error: ld returned 1 exit status
make[5]: *** [/root/UB2004-32_K4.15.0_GCC9.3.0/i686-native-linuxapp-gcc/a0a4e391698e4d3493eb55745b7f9ff8/dpdk/mk/rte.app.mk:456: testpmd] Error 1
make[4]: *** [/root/UB2004-32_K4.15.0_GCC9.3.0/i686-native-linuxapp-gcc/a0a4e391698e4d3493eb55745b7f9ff8/dpdk/mk/rte.subdir.mk:37: test-pmd] Error 2
  CC test_hash_readwrite_lf_perf.o
  CC test_rib.o
  CC test_rib6.o
--
dpaa_ethdev.c:(.text.unlikely+0x1625): undefined reference to `dpaa_port_vsp_update'
/usr/bin/ld: /root/UB2004-32_K4.15.0_GCC9.3.0/i686-native-linuxapp-gcc/a0a4e391698e4d3493eb55745b7f9ff8/dpdk/i686-native-linuxapp-gcc/lib/librte_pmd_dpaa.a(dpaa_ethdev.o): in function `rte_dpaa_probe':
dpaa_ethdev.c:(.text.unlikely+0x1e16): undefined reference to `dpaa_port_fmc_init'
collect2: error: ld returned 1 exit status
make[5]: *** [/root/UB2004-32_K4.15.0_GCC9.3.0/i686-native-linuxapp-gcc/a0a4e391698e4d3493eb55745b7f9ff8/dpdk/mk/rte.app.mk:456: test] Error 1
make[4]: *** [/root/UB2004-32_K4.15.0_GCC9.3.0/i686-native-linuxapp-gcc/a0a4e391698e4d3493eb55745b7f9ff8/dpdk/mk/rte.subdir.mk:37: test] Error 2
make[3]: *** [/root/UB2004-32_K4.15.0_GCC9.3.0/i686-native-linuxapp-gcc/a0a4e391698e4d3493eb55745b7f9ff8/dpdk/mk/rte.sdkbuild.mk:53: app] Error 2
make[2]: *** [/root/UB2004-32_K4.15.0_GCC9.3.0/i686-native-linuxapp-gcc/a0a4e391698e4d3493eb55745b7f9ff8/dpdk/mk/rte.sdkroot.mk:115: all] Error 2
make[1]: *** [/root/UB2004-32_K4.15.0_GCC9.3.0/i686-native-linuxapp-gcc/a0a4e391698e4d3493eb55745b7f9ff8/dpdk/mk/rte.sdkinstall.mk:61: pre_install] Error 2
make: *** [/root/UB2004-32_K4.15.0_GCC9.3.0/i686-native-linuxapp-gcc/a0a4e391698e4d3493eb55745b7f9ff8/dpdk/mk/rte.sdkroot.mk:92: install] Error 2


*Makefile Build Failed #14:
OS: UB2004-64
Target: x86_64-native-linuxapp-clang
dpaa_ethdev.c:(.text+0x1535): undefined reference to `dpaa_port_vsp_update'
/usr/bin/ld: /root/UB2004-64_K5.4.0_Clang10.0.0/x86_64-native-linuxapp-clang/a0a4e391698e4d3493eb55745b7f9ff8/dpdk/x86_64-native-linuxapp-clang/lib/librte_pmd_dpaa.a(dpaa_ethdev.o): in function `rte_dpaa_probe':
dpaa_ethdev.c:(.text+0x2469): undefined reference to `dpaa_port_fmc_init'
clang: error: linker command failed with exit code 1 (use -v to see invocation)
make[5]: *** [/root/UB2004-64_K5.4.0_Clang10.0.0/x86_64-native-linuxapp-clang/a0a4e391698e4d3493eb55745b7f9ff8/dpdk/mk/rte.app.mk:456: cmdline_test] Error 1
make[4]: *** [/root/UB2004-64_K5.4.0_Clang10.0.0/x86_64-native-linuxapp-clang/a0a4e391698e4d3493eb55745b7f9ff8/dpdk/mk/rte.subdir.mk:37: test-cmdline] Error 2
make[4]: *** Waiting for unfinished jobs....
  CC runtime.o
  CC test_per_lcore.o
  CC main.o
clang: error: linker command failed with exit code 1 (use -v to see invocation)
make[5]: *** [/root/UB2004-64_K5.4.0_Clang10.0.0/x86_64-native-linuxapp-clang/a0a4e391698e4d3493eb55745b7f9ff8/dpdk/mk/rte.app.mk:456: dpdk-pdump] Error 1
make[4]: *** [/root/UB2004-64_K5.4.0_Clang10.0.0/x86_64-native-linuxapp-clang/a0a4e391698e4d3493eb55745b7f9ff8/dpdk/mk/rte.subdir.mk:37: pdump] Error 2
  CC test_atomic.o
clang: error: linker command failed with exit code 1 (use -v to see invocation)
make[5]: *** [/root/UB2004-64_K5.4.0_Clang10.0.0/x86_64-native-linuxapp-clang/a0a4e391698e4d3493eb55745b7f9ff8/dpdk/mk/rte.app.mk:456: testsad] Error 1
make[4]: *** [/root/UB2004-64_K5.4.0_Clang10.0.0/x86_64-native-linuxapp-clang/a0a4e391698e4d3493eb55745b7f9ff8/dpdk/mk/rte.subdir.mk:37: test-sad] Error 2
  CC test_barrier.o
clang: error: linker command failed with exit code 1 (use -v to see invocation)
make[5]: *** [/root/UB2004-64_K5.4.0_Clang10.0.0/x86_64-native-linuxapp-clang/a0a4e391698e4d3493eb55745b7f9ff8/dpdk/mk/rte.app.mk:456: dpdk-procinfo] Error 1
make[4]: *** [/root/UB2004-64_K5.4.0_Clang10.0.0/x86_64-native-linuxapp-clang/a0a4e391698e4d3493eb55745b7f9ff8/dpdk/mk/rte.subdir.mk:37: proc-info] Error 2
  CC test_malloc.o
clang: error: linker command failed with exit code 1 (use -v to see invocation)
make[5]: *** [/root/UB2004-64_K5.4.0_Clang10.0.0/x86_64-native-linuxapp-clang/a0a4e391698e4d3493eb55745b7f9ff8/dpdk/mk/rte.app.mk:456: testacl] Error 1
make[4]: *** [/root/UB2004-64_K5.4.0_Clang10.0.0/x86_64-native-linuxapp-clang/a0a4e391698e4d3493eb55745b7f9ff8/dpdk/mk/rte.subdir.mk:37: test-acl] Error 2
  CC test_cycles.o
  CC test_mcslock.o
  CC parameters.o
--
  CC test_bitops.o
  CC test_reciprocal_division.o
  CC pipeline_hash.o
clang: error: linker command failed with exit code 1 (use -v to see invocation)
make[5]: *** [/root/UB2004-64_K5.4.0_Clang10.0.0/x86_64-native-linuxapp-clang/a0a4e391698e4d3493eb55745b7f9ff8/dpdk/mk/rte.app.mk:456: testfib] Error 1
make[4]: *** [/root/UB2004-64_K5.4.0_Clang10.0.0/x86_64-native-linuxapp-clang/a0a4e391698e4d3493eb55745b7f9ff8/dpdk/mk/rte.subdir.mk:37: test-fib] Error 2
  CC pipeline_lpm.o
  CC pipeline_lpm_ipv6.o
  CC test_reciprocal_division_perf.o
--
  CC test_pmd_perf.o
  CC test_table.o
  CC test_table_pipeline.o
clang: error: linker command failed with exit code 1 (use -v to see invocation)
make[5]: *** [/root/UB2004-64_K5.4.0_Clang10.0.0/x86_64-native-linuxapp-clang/a0a4e391698e4d3493eb55745b7f9ff8/dpdk/mk/rte.app.mk:456: dpdk-test-flow-perf] Error 1
make[4]: *** [/root/UB2004-64_K5.4.0_Clang10.0.0/x86_64-native-linuxapp-clang/a0a4e391698e4d3493eb55745b7f9ff8/dpdk/mk/rte.subdir.mk:37: test-flow-perf] Error 2
  CC cmdline_mtr.o
  CC test_table_tables.o
/usr/bin/ld: /root/UB2004-64_K5.4.0_Clang10.0.0/x86_64-native-linuxapp-clang/a0a4e391698e4d3493eb55745b7f9ff8/dpdk/x86_64-native-linuxapp-clang/lib/librte_pmd_dpaa.a(dpaa_ethdev.o): in function `dpaa_eth_rx_queue_setup':
--
dpaa_ethdev.c:(.text+0x2469): undefined reference to `dpaa_port_fmc_init'
  CC test_table_ports.o
  CC cmdline_tm.o
clang: error: linker command failed with exit code 1 (use -v to see invocation)
make[5]: *** [/root/UB2004-64_K5.4.0_Clang10.0.0/x86_64-native-linuxapp-clang/a0a4e391698e4d3493eb55745b7f9ff8/dpdk/mk/rte.app.mk:456: testpipeline] Error 1
make[4]: *** [/root/UB2004-64_K5.4.0_Clang10.0.0/x86_64-native-linuxapp-clang/a0a4e391698e4d3493eb55745b7f9ff8/dpdk/mk/rte.subdir.mk:37: test-pipeline] Error 2
  CC test_table_combined.o
  CC config.o
  CC test_table_acl.o
--
dpaa_ethdev.c:(.text+0x2469): undefined reference to `dpaa_port_fmc_init'
  CC test_latencystats.o
  CC test_pdump.o
clang: error: linker command failed with exit code 1 (use -v to see invocation)
make[5]: *** [/root/UB2004-64_K5.4.0_Clang10.0.0/x86_64-native-linuxapp-clang/a0a4e391698e4d3493eb55745b7f9ff8/dpdk/mk/rte.app.mk:456: testpmd] Error 1
make[4]: *** [/root/UB2004-64_K5.4.0_Clang10.0.0/x86_64-native-linuxapp-clang/a0a4e391698e4d3493eb55745b7f9ff8/dpdk/mk/rte.subdir.mk:37: test-pmd] Error 2
  CC test_cmdline.o
  CC test_cmdline_num.o
  CC test_cmdline_etheraddr.o
--
dpaa_ethdev.c:(.text+0x1535): undefined reference to `dpaa_port_vsp_update'
/usr/bin/ld: /root/UB2004-64_K5.4.0_Clang10.0.0/x86_64-native-linuxapp-clang/a0a4e391698e4d3493eb55745b7f9ff8/dpdk/x86_64-native-linuxapp-clang/lib/librte_pmd_dpaa.a(dpaa_ethdev.o): in function `rte_dpaa_probe':
dpaa_ethdev.c:(.text+0x2469): undefined reference to `dpaa_port_fmc_init'
clang: error: linker command failed with exit code 1 (use -v to see invocation)
make[5]: *** [/root/UB2004-64_K5.4.0_Clang10.0.0/x86_64-native-linuxapp-clang/a0a4e391698e4d3493eb55745b7f9ff8/dpdk/mk/rte.app.mk:456: test] Error 1
make[4]: *** [/root/UB2004-64_K5.4.0_Clang10.0.0/x86_64-native-linuxapp-clang/a0a4e391698e4d3493eb55745b7f9ff8/dpdk/mk/rte.subdir.mk:37: test] Error 2
make[3]: *** [/root/UB2004-64_K5.4.0_Clang10.0.0/x86_64-native-linuxapp-clang/a0a4e391698e4d3493eb55745b7f9ff8/dpdk/mk/rte.sdkbuild.mk:53: app] Error 2
make[2]: *** [/root/UB2004-64_K5.4.0_Clang10.0.0/x86_64-native-linuxapp-clang/a0a4e391698e4d3493eb55745b7f9ff8/dpdk/mk/rte.sdkroot.mk:115: all] Error 2
make[1]: *** [/root/UB2004-64_K5.4.0_Clang10.0.0/x86_64-native-linuxapp-clang/a0a4e391698e4d3493eb55745b7f9ff8/dpdk/mk/rte.sdkinstall.mk:61: pre_install] Error 2
make: *** [/root/UB2004-64_K5.4.0_Clang10.0.0/x86_64-native-linuxapp-clang/a0a4e391698e4d3493eb55745b7f9ff8/dpdk/mk/rte.sdkroot.mk:92: install] Error 2


*Makefile Build Failed #15:
OS: UB2004-64
Target: x86_64-native-linuxapp-gcc
dpaa_ethdev.c:(.text.unlikely+0xe90): undefined reference to `dpaa_port_vsp_update'
/usr/bin/ld: /root/UB2004-64_K5.4.0_GCC9.3.0/x86_64-native-linuxapp-gcc/a0a4e391698e4d3493eb55745b7f9ff8/dpdk/x86_64-native-linuxapp-gcc/lib/librte_pmd_dpaa.a(dpaa_ethdev.o): in function `rte_dpaa_probe':
dpaa_ethdev.c:(.text.unlikely+0x1b91): undefined reference to `dpaa_port_fmc_init'
collect2: error: ld returned 1 exit status
make[5]: *** [/root/UB2004-64_K5.4.0_GCC9.3.0/x86_64-native-linuxapp-gcc/a0a4e391698e4d3493eb55745b7f9ff8/dpdk/mk/rte.app.mk:456: cmdline_test] Error 1
make[4]: *** [/root/UB2004-64_K5.4.0_GCC9.3.0/x86_64-native-linuxapp-gcc/a0a4e391698e4d3493eb55745b7f9ff8/dpdk/mk/rte.subdir.mk:37: test-cmdline] Error 2
make[4]: *** Waiting for unfinished jobs....
  CC test_per_lcore.o
  CC runtime.o
--
dpaa_ethdev.c:(.text.unlikely+0xe90): undefined reference to `dpaa_port_vsp_update'
/usr/bin/ld: /root/UB2004-64_K5.4.0_GCC9.3.0/x86_64-native-linuxapp-gcc/a0a4e391698e4d3493eb55745b7f9ff8/dpdk/x86_64-native-linuxapp-gcc/lib/librte_pmd_dpaa.a(dpaa_ethdev.o): in function `rte_dpaa_probe':
dpaa_ethdev.c:(.text.unlikely+0x1b91): undefined reference to `dpaa_port_fmc_init'
collect2: error: ld returned 1 exit status
make[5]: *** [/root/UB2004-64_K5.4.0_GCC9.3.0/x86_64-native-linuxapp-gcc/a0a4e391698e4d3493eb55745b7f9ff8/dpdk/mk/rte.app.mk:456: testacl] Error 1
make[4]: *** [/root/UB2004-64_K5.4.0_GCC9.3.0/x86_64-native-linuxapp-gcc/a0a4e391698e4d3493eb55745b7f9ff8/dpdk/mk/rte.subdir.mk:37: test-acl] Error 2
  CC test_barrier.o
collect2: error: ld returned 1 exit status
make[5]: *** [/root/UB2004-64_K5.4.0_GCC9.3.0/x86_64-native-linuxapp-gcc/a0a4e391698e4d3493eb55745b7f9ff8/dpdk/mk/rte.app.mk:456: dpdk-pdump] Error 1
make[4]: *** [/root/UB2004-64_K5.4.0_GCC9.3.0/x86_64-native-linuxapp-gcc/a0a4e391698e4d3493eb55745b7f9ff8/dpdk/mk/rte.subdir.mk:37: pdump] Error 2
collect2: error: ld returned 1 exit status
  CC test_malloc.o
make[5]: *** [/root/UB2004-64_K5.4.0_GCC9.3.0/x86_64-native-linuxapp-gcc/a0a4e391698e4d3493eb55745b7f9ff8/dpdk/mk/rte.app.mk:456: dpdk-procinfo] Error 1
make[4]: *** [/root/UB2004-64_K5.4.0_GCC9.3.0/x86_64-native-linuxapp-gcc/a0a4e391698e4d3493eb55745b7f9ff8/dpdk/mk/rte.subdir.mk:37: proc-info] Error 2
  CC parameters.o
  CC pipeline_hash.o
/usr/bin/ld: /root/UB2004-64_K5.4.0_GCC9.3.0/x86_64-native-linuxapp-gcc/a0a4e391698e4d3493eb55745b7f9ff8/dpdk/x86_64-native-linuxapp-gcc/lib/librte_pmd_dpaa.a(dpaa_ethdev.o): in function `dpaa_eth_rx_queue_setup':
--
/usr/bin/ld: /root/UB2004-64_K5.4.0_GCC9.3.0/x86_64-native-linuxapp-gcc/a0a4e391698e4d3493eb55745b7f9ff8/dpdk/x86_64-native-linuxapp-gcc/lib/librte_pmd_dpaa.a(dpaa_ethdev.o): in function `rte_dpaa_probe':
dpaa_ethdev.c:(.text.unlikely+0x1b91): undefined reference to `dpaa_port_fmc_init'
  CC test_cycles.o
collect2: error: ld returned 1 exit status
make[5]: *** [/root/UB2004-64_K5.4.0_GCC9.3.0/x86_64-native-linuxapp-gcc/a0a4e391698e4d3493eb55745b7f9ff8/dpdk/mk/rte.app.mk:456: testsad] Error 1
make[4]: *** [/root/UB2004-64_K5.4.0_GCC9.3.0/x86_64-native-linuxapp-gcc/a0a4e391698e4d3493eb55745b7f9ff8/dpdk/mk/rte.subdir.mk:37: test-sad] Error 2
  CC cmdline.o
  CC pipeline_lpm.o
collect2: error: ld returned 1 exit status
make[5]: *** [/root/UB2004-64_K5.4.0_GCC9.3.0/x86_64-native-linuxapp-gcc/a0a4e391698e4d3493eb55745b7f9ff8/dpdk/mk/rte.app.mk:456: testfib] Error 1
make[4]: *** [/root/UB2004-64_K5.4.0_GCC9.3.0/x86_64-native-linuxapp-gcc/a0a4e391698e4d3493eb55745b7f9ff8/dpdk/mk/rte.subdir.mk:37: test-fib] Error 2
  CC test_mcslock.o
  CC pipeline_lpm_ipv6.o
  CC test_spinlock.o
--
dpaa_ethdev.c:(.text.unlikely+0x1b91): undefined reference to `dpaa_port_fmc_init'
  CC test_ring_mt_peek_stress.o
  CC iofwd.o
collect2: error: ld returned 1 exit status
collect2: error: ld returned 1 exit status
make[5]: *** [/root/UB2004-64_K5.4.0_GCC9.3.0/x86_64-native-linuxapp-gcc/a0a4e391698e4d3493eb55745b7f9ff8/dpdk/mk/rte.app.mk:456: dpdk-test-flow-perf] Error 1
make[4]: *** [/root/UB2004-64_K5.4.0_GCC9.3.0/x86_64-native-linuxapp-gcc/a0a4e391698e4d3493eb55745b7f9ff8/dpdk/mk/rte.subdir.mk:37: test-flow-perf] Error 2
make[5]: *** [/root/UB2004-64_K5.4.0_GCC9.3.0/x86_64-native-linuxapp-gcc/a0a4e391698e4d3493eb55745b7f9ff8/dpdk/mk/rte.app.mk:456: testpipeline] Error 1
make[4]: *** [/root/UB2004-64_K5.4.0_GCC9.3.0/x86_64-native-linuxapp-gcc/a0a4e391698e4d3493eb55745b7f9ff8/dpdk/mk/rte.subdir.mk:37: test-pipeline] Error 2
  CC test_ring_rts_stress.o
  CC test_ring_st_peek_stress.o
  CC macfwd.o
--
/usr/bin/ld: /root/UB2004-64_K5.4.0_GCC9.3.0/x86_64-native-linuxapp-gcc/a0a4e391698e4d3493eb55745b7f9ff8/dpdk/x86_64-native-linuxapp-gcc/lib/librte_pmd_dpaa.a(dpaa_ethdev.o): in function `rte_dpaa_probe':
dpaa_ethdev.c:(.text.unlikely+0x1b91): undefined reference to `dpaa_port_fmc_init'
  CC test_hash_multiwriter.o
collect2: error: ld returned 1 exit status
make[5]: *** [/root/UB2004-64_K5.4.0_GCC9.3.0/x86_64-native-linuxapp-gcc/a0a4e391698e4d3493eb55745b7f9ff8/dpdk/mk/rte.app.mk:456: testpmd] Error 1
make[4]: *** [/root/UB2004-64_K5.4.0_GCC9.3.0/x86_64-native-linuxapp-gcc/a0a4e391698e4d3493eb55745b7f9ff8/dpdk/mk/rte.subdir.mk:37: test-pmd] Error 2
  CC test_hash_readwrite.o
  CC test_hash_readwrite_lf_perf.o
  CC test_rib.o
--
dpaa_ethdev.c:(.text.unlikely+0xe90): undefined reference to `dpaa_port_vsp_update'
/usr/bin/ld: /root/UB2004-64_K5.4.0_GCC9.3.0/x86_64-native-linuxapp-gcc/a0a4e391698e4d3493eb55745b7f9ff8/dpdk/x86_64-native-linuxapp-gcc/lib/librte_pmd_dpaa.a(dpaa_ethdev.o): in function `rte_dpaa_probe':
dpaa_ethdev.c:(.text.unlikely+0x1b91): undefined reference to `dpaa_port_fmc_init'
collect2: error: ld returned 1 exit status
make[5]: *** [/root/UB2004-64_K5.4.0_GCC9.3.0/x86_64-native-linuxapp-gcc/a0a4e391698e4d3493eb55745b7f9ff8/dpdk/mk/rte.app.mk:456: test] Error 1
make[4]: *** [/root/UB2004-64_K5.4.0_GCC9.3.0/x86_64-native-linuxapp-gcc/a0a4e391698e4d3493eb55745b7f9ff8/dpdk/mk/rte.subdir.mk:37: test] Error 2
make[3]: *** [/root/UB2004-64_K5.4.0_GCC9.3.0/x86_64-native-linuxapp-gcc/a0a4e391698e4d3493eb55745b7f9ff8/dpdk/mk/rte.sdkbuild.mk:53: app] Error 2
make[2]: *** [/root/UB2004-64_K5.4.0_GCC9.3.0/x86_64-native-linuxapp-gcc/a0a4e391698e4d3493eb55745b7f9ff8/dpdk/mk/rte.sdkroot.mk:115: all] Error 2
make[1]: *** [/root/UB2004-64_K5.4.0_GCC9.3.0/x86_64-native-linuxapp-gcc/a0a4e391698e4d3493eb55745b7f9ff8/dpdk/mk/rte.sdkinstall.mk:61: pre_install] Error 2
make: *** [/root/UB2004-64_K5.4.0_GCC9.3.0/x86_64-native-linuxapp-gcc/a0a4e391698e4d3493eb55745b7f9ff8/dpdk/mk/rte.sdkroot.mk:92: install] Error 2


*Makefile Build Failed #16:
OS: UB2004-64
Target: x86_64-native-linuxapp-icc
dpaa_ethdev.c:(.text+0x12ca): undefined reference to `dpaa_port_vsp_update'
ld: /root/UB2004-64_K5.4.0_ICC19.1.0/x86_64-native-linuxapp-icc/a0a4e391698e4d3493eb55745b7f9ff8/dpdk/x86_64-native-linuxapp-icc/lib/librte_pmd_dpaa.a(dpaa_ethdev.o): in function `rte_dpaa_probe':
dpaa_ethdev.c:(.text+0x2372): undefined reference to `dpaa_port_fmc_init'
make[5]: *** [/root/UB2004-64_K5.4.0_ICC19.1.0/x86_64-native-linuxapp-icc/a0a4e391698e4d3493eb55745b7f9ff8/dpdk/mk/rte.app.mk:456: dpdk-procinfo] Error 1
make[4]: *** [/root/UB2004-64_K5.4.0_ICC19.1.0/x86_64-native-linuxapp-icc/a0a4e391698e4d3493eb55745b7f9ff8/dpdk/mk/rte.subdir.mk:37: proc-info] Error 2
make[4]: *** Waiting for unfinished jobs....
  CC test_byteorder.o
make[5]: *** [/root/UB2004-64_K5.4.0_ICC19.1.0/x86_64-native-linuxapp-icc/a0a4e391698e4d3493eb55745b7f9ff8/dpdk/mk/rte.app.mk:456: testsad] Error 1
make[4]: *** [/root/UB2004-64_K5.4.0_ICC19.1.0/x86_64-native-linuxapp-icc/a0a4e391698e4d3493eb55745b7f9ff8/dpdk/mk/rte.subdir.mk:37: test-sad] Error 2
  CC test_per_lcore.o
make[5]: *** [/root/UB2004-64_K5.4.0_ICC19.1.0/x86_64-native-linuxapp-icc/a0a4e391698e4d3493eb55745b7f9ff8/dpdk/mk/rte.app.mk:456: testacl] Error 1
make[4]: *** [/root/UB2004-64_K5.4.0_ICC19.1.0/x86_64-native-linuxapp-icc/a0a4e391698e4d3493eb55745b7f9ff8/dpdk/mk/rte.subdir.mk:37: test-acl] Error 2
  CC test_atomic.o
  CC test_barrier.o
  LD dpdk-test-flow-perf
make[5]: *** [/root/UB2004-64_K5.4.0_ICC19.1.0/x86_64-native-linuxapp-icc/a0a4e391698e4d3493eb55745b7f9ff8/dpdk/mk/rte.app.mk:456: cmdline_test] Error 1
make[4]: *** [/root/UB2004-64_K5.4.0_ICC19.1.0/x86_64-native-linuxapp-icc/a0a4e391698e4d3493eb55745b7f9ff8/dpdk/mk/rte.subdir.mk:37: test-cmdline] Error 2
  CC test_malloc.o
  CC test_cycles.o
  CC pipeline_hash.o
--
  CC test_ticketlock.o
  CC test_memory.o
  CC test_memzone.o
make[5]: *** [/root/UB2004-64_K5.4.0_ICC19.1.0/x86_64-native-linuxapp-icc/a0a4e391698e4d3493eb55745b7f9ff8/dpdk/mk/rte.app.mk:456: testfib] Error 1
make[4]: *** [/root/UB2004-64_K5.4.0_ICC19.1.0/x86_64-native-linuxapp-icc/a0a4e391698e4d3493eb55745b7f9ff8/dpdk/mk/rte.subdir.mk:37: test-fib] Error 2
  CC test_bitops.o
  CC test_bitmap.o
  CC pipeline_lpm.o
--
  CC test_ring.o
  CC test_ring_mpmc_stress.o
  CC cmdline.o
make[5]: *** [/root/UB2004-64_K5.4.0_ICC19.1.0/x86_64-native-linuxapp-icc/a0a4e391698e4d3493eb55745b7f9ff8/dpdk/mk/rte.app.mk:456: dpdk-test-flow-perf] Error 1
make[4]: *** [/root/UB2004-64_K5.4.0_ICC19.1.0/x86_64-native-linuxapp-icc/a0a4e391698e4d3493eb55745b7f9ff8/dpdk/mk/rte.subdir.mk:37: test-flow-perf] Error 2
  CC cmdline_flow.o
  CC test_ring_hts_stress.o
  CC test_ring_perf.o
--
dpaa_ethdev.c:(.text+0x2372): undefined reference to `dpaa_port_fmc_init'
  CC test_ring_rts_stress.o
  CC cmdline_mtr.o
make[5]: *** [/root/UB2004-64_K5.4.0_ICC19.1.0/x86_64-native-linuxapp-icc/a0a4e391698e4d3493eb55745b7f9ff8/dpdk/mk/rte.app.mk:456: dpdk-pdump] Error 1
make[4]: *** [/root/UB2004-64_K5.4.0_ICC19.1.0/x86_64-native-linuxapp-icc/a0a4e391698e4d3493eb55745b7f9ff8/dpdk/mk/rte.subdir.mk:37: pdump] Error 2
  CC cmdline_tm.o
  CC test_ring_st_peek_stress.o
  CC test_ring_stress.o
--
  CC iofwd.o
  CC test_pmd_perf.o
  CC macfwd.o
make[5]: *** [/root/UB2004-64_K5.4.0_ICC19.1.0/x86_64-native-linuxapp-icc/a0a4e391698e4d3493eb55745b7f9ff8/dpdk/mk/rte.app.mk:456: testpipeline] Error 1
make[4]: *** [/root/UB2004-64_K5.4.0_ICC19.1.0/x86_64-native-linuxapp-icc/a0a4e391698e4d3493eb55745b7f9ff8/dpdk/mk/rte.subdir.mk:37: test-pipeline] Error 2
  CC test_table.o
  CC test_table_pipeline.o
  CC test_table_tables.o
--
dpaa_ethdev.c:(.text+0x12ca): undefined reference to `dpaa_port_vsp_update'
ld: /root/UB2004-64_K5.4.0_ICC19.1.0/x86_64-native-linuxapp-icc/a0a4e391698e4d3493eb55745b7f9ff8/dpdk/x86_64-native-linuxapp-icc/lib/librte_pmd_dpaa.a(dpaa_ethdev.o): in function `rte_dpaa_probe':
dpaa_ethdev.c:(.text+0x2372): undefined reference to `dpaa_port_fmc_init'
make[5]: *** [/root/UB2004-64_K5.4.0_ICC19.1.0/x86_64-native-linuxapp-icc/a0a4e391698e4d3493eb55745b7f9ff8/dpdk/mk/rte.app.mk:456: testpmd] Error 1
make[4]: *** [/root/UB2004-64_K5.4.0_ICC19.1.0/x86_64-native-linuxapp-icc/a0a4e391698e4d3493eb55745b7f9ff8/dpdk/mk/rte.subdir.mk:37: test-pmd] Error 2
  CC test_hash_readwrite.o
  CC test_hash_readwrite_lf_perf.o
  CC test_rib.o
--
dpaa_ethdev.c:(.text+0x12ca): undefined reference to `dpaa_port_vsp_update'
ld: /root/UB2004-64_K5.4.0_ICC19.1.0/x86_64-native-linuxapp-icc/a0a4e391698e4d3493eb55745b7f9ff8/dpdk/x86_64-native-linuxapp-icc/lib/librte_pmd_dpaa.a(dpaa_ethdev.o): in function `rte_dpaa_probe':
dpaa_ethdev.c:(.text+0x2372): undefined reference to `dpaa_port_fmc_init'
make[5]: *** [/root/UB2004-64_K5.4.0_ICC19.1.0/x86_64-native-linuxapp-icc/a0a4e391698e4d3493eb55745b7f9ff8/dpdk/mk/rte.app.mk:456: test] Error 1
make[4]: *** [/root/UB2004-64_K5.4.0_ICC19.1.0/x86_64-native-linuxapp-icc/a0a4e391698e4d3493eb55745b7f9ff8/dpdk/mk/rte.subdir.mk:37: test] Error 2
make[3]: *** [/root/UB2004-64_K5.4.0_ICC19.1.0/x86_64-native-linuxapp-icc/a0a4e391698e4d3493eb55745b7f9ff8/dpdk/mk/rte.sdkbuild.mk:53: app] Error 2
make[2]: *** [/root/UB2004-64_K5.4.0_ICC19.1.0/x86_64-native-linuxapp-icc/a0a4e391698e4d3493eb55745b7f9ff8/dpdk/mk/rte.sdkroot.mk:115: all] Error 2
make[1]: *** [/root/UB2004-64_K5.4.0_ICC19.1.0/x86_64-native-linuxapp-icc/a0a4e391698e4d3493eb55745b7f9ff8/dpdk/mk/rte.sdkinstall.mk:61: pre_install] Error 2
make: *** [/root/UB2004-64_K5.4.0_ICC19.1.0/x86_64-native-linuxapp-icc/a0a4e391698e4d3493eb55745b7f9ff8/dpdk/mk/rte.sdkroot.mk:92: install] Error 2
DPDK STV team


More information about the test-report mailing list